{"text_format":"1","workbook":"xlsx","n_sheets":4,"sheets":["Steel Eurocode 3","Graph Properties","Section tables new","from author"],"not_rendered":{"charts":4,"images":3,"macros":1,"external_links":0,"defined_names":25,"comments":1,"pivot_tables":0},"unopened":[],"bounds":{"document_bytes":16777216,"sheet_cells":100000,"rows_first":2000,"rows_last":500,"rows_between":2000,"halvings":0,"cell_chars":16384,"cell_head_chars":4096},"cells_cut":0,"cells_raw":0,"read":"whole","date_system":"1900"}

{"sheet":"Steel Eurocode 3","index":0,"n_rows":64,"n_cols":33,"rows_kept":64,"cut":false,"hidden":false,"merged":[[60,21,60,22],[61,21,61,22],[53,2,53,13],[57,2,57,10],[57,11,57,13],[61,2,61,10],[61,11,61,13],[60,15,61,17],[16,9,16,10],[29,21,29,22],[31,12,31,13],[17,12,17,13],[22,7,22,8],[33,21,33,22],[29,15,29,18],[30,15,30,18],[31,15,31,18],[32,15,32,18],[25,7,25,8],[23,7,23,8],[24,7,24,8],[29,2,29,13],[26,5,26,6],[27,5,27,6],[25,5,25,6],[9,2,9,3],[9,4,9,5],[11,2,12,3],[11,4,12,5],[11,7,12,13],[14,2,15,3],[14,4,15,5],[14,7,14,13],[9,11,9,13],[9,7,9,10],[15,9,15,10],[17,9,17,10],[21,2,21,13],[22,3,22,4],[23,3,23,4],[22,10,23,11],[22,12,23,13],[22,5,22,6],[23,5,23,6],[24,3,24,4],[25,3,25,4],[24,5,24,6],[0,1,0,15],[0,16,0,25],[1,16,2,20],[2,21,2,22],[2,23,2,25],[3,16,3,18],[3,19,3,20],[3,21,3,22],[3,23,3,25],[1,3,3,15],[6,31,6,32],[7,2,7,3],[7,4,7,5],[7,11,8,12],[8,2,8,3],[8,4,8,5],[4,3,4,15],[4,16,4,18],[4,19,4,20],[4,21,4,22],[4,23,4,25],[6,2,6,5],[6,7,6,13],[6,15,6,24],[32,2,32,5],[32,6,32,8],[32,12,32,13],[27,3,27,4],[27,7,27,8],[26,3,26,4],[26,7,26,8],[32,21,32,22],[31,21,31,22],[30,21,30,22],[30,9,30,11],[31,9,31,11],[32,9,32,11],[30,12,30,13],[31,2,31,5],[31,6,31,8],[30,2,30,5],[30,6,30,8],[26,12,26,13],[27,12,27,13],[28,2,28,13],[33,6,33,8],[33,12,33,13],[36,8,36,13],[37,8,37,9],[39,8,39,9],[36,2,36,7],[37,2,37,7],[39,2,39,7],[33,9,33,11],[38,2,38,7],[38,8,38,9],[30,24,31,24],[52,2,52,7],[55,2,55,7],[59,8,59,9],[46,8,46,9],[48,8,48,9],[47,8,47,9],[59,11,59,13],[45,2,45,7],[46,2,46,7],[47,2,47,7],[56,2,56,7],[48,2,48,7],[52,8,52,13],[45,8,45,9],[33,15,33,18],[32,24,33,24],[40,8,40,9],[41,8,41,9],[44,8,44,13],[40,2,40,7],[41,2,41,7],[44,2,44,7],[33,2,33,5],[60,8,60,9],[56,8,56,9],[58,2,58,7],[58,8,58,9],[58,11,58,13],[59,2,59,7],[54,8,54,9],[54,11,54,13],[55,8,55,9],[55,11,55,13],[54,2,54,7],[60,2,60,7]]}
[null,"version: 1.1. - FREE LITE VERSION",null,null,null,null,null,null,null,null,null,null,null,null,null,null,"© 2013-2019 Damian Janicki"]
[null,null,null,"YourSpreadsheets™\nYour Office Address Goes Here\nwww.YourSpreadsheets.co.uk\nTel: 010 1234 567890 (example only)",null,null,null,null,null,null,null,null,null,null,null,null,"TEST PROJECT NAME"]
[null,null,null,null,null,null,null,null,null,null,null,null,null,null,null,null,null,null,null,null,null,"Revision",null,"A"]
[null,null,null,null,null,null,null,null,null,null,null,null,null,null,null,null,"Job No:",null,null,123,null,"Page:",null,1]
[null,null,"Member: ","test member (this is unlicensed version of the spreadsheet)",null,null,null,null,null,null,null,null,null,null,null,null,"Prepared By:",null,null,"DJ",null,"Date:",null,{"$f":"TODAY()","v":"2019-08-26"}]
[]
[null,null,"GENERAL DATA",null,null,null,null,"SELECTED SECTION",null,null,null,null,null,null,null,"SECTION PROPERTIES",null,null,null,null,null,null,null,null,null,null,null,null,null,null,null,"SUMMARY:"]
[null,null,"Steel Grade:",null,"S450",null,null,null,null,null,null,null,null,null,null,null,null,null,"h =",{"$f":"OFFSET('Section tables new'!$C$1,$AE$34-1,1)","v":368.2},"mm",null,"Iyy =",{"$f":"OFFSET('Section tables new'!$C$1,$AE$34-1,8)","v":57100},"cm4",null,null,null,null,null,null,{"$f":"I42","v":0.42013065256420723},"moment"]
[null,null,"fy [MPa] =",null,{"$f":"AD16","v":440},null,null,null,null,null,null,null,null,null,null,null,null,null,"b =",{"$f":"OFFSET('Section tables new'!$C$1,$AE$34-1,2)","v":372.6},"mm",null,"Wel,y =",{"$f":"OFFSET('Section tables new'!$C$1,$AE$34-1,9)","v":3100},"cm3",null,null,null,null,null,null,{"$f":"I49","v":0.16913409514568306},"shear"]
[null,null,"E [GPa] =",null,210,null,null,"Classification: ",null,null,null,{"$f":"\"Class \"&MAX(IF((T9-T10-2*T12)/2/T11<9*SQRT(235/E9),1,IF((T9-T10-2*T12)/2/T11<10*SQRT(235/E9),2,IF((T9-T10-2*T12)/2/T11<14*SQRT(235/E9),3,4))),IF((T8-2*T11-2*T12)/T10<72*SQRT(235/E9),1,IF((T8-2*T11-2*T12)/T10<83*SQRT(235/E9),2,IF((T8-2*T11-2*T12)/T10<124*SQRT(235/E9),3,4))))","v":"Class 2"},null,null,null,null,null,null,"tw =",{"$f":"OFFSET('Section tables new'!$C$1,$AE$34-1,3)","v":14.4},"mm",null,"Wpl,y =",{"$f":"OFFSET('Section tables new'!$C$1,$AE$34-1,10)","v":3460},"cm3",null,null,null,null,null,null,{"$f":"I57","v":0.32446839145743311},"wLL only"]
[null,null,null,null,null,null,null,null,null,null,null,null,null,null,null,null,null,null,"tf =",{"$f":"OFFSET('Section tables new'!$C$1,$AE$34-1,4)","v":23.8},"mm",null,"iy =",{"$f":"OFFSET('Section tables new'!$C$1,$AE$34-1,11)","v":15.9},"cm",null,null,null,null,null,null,{"$f":"I61","v":0.86068486634312591},"wDL + LL +  SL"]
[null,null,"SPAN [m] =",null,8,null,null,"INCLUDE S/W    ",null,null,null,null,null,null,null,null,null,null,"r =",{"$f":"OFFSET('Section tables new'!$C$1,$AE$34-1,5)","v":15.2},"mm",null,"Izz =",{"$f":"OFFSET('Section tables new'!$C$1,$AE$34-1,12)","v":20500},"cm4",null,null,"thickness",{"$f":"MAX(T10:T11)","v":23.8}]
[null,null,null,null,null,null,null,null,null,null,null,null,null,null,null,null,null,null,"A =",{"$f":"OFFSET('Section tables new'!$C$1,$AE$34-1,6)","v":22600},"mm2",null,"Wel,z =",{"$f":"OFFSET('Section tables new'!$C$1,$AE$34-1,13)","v":1100},"cm3",null,null,"steel grade","S235",{"$f":"IF($AC$12<=40,235,215)","v":235}]
[null,null,null,null,null,null,null,null,null,null,null,null,null,null,null,null,null,null,"Av =",{"$f":"OFFSET('Section tables new'!$C$1,$AE$34-1,18)*100","v":5930.4799999999977},"mm2",null,"Wpl,z =",{"$f":"OFFSET('Section tables new'!$C$1,$AE$34-1,14)","v":1670},"cm3",null,null,null,"S275",{"$f":"IF($AC$12<=16,275,IF($AC$12<=40,265,IF($AC$12<=63,255,245)))","v":265}]
[null,null,"EFFECTIVE \nLENGTH [m] =",null,8,null,null,"SAFETY FACTORS",null,null,null,null,null,null,null,null,null,null,"It =",{"$f":"OFFSET('Section tables new'!$C$1,$AE$34-1,16)","v":381},"cm4",null,"iz =",{"$f":"OFFSET('Section tables new'!$C$1,$AE$34-1,15)","v":9.5399999999999991},"cm",null,null,null,"S355",{"$f":"IF($AC$12<=16,355,IF($AC$12<=40,345,IF($AC$12<=63,335,325)))","v":345}]
[null,null,null,null,null,null,null,null,"γg =",1.35,null,null,null,null,null,null,null,null,"weight =",{"$f":"OFFSET('Section tables new'!$C$1,$AE$34-1,7)","v":177},"kg/m",null,"Iw (x10-3) =",{"$f":"OFFSET('Section tables new'!$C$1,$AE$34-1,17)","v":6090},"cm6",null,null,null,"S450",{"$f":"IF($AC$12<=40,440,410)","v":440}]
[null,null,null,null,null,null,null,null,"γq =",1.5]
[null,null,null,null,null,null,null,null,"γs =",1.5,null,"ψ0,s =",0.75]
[null,null,null,null,null,null,null,null,null,null,null,null,null,null,null,null,null,null,null,null,null,null,null,null,null,null,null,"steel type","- EU sections -"]
[null,null,null,null,null,null,null,null,null,null,null,null,null,null,null,null,null,null,null,null,null,null,null,null,null,null,null,null,"HD"]
[null,null,null,null,null,null,null,null,null,null,null,null,null,null,null,null,null,null,null,null,null,null,null,null,null,null,null,null,"HE"]
[null,null,"LOADING",null,null,null,null,null,null,null,null,null,null,null,null,null,null,null,null,null,null,null,null,null,null,null,null,null,"HL"]
[null,null,null,"Perm.",null,"Variable",null,"Snow",null,null,"position from left",null,"length",null,null,null,null,null,null,null,null,null,null,null,null,null,null,null,"IPE"]
[null,null,"UDL =",15,null,10,null,5,null,"kN/m",null,null,null,null,null,null,null,null,null,null,null,null,null,null,null,null,null,null,"IPN"]
[null,null,"PUDLa =",15,null,10,null,5,null,"kN/m",1,"m",1,"m",null,null,null,null,null,null,null,null,null,null,null,null,null,null,"UPE"]
[null,null,"PUDLb =",15,null,10,null,5,null,"kN/m",3,"m",1,"m",null,null,null,null,null,null,null,null,null,null,null,null,null,null,"UPN"]
[null,null,"PLa =",15,null,10,null,5,null,"kN",5,"m","~~~~",null,null,null,null,null,null,null,null,null,null,null,null,null,null,null,"- UK sections -"]
[null,null,"PLb =",15,null,10,null,5,null,"kN",6,"m","~~~~",null,null,null,null,null,null,null,null,null,null,null,null,null,null,null,"UB"]
[null,null,"Note: all loads assumed to be non-destabilizing.",null,null,null,null,null,null,null,null,null,null,null,null,null,null,null,null,null,null,null,null,null,null,null,null,null,"UC"]
[null,null,"SUMMARY OF RESULTS",null,null,null,null,null,null,null,null,null,null,null,null,"REACTIONS",null,null,null,"Perm.","Variable","Snow",null,"Total","[kN]",null,null,null,"PFC"]
[null,null,"Max Applied Moment =",null,null,null,{"$f":"FIXED(I38,2)&\" kNm\"","v":"550.49 kNm"},null,null,{"$f":"IF(I41=\"Error\",\"...Error!\",IF(I42>1,\"> \",\"< \")&FIXED(I41,2)&\" kNm\")","v":"< 1,310.29 kNm"},null,null,{"$f":"IF(I42>1,\"NOT OK\",\"OK\")","v":"OK"},null,null,"Left Reaction =",null,null,null,{"$f":"'Graph Properties'!F19","v":97.08},{"$f":"'Graph Properties'!H19","v":60},{"$f":"'Graph Properties'!J19","v":30},null,{"$f":"T31+U31+V31","v":187.07999999999998},"(SLS)",null,null,"selected","UC"]
[null,null,"Max Applied Shear =",null,null,null,{"$f":"FIXED(I46,2)&\" kN\"","v":"254.81 kN"},null,null,{"$f":"IF(I49>1,\"> \",\"< \")&FIXED(I47,2)&\" kN\"","v":"< 1,506.54 kN"},null,null,{"$f":"IF(I49>1,\"NOT OK\",\"OK\")","v":"OK"},null,null,"Right Reaction =",null,null,null,{"$f":"'Graph Properties'!G19","v":97.08},{"$f":"'Graph Properties'!I19","v":60},{"$f":"'Graph Properties'!K19","v":30},null,{"$f":"V32+U32+T32","v":187.07999999999998},null,null,null,null,null,"height of type range"]
[null,null,"Deflection LL =",null,null,null,{"$f":"FIXED(I55,2)&\" mm\"","v":"7.21 mm"},null,null,{"$f":"IF(I57>1,\"> \",\"< \")&FIXED(I56,2)&\" mm\"","v":"< 22.22 mm"},null,null,{"$f":"IF(I57>1,\"NOT OK\",\"OK\")","v":"OK"},null,null,"Left Reaction =",null,null,null,{"$f":"T31*J16","v":131.05799999999999},{"$f":"J17*U31","v":90},{"$f":"J18*M18*V31","v":33.75},null,{"$f":"V33+U33+T33","v":254.80799999999999},"(ULS)",null,null,"row of the type",{"$f":"MATCH(AC31,'Section tables new'!B:B,0)","v":447},{"$f":"INDEX('Section tables new'!B:B,$AC$33+1)","v":46},"row of section"]
[null,null,{"$f":"\"Deflection DL + LL\"&IF(SUM(H24:I28)>0,\" (+SL) =\",\" =\")","v":"Deflection DL + LL (+SL) ="},null,null,null,{"$f":"FIXED(I59,2)&\" mm\"","v":"21.52 mm"},null,null,{"$f":"IF($L$58=$AB$46,\"\",IF(I61>1,\"> \",\"< \")&FIXED(I60,2)&\" mm\")","v":"< 25.00 mm"},null,null,{"$f":"IF($L$58=$AB$46,\"\",IF(I61>1,\"NOT OK\",\"OK\"))","v":"OK"},null,null,"Right Reaction =",null,null,null,{"$f":"J16*T32","v":131.05799999999999},{"$f":"J17*U32","v":90},{"$f":"J18*M18*V32","v":33.75},null,{"$f":"V34+U34+T34","v":254.80799999999999},null,null,null,"selected section",null,"356x368x177",{"$f":"MATCH(AD34,OFFSET('Section tables new'!$B$1,'Steel Eurocode 3'!$AC$33,1,'Steel Eurocode 3'!$AD$33),0)+AC33","v":475}]
[null,null,null,null,null,null,null,null,null,null,null,null,null,null,null,null,null,null,null,null,null,null,null,null,null,null,null,"include selfweight",true,"UDL1d",{"$f":"15+AD36","v":16.77}]
[null,null,null,null,null,null,null,null,null,null,null,null,null,null,null,null,null,null,null,null,null,null,null,null,null,null,null,null,{"$f":"IF(AC35=TRUE,1,0)","v":1},{"$f":"IF(AC36=1,0.01*T16,0)","v":1.77}]
[null,null,"DETAILED RESULTS: ",null,null,null,null,null,"MOMENT (ULS)",null,null,null,null,null,null,null,null,null,null,null,null,null,null,null,null,null,null,"Allowable deflection","(L/200)",{"$f":"8000/200","v":40}]
[null,null,"Actual moment MEd =",null,null,null,null,null,{"$f":"ABS(MIN('Graph Properties'!$C$80:$C$330))","v":550.49099999999999},null,"kNm",null,null,null,null,null,null,null,null,null,null,null,null,null,null,null,null,null,"(L/250)",{"$f":"8000/250","v":32}]
[null,null,"Elastic critical moment  Mcr =",null,null,null,null,null,{"$f":"'Graph Properties'!C40","v":2586.3519894589372},null,"kNm",null,null,null,null,null,null,null,null,null,null,null,null,null,null,null,null,null,"(L/200) or 25",{"$f":"MIN(25,8000/200)","v":25}]
[null,null,"Allowable moment  Mc,Rd =",null,null,null,null,null,{"$f":"IF(I48>1,\"Error\",IF(L10=3,X9*E9/1000,IF(L10=4,X9*E9/1000,X10*E9/1000))*IF(I49>0.5,(1-I48),1))","v":1522.4},null,"kNm",null,null,null,null,null,null,null,null,null,null,null,null,null,null,null,null,null,"(L/250) or 25",{"$f":"MIN(25,8000/250)","v":25}]
[null,null,"Allowable moment  Mb,Rd =",null,null,null,null,null,{"$f":"IF(I40=\"Error\",\"Error\",I40*'Graph Properties'!C46)","v":1310.2852568365508},null,"kNm"]
[null,null,"Usage factor =",null,null,null,null,null,{"$f":"IF(I40=\"Error\",\"Error\",I38/I41)","v":0.42013065256420723},null,null,null,null,null,null,null,null,null,null,null,null,null,null,null,null,null,null,"Display deflection",{"$f":"\"DL + LL\"&IF(SUM(H24:I28)>0,\" (+SL)\",\"\")","v":"DL + LL (+SL)"}]
[null,null,null,null,null,null,null,null,null,null,null,null,null,null,null,null,null,null,null,null,null,null,null,null,null,null,null,null,"LL only"]
[]
[null,null,"DETAILED RESULTS: ",null,null,null,null,null,"SHEAR (ULS)",null,null,null,null,null,null,null,null,null,null,null,null,null,null,null,null,null,null,"consider"]
[null,null,"Actual shear VEd =",null,null,null,null,null,{"$f":"MAX('Graph Properties'!$D$80,-'Graph Properties'!$D$330)","v":254.80800000000022},null,"kN",null,null,null,null,null,null,null,null,null,null,null,null,null,null,null,null,"ignore"]
[null,null,"Allowable shear Vpl,Rd =",null,null,null,null,null,{"$f":"E9*T14/1000/SQRT(3)","v":1506.5442587464238},null,"kN"]
[null,null,"Reduction factor due to shear ρ =",null,null,null,null,null,{"$f":"IF(I49<0.5,1,MAX(0,(2*I46/I47-1)^2))","v":1}]
[null,null,"Usage factor =",null,null,null,null,null,{"$f":"I46/I47","v":0.16913409514568306}]
[]
[]
[]
[null,null,"DETAILED RESULTS: ",null,null,null,null,null,"DEFLECTION (SLS)"]
[null,null,"Variable load deflection:"]
[null,null,"Actual deflection wLL only =",null,null,null,null,null,{"$f":"ABS(MIN('Graph Properties'!$G$80:$G$330))","v":7.210408699054069},null,"mm",{"$f":"\"(L/ \" &(ROUND(8000/I55,0)) & \")\"","v":"(L/ 1110)"}]
[null,null,"Allowable deflection wLL only =",null,null,null,null,null,{"$f":"MIN(8000/$U$61,X61)","v":22.222222222222221},null,"mm",{"$f":"\"(L/\"&$U$61&\")\"&IF($X$61<>$AB$46,\" or \"&X61,\"\")","v":"(L/360)"}]
[null,null,"Usage factor =",null,null,null,null,null,{"$f":"I55/I56","v":0.32446839145743311}]
[null,null,"Variable plus Permanent load deflection:",null,null,null,null,null,null,null,null,"consider"]
[null,null,"Actual deflection wDL + LL (+SL) = ",null,null,null,null,null,{"$f":"ABS(MIN('Graph Properties'!$F$80:$F$330))","v":21.517121658578148},null,"mm",{"$f":"\"(L/ \" &(ROUND(8000/I59,0)) & \")\"","v":"(L/ 372)"}]
[null,null,"Allowable deflection wDL + LL (+SL) =",null,null,null,null,null,{"$f":"IF($L$58=$AB$46,\"N/A\",MIN(8000/$U$62,$X$62))","v":25},null,"mm",{"$f":"\"(L/\"&$U$62&\")\"&IF($X$62<>$AB$46,\" or \"&X62,\"\")","v":"(L/200) or 25"}]
[null,null,"Usage factor =",null,null,null,null,null,{"$f":"IF($L$58=$AB$46,\"N/A\",I59/I60)","v":0.86068486634312591},null,null,null,null,null,null,"DEFLECTION LIMITS",null,null,null,"variable = L/",360,"or global =",null,"ignore","mm"]
[null,null,"Show deflection on the diagram as:",null,null,null,null,null,null,null,null,"DL + LL (+SL)",null,null,null,null,null,null,null,"total = L/",200,{"$f":"IF($L$58=$AB$46,\"N/A\",\"or global =\")","v":"or global ="},null,25,"mm"]
[]
[null,null,"Spreadsheet provided by: www.YourSpreadsheets.co.uk",null,null,null,null,null,null,null,null,null,null,null,null,null,null,null,null,null,null,null,null,null,"calculations are based on Eurocode 3 (EN 1993-1-1: 2005)"]

{"sheet":"Graph Properties","index":1,"n_rows":338,"n_cols":253,"rows_kept":338,"cut":false,"hidden":true,"merged":[]}
[null,null,"p,P","a","b","c","R1","R2","a'","Drawing Max:",{"$f":"MAX(1,15+10+5+C2+MAX('Steel Eurocode 3'!D27+'Steel Eurocode 3'!F27+'Steel Eurocode 3'!H27,'Steel Eurocode 3'!D28+'Steel Eurocode 3'!F28+'Steel Eurocode 3'!H28,'Steel Eurocode 3'!D25+'Steel Eurocode 3'!F25+'Steel Eurocode 3'!H25,'Steel Eurocode 3'!D26+'Steel Eurocode 3'!F26+'Steel Eurocode 3'!H26))","v":61.769999999999996}]
[null,"self weight",{"$f":"'Steel Eurocode 3'!AD36","v":1.77},"-","-","-","-","-","-","Length:",{"$f":"8","v":8}]
[null,"pudl",{"$f":"(C2+15)*'Steel Eurocode 3'!J16+'Steel Eurocode 3'!J17*10+'Steel Eurocode 3'!J18*'Steel Eurocode 3'!M18*5","v":43.264499999999998},"-","-","-","-","-","-","EI",{"$f":"'Steel Eurocode 3'!X8*'Steel Eurocode 3'!E10","v":11991000}]
[null,"pudl,a",{"$f":"'Steel Eurocode 3'!J16*'Steel Eurocode 3'!D25+'Steel Eurocode 3'!J17*'Steel Eurocode 3'!F25+'Steel Eurocode 3'!J18*'Steel Eurocode 3'!M18*'Steel Eurocode 3'!H25","v":40.875},{"$f":"'Steel Eurocode 3'!K25","v":1},{"$f":"1","v":1},{"$f":"8-'Graph Properties'!D4-'Graph Properties'!E4","v":6},{"$f":"C4*E4/(2*8)*(2*F4+E4)","v":33.2109375},{"$f":"-C4*E4/(2*8)*(2*D4+E4)","v":-7.6640625},{"$f":"D4+E4","v":2}]
[null,"pudl,b",{"$f":"'Steel Eurocode 3'!J16*'Steel Eurocode 3'!D26+'Steel Eurocode 3'!J17*'Steel Eurocode 3'!F26+'Steel Eurocode 3'!J18*'Steel Eurocode 3'!M18*'Steel Eurocode 3'!H26","v":40.875},3,{"$f":"'Steel Eurocode 3'!M26","v":1},{"$f":"8-'Graph Properties'!D5-'Graph Properties'!E5","v":4},{"$f":"C5*E5/(2*8)*(2*F5+E5)","v":22.9921875},{"$f":"-C5*E5/(2*8)*(2*D5+E5)","v":-17.8828125},{"$f":"D5+E5","v":4}]
[null,"P,a",{"$f":"'Steel Eurocode 3'!J$16*'Steel Eurocode 3'!D27+'Steel Eurocode 3'!J$17*'Steel Eurocode 3'!F27+'Steel Eurocode 3'!J18*'Steel Eurocode 3'!M18*'Steel Eurocode 3'!H27","v":40.875},{"$f":"'Steel Eurocode 3'!K27","v":5},{"$f":"8-D6","v":3},"-",{"$f":"C6*E6/8","v":15.328125},{"$f":"C6*D6/8","v":25.546875},"-"]
[null,"P,b",{"$f":"'Steel Eurocode 3'!J$16*'Steel Eurocode 3'!D28+'Steel Eurocode 3'!J$17*'Steel Eurocode 3'!F28+'Steel Eurocode 3'!J18*'Steel Eurocode 3'!M18*'Steel Eurocode 3'!H28","v":40.875},{"$f":"'Steel Eurocode 3'!K28","v":6},{"$f":"8-D7","v":2},"-",{"$f":"C7*E7/8","v":10.21875},{"$f":"C7*D7/8","v":30.65625},"-"]
[]
[null,null,null,"Section type:","IPE"]
[null,null,null,"δ type:",{"$f":"IF('Steel Eurocode 3'!L62='Steel Eurocode 3'!AC42,\"max\",2)","v":"max"}]
[]
[]
[null,"G","Q","G+Ψ*Q+Ψ*S","γgG+γqΨqQ+γsΨsQ","GR1","GR2","QR1","QR2","SR1","SR2"]
["pudl",{"$f":"C2+15","v":16.77},{"$f":"10","v":10},{"$f":"B14+C14+B20*'Steel Eurocode 3'!M$18","v":30.52},{"$f":"'Steel Eurocode 3'!J$16*'Graph Properties'!B14+'Steel Eurocode 3'!J$17*'Graph Properties'!C14","v":37.639499999999998},{"$f":"B14*8/2","v":67.08},{"$f":"B14*8/2","v":67.08},{"$f":"C14*8/2","v":40},{"$f":"C14*8/2","v":40},{"$f":"B20*8/2","v":20},{"$f":"B20*8/2","v":20}]
["pudl,a",{"$f":"'Steel Eurocode 3'!D25","v":15},{"$f":"'Steel Eurocode 3'!F25","v":10},{"$f":"B15+C15+B21*'Steel Eurocode 3'!M$18","v":28.75},{"$f":"'Steel Eurocode 3'!J$16*'Graph Properties'!B15+'Steel Eurocode 3'!J$17*'Graph Properties'!C15","v":35.25},{"$f":"B15*$E4/(2*8)*(2*$F4+$E4)","v":12.1875},{"$f":"B15*E4/(2*8)*(2*D4+E4)","v":2.8125},{"$f":"C15*$E4/(2*8)*(2*$F4+$E4)","v":8.125},{"$f":"C15*E4/(2*8)*(2*D4+E4)","v":1.875},{"$f":"B21*$E4/(2*8)*(2*$F4+$E4)","v":4.0625},{"$f":"B21*E4/(2*8)*(2*D4+E4)","v":0.9375}]
["pudl,b",{"$f":"'Steel Eurocode 3'!D26","v":15},{"$f":"'Steel Eurocode 3'!F26","v":10},{"$f":"B16+C16+B22*'Steel Eurocode 3'!M$18","v":28.75},{"$f":"'Steel Eurocode 3'!J$16*'Graph Properties'!B16+'Steel Eurocode 3'!J$17*'Graph Properties'!C16","v":35.25},{"$f":"B16*$E5/(2*8)*(2*$F5+$E5)","v":8.4375},{"$f":"B16*E5/(2*8)*(2*D5+E5)","v":6.5625},{"$f":"C16*$E5/(2*8)*(2*$F5+$E5)","v":5.625},{"$f":"C16*E5/(2*8)*(2*D5+E5)","v":4.375},{"$f":"B22*$E5/(2*8)*(2*$F5+$E5)","v":2.8125},{"$f":"B22*E5/(2*8)*(2*D5+E5)","v":2.1875}]
["P,a",{"$f":"'Steel Eurocode 3'!D27","v":15},{"$f":"'Steel Eurocode 3'!F27","v":10},{"$f":"B17+C17+B23*'Steel Eurocode 3'!M$18","v":28.75},{"$f":"'Steel Eurocode 3'!J$16*'Graph Properties'!B17+'Steel Eurocode 3'!J$17*'Graph Properties'!C17","v":35.25},{"$f":"B17*E6/8","v":5.625},{"$f":"B17*D6/8","v":9.375},{"$f":"C17*E6/8","v":3.75},{"$f":"C17*D6/8","v":6.25},{"$f":"B23*E6/8","v":1.875},{"$f":"B23*D6/8","v":3.125}]
["P,b",{"$f":"'Steel Eurocode 3'!D28","v":15},{"$f":"'Steel Eurocode 3'!F28","v":10},{"$f":"B18+C18+B24*'Steel Eurocode 3'!M$18","v":28.75},{"$f":"'Steel Eurocode 3'!J$16*'Graph Properties'!B18+'Steel Eurocode 3'!J$17*'Graph Properties'!C18","v":35.25},{"$f":"B18*E7/8","v":3.75},{"$f":"B18*D7/8","v":11.25},{"$f":"C18*E7/8","v":2.5},{"$f":"C18*D7/8","v":7.5},{"$f":"B24*E7/8","v":1.25},{"$f":"B24*D7/8","v":3.75}]
[null,"S","Q+S",null,null,{"$f":"SUM(F14:F18)","v":97.08},97.08,60,60,30,30]
["pudl",{"$f":"5","v":5},{"$f":"C14+'Steel Eurocode 3'!M$18*'Graph Properties'!B20","v":13.75}]
["pudl,a",{"$f":"'Steel Eurocode 3'!H25","v":5},{"$f":"C15+'Steel Eurocode 3'!M$18*'Graph Properties'!B21","v":13.75}]
["pudl,b",{"$f":"'Steel Eurocode 3'!H26","v":5},{"$f":"C16+'Steel Eurocode 3'!M$18*'Graph Properties'!B22","v":13.75}]
["P,a",{"$f":"'Steel Eurocode 3'!H27","v":5},{"$f":"C17+'Steel Eurocode 3'!M$18*'Graph Properties'!B23","v":13.75}]
["P,b",{"$f":"'Steel Eurocode 3'!H28","v":5},{"$f":"C18+'Steel Eurocode 3'!M$18*'Graph Properties'!B24","v":13.75}]
[]
[null,"g",{"$f":"SQRT(1-('Steel Eurocode 3'!X12/'Steel Eurocode 3'!X8))","v":0.80061272507477899}]
[null,"Lcr",{"$f":"'Steel Eurocode 3'!$E$15","v":8}]
[null,"C1",{"$f":"1/C44^2","v":1.1317338162064283}]
[null,"C2",0.45900000000000002]
[null,"C3",0.55300000000000005]
[null,"K",1]
[null,"KW",1]
[null,"G",{"$f":"C34/2/(1+0.3)","v":80769230.769230768}]
[null,"E",{"$f":"'Steel Eurocode 3'!E10*10^6","v":210000000}]
[null,"Iz",{"$f":"'Steel Eurocode 3'!X12/100^4","v":2.05E-4}]
[null,"It",{"$f":"'Steel Eurocode 3'!T15/100^4","v":3.8099999999999999E-6}]
[null,"Iw",{"$f":"'Steel Eurocode 3'!X16*1000/100^6","v":6.0900000000000001E-6}]
[null,"zg",0,"Lcr/L"]
[null,"alt",{"$f":"IF(OR(E9=\"UPN\",E9=\"UPE\"),0.76,IF('Steel Eurocode 3'!T8/'Steel Eurocode 3'!T9<=2,0.34,IF('Steel Eurocode 3'!T8/'Steel Eurocode 3'!T9<=3.1,0.49,0.76)))","v":0.34},{"$f":"C27/K2","v":1}]
[null,"Mcr",{"$f":"C28*3.14^2*C34*C35/(C26*C27^2)*(SQRT(C37/C35+(C27^2*C33*C36/(3.14^2*C34*C35))+(C29*C38)^2)-(C29*C38))","v":2586.3519894589372}]
[null,"λlt",{"$f":"SQRT('Steel Eurocode 3'!I40/'Graph Properties'!C40)","v":0.76722116091785686}]
[null,"Φlt",{"$f":"0.5*(1+C39*(C41-0.4)+0.75*C41^2)","v":0.78316321351608964}]
[null,"xlt",{"$f":"MIN(1,1/(C42+SQRT(C42^2-0.75*C41^2)),1/(C41^2))","v":0.83490618068264821}]
[null,"kc",{"$f":"IF(AND(30=0,OR(AND(SUM('Steel Eurocode 3'!D27:I28)<>0,SUM('Steel Eurocode 3'!D28:I28)<>0,PosPLa1=8/2,PosPLb1=8/2),AND(SUM('Steel Eurocode 3'!D27:I27)<>0,SUM('Steel Eurocode 3'!D28:I28)=0,PosPLa1=8/2),AND(SUM('Steel Eurocode 3'!D27:I27)=0,SUM('Steel Eurocode 3'!D28:I28)<>0,PosPLb1=8/2))),0.86,0.94)","v":0.94}]
[null,"f",{"$f":"MIN(1,1-0.5*(1-C44)*(1-2*(C41-0.8)^2))","v":0.97006446713749439}]
[null,"xlt,mod",{"$f":"MIN(1,C43/C45)","v":0.8606708203077712}]
[]
[]
[]
[null,"Loading diagram"]
[null,"Beam",0.1,{"$f":"0.1+8","v":8.1}]
[null,null,0,0]
[]
[null,"Supports",{"$f":"D54-8/25","v":-0.22},0.1,{"$f":"2*D54+-C54","v":0.42000000000000004},{"$f":"C54","v":-0.22},{"$f":"H54+-8/25","v":7.7799999999999994},{"$f":"0.1+8","v":8.1},{"$f":"H54+8/25","v":8.42},{"$f":"G54","v":7.7799999999999994}]
[null,null,{"$f":"C56","v":-12.353999999999999},0,{"$f":"C56","v":-12.353999999999999},{"$f":"C56","v":-12.353999999999999},{"$f":"C56","v":-12.353999999999999},{"$f":"C8","v":0},{"$f":"C56","v":-12.353999999999999},{"$f":"C56","v":-12.353999999999999}]
[null,null,{"$f":"-0.2*MAX(SUM(UDL1d,10,5,PUDL1d,PUDL1l,PUDL1s),SUM(UDL1d,10,5,PLa1d,PLa1l,PLa1s),SUM(UDL1d,10,5,PLb1d,PLb1l,PLb1s))","v":-12.353999999999999}]
[null,"UDL",0.1,0.1,{"$f":"IF(OR(UDL1d>0,10>0),0.1+8,0)","v":8.1},{"$f":"IF(OR(UDL1d>0,10>0),0.1+8,0)","v":8.1}]
[null,"Dead",0,{"$f":"UDL1d","v":16.77},{"$f":"UDL1d","v":16.77},0]
[null,"Live",{"$f":"IF(10>0,UDL1d,0)","v":16.77},{"$f":"IF(10>0,UDL1d+10,0)","v":26.77},{"$f":"IF(10>0,UDL1d+10,0)","v":26.77},{"$f":"IF(10>0,UDL1d,0)","v":16.77}]
[null,"Snow",{"$f":"D59","v":26.77},{"$f":"C60+5","v":31.77},{"$f":"D60","v":31.77},{"$f":"C60","v":26.77}]
[null,"PUDL a",{"$f":"IF(OR(PUDL1d>0,PUDL1l>0),0.1+PosPUDL1,0)","v":1.1000000000000001},{"$f":"IF(OR(PUDL1d>0,PUDL1l>0),0.1+PosPUDL1,0)","v":1.1000000000000001},{"$f":"IF(OR(PUDL1d>0,PUDL1l>0),0.1+PosPUDL1+1,0)","v":2.1},{"$f":"IF(OR(PUDL1d>0,PUDL1l>0),0.1+PosPUDL1+1,0)","v":2.1}]
[null,"Dead",{"$f":"UDL1d+10+5","v":31.77},{"$f":"UDL1d+10+5+PUDL1d","v":46.769999999999996},{"$f":"UDL1d+10+5+PUDL1d","v":46.769999999999996},{"$f":"UDL1d+10+5","v":31.77}]
[null,"Live",{"$f":"UDL1d+10+5+PUDL1d","v":46.769999999999996},{"$f":"UDL1d+10+5+PUDL1d+PUDL1l","v":56.769999999999996},{"$f":"UDL1d+10+5+PUDL1d+PUDL1l","v":56.769999999999996},{"$f":"UDL1d+10+5+PUDL1d","v":46.769999999999996}]
[null,"Snow",{"$f":"D63","v":56.769999999999996},{"$f":"C64+PUDL1s","v":61.769999999999996},{"$f":"D64","v":61.769999999999996},{"$f":"C64","v":56.769999999999996}]
[null,"PUDL b",{"$f":"IF(OR(PUDL2d>0,PUDL2l>0),0.1+3,0)","v":3.1},{"$f":"IF(OR(PUDL2d>0,PUDL2l>0),0.1+3,0)","v":3.1},{"$f":"IF(OR(PUDL2d>0,PUDL2l>0),0.1+3+LePUDL2,0)","v":4.0999999999999996},{"$f":"IF(OR(PUDL2d>0,PUDL2l>0),0.1+3+LePUDL2,0)","v":4.0999999999999996}]
[null,"Dead",{"$f":"UDL1d+10+5","v":31.77},{"$f":"UDL1d+10+5+PUDL2d","v":46.769999999999996},{"$f":"UDL1d+10+5+PUDL2d","v":46.769999999999996},{"$f":"UDL1d+10+5","v":31.77}]
[null,"Live",{"$f":"UDL1d+10+5+PUDL2d","v":46.769999999999996},{"$f":"UDL1d+10+5+PUDL2d+PUDL2l","v":56.769999999999996},{"$f":"UDL1d+10+5+PUDL2d+PUDL2l","v":56.769999999999996},{"$f":"UDL1d+10+5+PUDL2d","v":46.769999999999996}]
[null,"Snow",{"$f":"D67","v":56.769999999999996},{"$f":"C68+PUDL2s","v":61.769999999999996},{"$f":"D68","v":61.769999999999996},{"$f":"C68","v":56.769999999999996}]
[null,"LL a",{"$f":"IF(OR(PLa1d>0,PLa1l>0),0.1+PosPLa1,0)","v":5.0999999999999996},{"$f":"IF(OR(PLa1d>0,PLa1l>0),0.1+PosPLa1,0)","v":5.0999999999999996}]
[null,"Dead",{"$f":"IF(PLa1d>0,UDL1d+10+5,0)","v":31.77},{"$f":"IF(PLa1d>0,UDL1d+10+5+PLa1d,0)","v":46.769999999999996}]
[null,"Live",{"$f":"IF(PLa1l>0,UDL1d+10+5+PLa1d,0)","v":46.769999999999996},{"$f":"IF(PLa1l>0,UDL1d+10+5+PLa1d+PLa1l,0)","v":56.769999999999996}]
[null,"Snow",{"$f":"IF(PLa1s>0,D71,0)","v":56.769999999999996},{"$f":"C72+PLa1s","v":61.769999999999996}]
[null,"LL b",{"$f":"IF(OR(PLb1d>0,PLb1l>0),0.1+PosPLb1,0)","v":6.1},{"$f":"IF(OR(PLb1d>0,PLb1l>0),0.1+PosPLb1,0)","v":6.1}]
[null,"Dead",{"$f":"IF(PLb1d>0,UDL1d+10+5,0)","v":31.77},{"$f":"IF(PLb1d>0,UDL1d+10+5+PLb1d,0)","v":46.769999999999996}]
[null,"Live",{"$f":"IF(PLb1l>0,UDL1d+10+5+PLb1d,0)","v":46.769999999999996},{"$f":"IF(PLb1l>0,UDL1d+10+5+PLb1d+PLb1l,0)","v":56.769999999999996}]
[null,"Snow",{"$f":"IF(PLb1s>0,D75,0)","v":56.769999999999996},{"$f":"C76+PLb1s","v":61.769999999999996}]
[]
[]
[null,"x (m)","[M] KNm","[Q] KNm","δ (mm)","δmax(mm)","δ1(mm)","Qudl,a","Qudl,b","Qpa","Qpb","Qudl","Mudl,a","Mudl,b","Mpa","Mpb","Mudl","δudl,a","δudl,b","δpa","δpb","δudl",null,"Xpa","Xpb","Δx-","Δxcorrect","Δx-","Δxcorrect",null,"δudl,a","δudl,b","δpa","δpb","δudl",null,"Xpa","Xpb","Δx-","Δxcorrect","Δx-","Δxcorrect"]
[1,0,{"$f":"-SUM(M80:Q80)","v":0},{"$f":"H80+I80+J80+K80+L80","v":254.80799999999999},{"$f":"IF(E$10=2,G80,F80)","v":0},{"$f":"-SUM(R80:V80)","v":0},{"$f":"-SUM(AE80:AI80)","v":0},{"$f":"IF(B80>D$4, IF(B80<(D$4+E$4),G$4-C$4*(B80-D$4),H$4),G$4)","v":33.2109375},{"$f":"IF(B80>D$5, IF(B80<(D$5+E$5),G$5-C$5*(B80-D$5),H$5),G$5)","v":22.9921875},{"$f":"IF(B80>D$6,-H$6,G$6)","v":15.328125},{"$f":"IF(B80>D$7,-H$7,G$7)","v":10.21875},{"$f":"'Graph Properties'!C$3*8/2-B80*C$3","v":173.05799999999999},{"$f":"IF(B80>D$4, IF(B80<(D$4+E$4),G$4*B80-C$4/2*(B80-D$4)^2,-(8-B80)*H$4),G$4*B80)","v":0},{"$f":"IF(B80>D$5, IF(B80<(D$5+E$5),G$5*B80-C$5/2*(B80-D$5)^2,-(8-B80)*H$5),G$5*B80)","v":0},{"$f":"IF(B80<D$6,G$6*B80,G$6*B80-C$6*(B80-D$6))","v":0},{"$f":"IF(B80<D$7,G$7*B80,G$7*B80-C$7*(B80-D$7))","v":0},{"$f":"C$3*8/2*'Graph Properties'!B80-'Graph Properties'!C$3*B80^2/2","v":0},{"$f":"(AA80-Z80)*1000*100","v":0},{"$f":"(AC80-AB80)*1000*100","v":0},{"$f":"D$17*$E$6/(6*8*'Steel Eurocode 3'!$X$8*'Steel Eurocode 3'!$E$10)*100*1000*X80","v":0},{"$f":"D$18*E$7/(6*8*'Steel Eurocode 3'!X$8*'Steel Eurocode 3'!E$10)*100*1000*Y80","v":0},{"$f":"D$14*B80*(8^3-2*8*B80^2+B80^3)/24/('Steel Eurocode 3'!E$10*'Steel Eurocode 3'!X$8)*100*1000","v":0},null,{"$f":"IF(B80<D$6,B80*(8^2-B80^2-E$6^2),8/E$6*(B80-D$6)^3+(8^2-E$6^2)*B80-B80^3)","v":0},{"$f":"IF(B80<D$7,B80*(8^2-B80^2-E$7^2),8/E$7*(B80-D$7)^3+(8^2-E$7^2)*B80-B80^3)","v":0},{"$f":"IF(B80<D$4,B80*D$15/(24*K$2*K$3)*((D$4^2)*(2*K$2-D$4)^2-2*(D$4*B80^2)*(2*K$2-D$4)+K$2*B80^3),D$15/(24*K$2*K$3)*(D$4^2*(K$2-B80))*(4*B80*K$2-2*B80^2-D$4^2))","v":0},{"$f":"IF(B80<I$4,B80*D$15/(24*K$2*K$3)*((I$4^2)*(2*K$2-I$4)^2-2*(I$4*B80^2)*(2*K$2-I$4)+K$2*B80^3),D$15/(24*K$2*K$3)*(I$4^2*(K$2-B80))*(4*B80*K$2-2*B80^2-I$4^2))","v":0},{"$f":"IF(B80<D$5,B80*D$16/(24*K$2*K$3)*((D$5^2)*(2*K$2-D$5)^2-2*(D$5*B80^2)*(2*K$2-D$5)+K$2*B80^3),D$16/(24*K$2*K$3)*(D$5^2*(K$2-B80))*(4*B80*K$2-2*B80^2-D$5^2))","v":0},{"$f":"IF(B80<I$5,B80*D$16/(24*K$2*K$3)*((I$5^2)*(2*K$2-I$5)^2-2*(I$5*B80^2)*(2*K$2-I$5)+K$2*B80^3),D$16/(24*K$2*K$3)*(I$5^2*(K$2-B80))*(4*B80*K$2-2*B80^2-I$5^2))","v":0},null,{"$f":"AN80-AM80","v":0},{"$f":"(AP80-AO80)*1000*100","v":0},{"$f":"C$17*$E$6/(6*8*'Steel Eurocode 3'!$X$8*'Steel Eurocode 3'!$E$10)*100*1000*AK80","v":0},{"$f":"C$18*E$7/(6*8*'Steel Eurocode 3'!X$8*'Steel Eurocode 3'!E$10)*100*1000*Y80","v":0},{"$f":"C$14*B80*(8^3-2*8*B80^2+B80^3)/24/('Steel Eurocode 3'!E$10*'Steel Eurocode 3'!X$8)*100*1000","v":0},null,{"$f":"IF(B80<D$6,B80*(8^2-B80^2-E$6^2),8/E$6*(B80-D$6)^3+(8^2-E$6^2)*B80-B80^3)","v":0},{"$f":"IF(B80<D$7,B80*(8^2-B80^2-E$7^2),8/E$7*(B80-D$7)^3+(8^2-E$7^2)*B80-B80^3)","v":0},{"$f":"IF(B80<D$4,B80*C$15/(24*K$2*K$3)*((D$4^2)*(2*K$2-D$4)^2-2*(D$4*B80^2)*(2*K$2-D$4)+K$2*B80^3),C$15/(24*K$2*K$3)*(D$4^2*(K$2-B80))*(4*B80*K$2-2*B80^2-D$4^2))","v":0},{"$f":"IF(B80<I$4,B80*C$15/(24*K$2*K$3)*((I$4^2)*(2*K$2-I$4)^2-2*(I$4*B80^2)*(2*K$2-I$4)+K$2*B80^3),C$15/(24*K$2*K$3)*(I$4^2*(K$2-B80))*(4*B80*K$2-2*B80^2-I$4^2))","v":0},{"$f":"IF(B80<D$5,B80*C$16/(24*K$2*K$3)*((D$5^2)*(2*K$2-D$5)^2-2*(D$5*B80^2)*(2*K$2-D$5)+K$2*B80^3),C$16/(24*K$2*K$3)*(D$5^2*(K$2-B80))*(4*B80*K$2-2*B80^2-D$5^2))","v":0},{"$f":"IF(B80<I$5,B80*C$16/(24*K$2*K$3)*((I$5^2)*(2*K$2-I$5)^2-2*(I$5*B80^2)*(2*K$2-I$5)+K$2*B80^3),C$16/(24*K$2*K$3)*(I$5^2*(K$2-B80))*(4*B80*K$2-2*B80^2-I$5^2))","v":0}]
[2,{"$f":"B80+8/250","v":3.2000000000000001E-2},{"$f":"-SUM(M81:Q81)","v":-8.1317045760000006},{"$f":"H81+I81+J81+K81+L81","v":253.42353599999998},{"$f":"IF(E$10=2,G81,F81)","v":-0.27292906280153845},{"$f":"-SUM(R81:V81)","v":-0.27292906280153845},{"$f":"-SUM(AE81:AI81)","v":-9.1426954301059127E-2},{"$f":"IF(B81>D$4, IF(B81<(D$4+E$4),G$4-C$4*(B81-D$4),H$4),G$4)","v":33.2109375},{"$f":"IF(B81>D$5, IF(B81<(D$5+E$5),G$5-C$5*(B81-D$5),H$5),G$5)","v":22.9921875},{"$f":"IF(B81>D$6,-H$6,G$6)","v":15.328125},{"$f":"IF(B81>D$7,-H$7,G$7)","v":10.21875},{"$f":"'Graph Properties'!C$3*8/2-B81*C$3","v":171.67353599999998},1.0627500000000001,0.73575000000000002,{"$f":"IF(B81<D$6,G$6*B81,G$6*B81-C$6*(B81-D$6))","v":0.49049999999999999},{"$f":"IF(B81<D$7,G$7*B81,G$7*B81-C$7*(B81-D$7))","v":0.32700000000000001},{"$f":"C$3*8/2*'Graph Properties'!B81-'Graph Properties'!C$3*B81^2/2","v":5.5157045760000001},{"$f":"(AA81-Z81)*1000*100","v":2.2336870097017212E-2},{"$f":"(AC81-AB81)*1000*100","v":3.1288355266449824E-2},{"$f":"D$17*$E$6/(6*8*'Steel Eurocode 3'!$X$8*'Steel Eurocode 3'!$E$10)*100*1000*X81","v":2.6373456092069054E-2},{"$f":"D$18*E$7/(6*8*'Steel Eurocode 3'!X$8*'Steel Eurocode 3'!E$10)*100*1000*Y81","v":1.9180725099380094E-2},{"$f":"D$14*B81*(8^3-2*8*B81^2+B81^3)/24/('Steel Eurocode 3'!E$10*'Steel Eurocode 3'!X$8)*100*1000","v":0.17374965624662228},null,1.7599672319999999,1.9199672320000001,8.9899012268089958E-8,3.1326771323826207E-7,6.0776778718260925E-7,9.206513398471075E-7,null,{"$f":"(AN81-AM81)*1000*100","v":7.7693461207016378E-3},{"$f":"(AP81-AO81)*1000*100","v":1.0882906179634723E-2},{"$f":"C$17*$E$6/(6*8*'Steel Eurocode 3'!$X$8*'Steel Eurocode 3'!$E$10)*100*1000*AK81","v":9.1733760320240176E-3},{"$f":"C$18*E$7/(6*8*'Steel Eurocode 3'!X$8*'Steel Eurocode 3'!E$10)*100*1000*Y81","v":6.6715565563061187E-3},{"$f":"C$14*B81*(8^3-2*8*B81^2+B81^3)/24/('Steel Eurocode 3'!E$10*'Steel Eurocode 3'!X$8)*100*1000","v":5.6929769412392618E-2},null,1.7599672319999999,1.9199672320000001,3.126922165846607E-8,1.0896268286548244E-7,2.1139749119395101E-7,3.2022655299029824E-7]
[3,6.4000000000000001E-2,{"$f":"-SUM(M82:Q82)","v":-16.219106304},{"$f":"H82+I82+J82+K82+L82","v":252.039072},{"$f":"IF(E$10=2,G82,F82)","v":-0.54580920717015269},{"$f":"-SUM(R82:V82)","v":-0.54580920717015269},{"$f":"-SUM(AE82:AI82)","v":-0.18283756331559781},{"$f":"IF(B82>D$4, IF(B82<(D$4+E$4),G$4-C$4*(B82-D$4),H$4),G$4)","v":33.2109375},{"$f":"IF(B82>D$5, IF(B82<(D$5+E$5),G$5-C$5*(B82-D$5),H$5),G$5)","v":22.9921875},{"$f":"IF(B82>D$6,-H$6,G$6)","v":15.328125},{"$f":"IF(B82>D$7,-H$7,G$7)","v":10.21875},{"$f":"'Graph Properties'!C$3*8/2-B82*C$3","v":170.289072},2.1255000000000002,1.4715,{"$f":"IF(B82<D$6,G$6*B82,G$6*B82-C$6*(B82-D$6))","v":0.98099999999999998},{"$f":"IF(B82<D$7,G$7*B82,G$7*B82-C$7*(B82-D$7))","v":0.65400000000000003},{"$f":"C$3*8/2*'Graph Properties'!B82-'Graph Properties'!C$3*B82^2/2","v":10.987106303999999},{"$f":"(AA82-Z82)*1000*100","v":4.4667356739777064E-2},{"$f":"(AC82-AB82)*1000*100","v":6.2572291218413817E-2},{"$f":"D$17*$E$6/(6*8*'Steel Eurocode 3'!$X$8*'Steel Eurocode 3'!$E$10)*100*1000*X82","v":5.2743965974480875E-2},{"$f":"D$18*E$7/(6*8*'Steel Eurocode 3'!X$8*'Steel Eurocode 3'!E$10)*100*1000*Y82","v":3.8359486058988694E-2},{"$f":"D$14*B82*(8^3-2*8*B82^2+B82^3)/24/('Steel Eurocode 3'!E$10*'Steel Eurocode 3'!X$8)*100*1000","v":0.34746610717849225},null,3.5197378560000003,3.8397378560000002,1.7972583585244489E-7,6.2639940325021555E-7,1.2153455372951937E-6,1.8410684494793318E-6,null,{"$f":"(AN82-AM82)*1000*100","v":1.5536471909487672E-2},{"$f":"(AP82-AO82)*1000*100","v":2.1764275206404803E-2},{"$f":"C$17*$E$6/(6*8*'Steel Eurocode 3'!$X$8*'Steel Eurocode 3'!$E$10)*100*1000*AK82","v":1.8345727295471608E-2},{"$f":"C$18*E$7/(6*8*'Steel Eurocode 3'!X$8*'Steel Eurocode 3'!E$10)*100*1000*Y82","v":1.3342429933561281E-2},{"$f":"C$14*B82*(8^3-2*8*B82^2+B82^3)/24/('Steel Eurocode 3'!E$10*'Steel Eurocode 3'!X$8)*100*1000","v":0.11384865897067245},null,3.5197378560000003,3.8397378560000002,6.2513334209546044E-8,2.1787805330442276E-7,4.227288825374586E-7,6.4037163460150664E-7]
[4,9.6000000000000002E-2,-24.262205183999999,250.654608,-0.81859175932024764,-0.81859175932024764,-0.27421556191677093,33.2109375,22.9921875,15.328125,10.21875,{"$f":"'Graph Properties'!C$3*8/2-B83*C$3","v":168.904608},3.18825,2.2072500000000002,1.4715,0.98099999999999998,{"$f":"C$3*8/2*'Graph Properties'!B83-'Graph Properties'!C$3*B83^2/2","v":16.414205184},6.6985076474022201E-2,9.3847388541406063E-2,{"$f":"D$17*$E$6/(6*8*'Steel Eurocode 3'!$X$8*'Steel Eurocode 3'!$E$10)*100*1000*X83","v":7.9108583437578192E-2},{"$f":"D$18*E$7/(6*8*'Steel Eurocode 3'!X$8*'Steel Eurocode 3'!E$10)*100*1000*Y83","v":5.7534318739054298E-2},{"$f":"D$14*B83*(8^3-2*8*B83^2+B83^3)/24/('Steel Eurocode 3'!E$10*'Steel Eurocode 3'!X$8)*100*1000","v":0.52111639212818683},null,5.2791152639999996,5.7591152640000001,2.6941058665999503E-7,9.3926135140021707E-7,1.822545517858394E-6,2.7610194032724546E-6,null,2.3299157034442498E-2,3.2642569927445589E-2,{"$f":"C$17*$E$6/(6*8*'Steel Eurocode 3'!$X$8*'Steel Eurocode 3'!$E$10)*100*1000*AK83","v":2.7516029021766326E-2},{"$f":"C$18*E$7/(6*8*'Steel Eurocode 3'!X$8*'Steel Eurocode 3'!E$10)*100*1000*Y83","v":2.0011936952714537E-2},{"$f":"C$14*B83*(8^3-2*8*B83^2+B83^3)/24/('Steel Eurocode 3'!E$10*'Steel Eurocode 3'!X$8)*100*1000","v":0.17074586898040198},null,5.2791152639999996,5.7591152640000001,9.3708030142606954E-8,3.2669960048703194E-7,6.3392887577683256E-7,9.603545750512885E-7]
[5,0.128,-32.261001215999997,249.27014399999999,-1.091228312354223,-1.091228312354223,-0.36554477242465183,33.2109375,22.9921875,15.328125,10.21875,{"$f":"'Graph Properties'!C$3*8/2-B84*C$3","v":167.52014399999999},4.2510000000000003,2.9430000000000001,1.962,1.3080000000000001,{"$f":"C$3*8/2*'Graph Properties'!B84-'Graph Properties'!C$3*B84^2/2","v":21.797001215999998},8.9283645845495238E-2,0.12510922792094067,{"$f":"D$17*$E$6/(6*8*'Steel Eurocode 3'!$X$8*'Steel Eurocode 3'!$E$10)*100*1000*X84","v":0.10546436227170379},{"$f":"D$18*E$7/(6*8*'Steel Eurocode 3'!X$8*'Steel Eurocode 3'!E$10)*100*1000*Y84","v":7.6703258999805415E-2},{"$f":"D$14*B84*(8^3-2*8*B84^2+B84^3)/24/('Steel Eurocode 3'!E$10*'Steel Eurocode 3'!X$8)*100*1000","v":0.6946678173162778},null,7.0379028479999999,7.6779028479999996,3.5888589469657802E-7,1.2517223531515305E-6,2.4291825104917579E-6,3.6802747897011646E-6,null,3.1055181163650518E-2,4.3516253189892391E-2,{"$f":"C$17*$E$6/(6*8*'Steel Eurocode 3'!$X$8*'Steel Eurocode 3'!$E$10)*100*1000*AK84","v":3.6683256442331752E-2},{"$f":"C$18*E$7/(6*8*'Steel Eurocode 3'!X$8*'Steel Eurocode 3'!E$10)*100*1000*Y84","v":2.6679394434714922E-2},{"$f":"C$14*B84*(8^3-2*8*B84^2+B84^3)/24/('Steel Eurocode 3'!E$10*'Steel Eurocode 3'!X$8)*100*1000","v":0.22761068719406224},null,7.0379028479999999,7.6779028479999996,1.2482987641620103E-7,4.3538168805270621E-7,8.449330471275679E-7,1.2800955790264918E-6]
[6,0.16,-40.215494399999997,247.88567999999998,-1.3636707262624748,-1.3636707262624748,-0.45680910460623247,33.2109375,22.9921875,15.328125,10.21875,{"$f":"'Graph Properties'!C$3*8/2-B85*C$3","v":166.13567999999998},5.3137499999999998,3.67875,2.4525000000000001,1.635,{"$f":"C$3*8/2*'Graph Properties'!B85-'Graph Properties'!C$3*B85^2/2","v":27.135494399999999},0.11155668139993886,0.1563533900425319,{"$f":"D$17*$E$6/(6*8*'Steel Eurocode 3'!$X$8*'Steel Eurocode 3'!$E$10)*100*1000*X85","v":0.13180835626720042},{"$f":"D$18*E$7/(6*8*'Steel Eurocode 3'!X$8*'Steel Eurocode 3'!E$10)*100*1000*Y85","v":9.5864342701470567E-2},{"$f":"D$14*B85*(8^3-2*8*B85^2+B85^3)/24/('Steel Eurocode 3'!E$10*'Steel Eurocode 3'!X$8)*100*1000","v":0.86808795585133303},null,8.7959040000000002,9.5959040000000009,4.4808690406693919E-7,1.563653718066328E-6,3.0350738109137415E-6,4.5986077113390605E-6,null,3.8802323965196131E-2,5.4383787840880646E-2,{"$f":"C$17*$E$6/(6*8*'Steel Eurocode 3'!$X$8*'Steel Eurocode 3'!$E$10)*100*1000*AK85","v":4.5846384788591446E-2},{"$f":"C$18*E$7/(6*8*'Steel Eurocode 3'!X$8*'Steel Eurocode 3'!E$10)*100*1000*Y85","v":3.3344119200511495E-2},{"$f":"C$14*B85*(8^3-2*8*B85^2+B85^3)/24/('Steel Eurocode 3'!E$10*'Steel Eurocode 3'!X$8)*100*1000","v":0.28443248881105276},null,8.7959040000000002,9.5959040000000009,1.558563144580658E-7,5.4387955411002709E-7,1.0556778472743448E-6,1.5995157256831512E-6]
[7,0.192,-48.125684735999997,246.501216,-1.6358711279233931,-1.6358711279233931,-0.54799255567542327,33.2109375,22.9921875,15.328125,10.21875,{"$f":"'Graph Properties'!C$3*8/2-B86*C$3","v":164.751216},6.3765000000000001,4.4145000000000003,2.9430000000000001,1.962,{"$f":"C$3*8/2*'Graph Properties'!B86-'Graph Properties'!C$3*B86^2/2","v":32.429684735999999},0.13379779968309566,0.18757545559169381,{"$f":"D$17*$E$6/(6*8*'Steel Eurocode 3'!$X$8*'Steel Eurocode 3'!$E$10)*100*1000*X86","v":0.15813761921441083},{"$f":"D$18*E$7/(6*8*'Steel Eurocode 3'!X$8*'Steel Eurocode 3'!E$10)*100*1000*Y86","v":0.11501560570427823},{"$f":"D$14*B86*(8^3-2*8*B86^2+B86^3)/24/('Steel Eurocode 3'!E$10*'Steel Eurocode 3'!X$8)*100*1000","v":1.0413446477299146},null,10.552922111999999,11.512922112,5.3695127297473117E-7,1.8749292698056878E-6,3.640039228941707E-6,5.515793784858645E-6,null,4.65383651071637E-2,6.5243636727545684E-2,{"$f":"C$17*$E$6/(6*8*'Steel Eurocode 3'!$X$8*'Steel Eurocode 3'!$E$10)*100*1000*AK86","v":5.5004389291968978E-2},{"$f":"C$18*E$7/(6*8*'Steel Eurocode 3'!X$8*'Steel Eurocode 3'!E$10)*100*1000*Y86","v":4.0005428071053291E-2},{"$f":"C$14*B86*(8^3-2*8*B86^2+B86^3)/24/('Steel Eurocode 3'!E$10*'Steel Eurocode 3'!X$8)*100*1000","v":0.34120073647769161},null,10.552922111999999,11.512922112,1.8676566016512384E-7,6.5214931123676086E-7,1.2661006013710282E-6,1.918536968646485E-6]
[8,0.224,-55.991572223999995,245.11675199999999,-1.9077819111033647,-1.9077819111033647,-0.63907921029305326,33.2109375,22.9921875,15.328125,10.21875,{"$f":"'Graph Properties'!C$3*8/2-B87*C$3","v":163.36675199999999},7.4392500000000004,5.1502499999999998,3.4335,2.2890000000000001,{"$f":"C$3*8/2*'Graph Properties'!B87-'Graph Properties'!C$3*B87^2/2","v":37.679572223999998},0.15600061724070832,0.2187710052539405,{"$f":"D$17*$E$6/(6*8*'Steel Eurocode 3'!$X$8*'Steel Eurocode 3'!$E$10)*100*1000*X87","v":0.1844492049036778},{"$f":"D$18*E$7/(6*8*'Steel Eurocode 3'!X$8*'Steel Eurocode 3'!E$10)*100*1000*Y87","v":0.13415508386845693},{"$f":"D$14*B87*(8^3-2*8*B87^2+B87^3)/24/('Steel Eurocode 3'!E$10*'Steel Eurocode 3'!X$8)*100*1000","v":1.2144059998365813},null,12.308760576000001,13.428760576,6.254191737225142E-7,2.1854253461295974E-6,4.2439010884919253E-6,6.4316111410313301E-6,null,5.4261084257637683E-2,7.6094262697022796E-2,{"$f":"C$17*$E$6/(6*8*'Steel Eurocode 3'!$X$8*'Steel Eurocode 3'!$E$10)*100*1000*AK87","v":6.4156245183887919E-2},{"$f":"C$18*E$7/(6*8*'Steel Eurocode 3'!X$8*'Steel Eurocode 3'!E$10)*100*1000*Y87","v":4.6662637867289351E-2},{"$f":"C$14*B87*(8^3-2*8*B87^2+B87^3)/24/('Steel Eurocode 3'!E$10*'Steel Eurocode 3'!X$8)*100*1000","v":0.39790498028721549},null,12.308760576000001,13.428760576,2.1753710390348319E-7,7.6014794647986005E-7,1.4761395090406697E-6,2.2370821360108976E-6]
[9,0.25600000000000001,-63.813156863999993,243.73228799999998,-2.1793557364567708,-2.1793557364567708,-0.73005324056686949,33.2109375,22.9921875,15.328125,10.21875,{"$f":"'Graph Properties'!C$3*8/2-B88*C$3","v":161.98228799999998},8.5020000000000007,5.8860000000000001,3.9239999999999999,2.6160000000000001,{"$f":"C$3*8/2*'Graph Properties'!B88-'Graph Properties'!C$3*B88^2/2","v":42.885156863999995},0.17815875061851943,0.24993561971478609,{"$f":"D$17*$E$6/(6*8*'Steel Eurocode 3'!$X$8*'Steel Eurocode 3'!$E$10)*100*1000*X88","v":0.21074016712534405},{"$f":"D$18*E$7/(6*8*'Steel Eurocode 3'!X$8*'Steel Eurocode 3'!E$10)*100*1000*Y88","v":0.15328081305423513},{"$f":"D$14*B88*(8^3-2*8*B88^2+B88^3)/24/('Steel Eurocode 3'!E$10*'Steel Eurocode 3'!X$8)*100*1000","v":1.3872403859438862},null,14.063222784000001,15.343222784,7.1343329271175615E-7,2.4950207988969504E-6,4.8464842275795736E-6,7.3458404247274346E-6,null,6.1968261084702408E-2,8.6934128596447308E-2,{"$f":"C$17*$E$6/(6*8*'Steel Eurocode 3'!$X$8*'Steel Eurocode 3'!$E$10)*100*1000*AK88","v":7.3300927695771831E-2},{"$f":"C$18*E$7/(6*8*'Steel Eurocode 3'!X$8*'Steel Eurocode 3'!E$10)*100*1000*Y88","v":5.3315065410168734E-2},{"$f":"C$14*B88*(8^3-2*8*B88^2+B88^3)/24/('Steel Eurocode 3'!E$10*'Steel Eurocode 3'!X$8)*100*1000","v":0.4545348577797792},null,14.063222784000001,15.343222784,2.4815071050843686E-7,8.6783332135546091E-7,1.6857336443755038E-6,2.5550749303399768E-6]
[10,0.28800000000000003,-71.590438656000003,242.347824,-2.450545531525989,-2.450545531525989,-0.82089890605153881,33.2109375,22.9921875,15.328125,10.21875,{"$f":"'Graph Properties'!C$3*8/2-B89*C$3","v":160.597824},9.5647500000000019,6.6217500000000005,4.4145000000000003,2.9430000000000005,{"$f":"C$3*8/2*'Graph Properties'!B89-'Graph Properties'!C$3*B89^2/2","v":48.046438655999999},0.20026581636227178,0.28106487965974497,{"$f":"D$17*$E$6/(6*8*'Steel Eurocode 3'!$X$8*'Steel Eurocode 3'!$E$10)*100*1000*X89","v":0.23700755966975237},{"$f":"D$18*E$7/(6*8*'Steel Eurocode 3'!X$8*'Steel Eurocode 3'!E$10)*100*1000*Y89","v":0.17239082912184142},{"$f":"D$14*B89*(8^3-2*8*B89^2+B89^3)/24/('Steel Eurocode 3'!E$10*'Steel Eurocode 3'!X$8)*100*1000","v":1.5598164467123783},null,15.816112128000002,17.256112128000002,8.0093883044283228E-7,2.8035969940655498E-6,5.4476159983187393E-6,8.2582647949161891E-6,null,6.9657675256442356E-2,9.7761697272954765E-2,{"$f":"C$17*$E$6/(6*8*'Steel Eurocode 3'!$X$8*'Steel Eurocode 3'!$E$10)*100*1000*AK89","v":8.2437412059044299E-2},{"$f":"C$18*E$7/(6*8*'Steel Eurocode 3'!X$8*'Steel Eurocode 3'!E$10)*100*1000*Y89","v":5.9962027520640483E-2},{"$f":"C$14*B89*(8^3-2*8*B89^2+B89^3)/24/('Steel Eurocode 3'!E$10*'Steel Eurocode 3'!X$8)*100*1000","v":0.5110800939424569},null,15.816112128000002,17.256112128000002,2.7858741928446338E-7,9.7516417184888683E-7,1.8948229559369527E-6,2.8724399286665004E-6]
[11,0.32000000000000006,-79.323417600000013,240.96335999999999,-2.7213044907413901,-2.7213044907413901,-0.91160055374864513,33.2109375,22.9921875,15.328125,10.21875,{"$f":"'Graph Properties'!C$3*8/2-B90*C$3","v":159.21335999999999},10.627500000000001,7.3575000000000017,4.9050000000000011,3.2700000000000005,{"$f":"C$3*8/2*'Graph Properties'!B90-'Graph Properties'!C$3*B90^2/2","v":53.16341760000001},0.22231543101770773,0.31215436577433087,{"$f":"D$17*$E$6/(6*8*'Steel Eurocode 3'!$X$8*'Steel Eurocode 3'!$E$10)*100*1000*X90","v":0.26324843632724554},{"$f":"D$18*E$7/(6*8*'Steel Eurocode 3'!X$8*'Steel Eurocode 3'!E$10)*100*1000*Y90","v":0.19148316793150424},{"$f":"D$14*B90*(8^3-2*8*B90^2+B90^3)/24/('Steel Eurocode 3'!E$10*'Steel Eurocode 3'!X$8)*100*1000","v":1.7321030896906018},null,17.567232000000004,19.167232000000002,8.8788350151502534E-7,3.111037811692103E-6,6.0471262669224149E-6,9.1686699246657236E-6,null,7.7327106440941845E-2,0.10857543157368028,{"$f":"C$17*$E$6/(6*8*'Steel Eurocode 3'!$X$8*'Steel Eurocode 3'!$E$10)*100*1000*AK90","v":9.1564673505128882E-2},{"$f":"C$18*E$7/(6*8*'Steel Eurocode 3'!X$8*'Steel Eurocode 3'!E$10)*100*1000*Y90","v":6.6602841019653636E-2},{"$f":"C$14*B90*(8^3-2*8*B90^2+B90^3)/24/('Steel Eurocode 3'!E$10*'Steel Eurocode 3'!X$8)*100*1000","v":0.56753050120924042},null,17.567232000000004,19.167232000000002,3.0882904400522621E-7,1.0821001084146446E-6,2.1033482667556226E-6,3.1891025824924255E-6]
[12,0.35200000000000009,-87.012093696000022,239.57889599999999,-2.9915860754213419,-2.9915860754213419,-1.0021426181066915,33.2109375,22.9921875,15.328125,10.21875,{"$f":"'Graph Properties'!C$3*8/2-B91*C$3","v":157.82889599999999},11.690250000000002,8.0932500000000029,5.3955000000000011,3.5970000000000009,{"$f":"C$3*8/2*'Graph Properties'!B91-'Graph Properties'!C$3*B91^2/2","v":58.236093696000012},0.24430121113057016,0.34319965874405806,{"$f":"D$17*$E$6/(6*8*'Steel Eurocode 3'!$X$8*'Steel Eurocode 3'!$E$10)*100*1000*X91","v":0.28945985088816623},{"$f":"D$18*E$7/(6*8*'Steel Eurocode 3'!X$8*'Steel Eurocode 3'!E$10)*100*1000*Y91","v":0.21055586534345211},{"$f":"D$14*B91*(8^3-2*8*B91^2+B91^3)/24/('Steel Eurocode 3'!E$10*'Steel Eurocode 3'!X$8)*100*1000","v":1.9040694893150953},null,19.316385792000005,21.076385792000004,9.7421753462652571E-7,3.4172296459322275E-6,6.6448474137025006E-6,1.0076844001143081E-5,null,8.4974334306285274E-2,0.11937379434575936,{"$f":"C$17*$E$6/(6*8*'Steel Eurocode 3'!$X$8*'Steel Eurocode 3'!$E$10)*100*1000*AK91","v":0.10068168726544913},{"$f":"C$18*E$7/(6*8*'Steel Eurocode 3'!X$8*'Steel Eurocode 3'!E$10)*100*1000*Y91","v":7.3236822728157236E-2},{"$f":"C$14*B91*(8^3-2*8*B91^2+B91^3)/24/('Steel Eurocode 3'!E$10*'Steel Eurocode 3'!X$8)*100*1000","v":0.62387597946104045},null,19.316385792000005,21.076385792000004,3.3885827291357414E-7,1.1886016159764269E-6,2.3112512743313045E-6,3.5049892177888982E-6]
[13,0.38400000000000012,-94.656466944000016,238.19443199999998,-3.2613440137722072,-3.2613440137722072,-1.0925096210210996,33.2109375,22.9921875,15.328125,10.21875,{"$f":"'Graph Properties'!C$3*8/2-B92*C$3","v":156.44443199999998},12.753000000000004,8.8290000000000024,5.8860000000000019,3.9240000000000013,{"$f":"C$3*8/2*'Graph Properties'!B92-'Graph Properties'!C$3*B92^2/2","v":63.264466944000013},0.2662167732466017,0.37419633925444068,{"$f":"D$17*$E$6/(6*8*'Steel Eurocode 3'!$X$8*'Steel Eurocode 3'!$E$10)*100*1000*X92","v":0.31563885714285733},{"$f":"D$18*E$7/(6*8*'Steel Eurocode 3'!X$8*'Steel Eurocode 3'!E$10)*100*1000*Y92","v":0.22960695721791352},{"$f":"D$14*B92*(8^3-2*8*B92^2+B92^3)/24/('Steel Eurocode 3'!E$10*'Steel Eurocode 3'!X$8)*100*1000","v":2.075685086910394},null,21.063376896000008,22.983376896000006,1.0598936725744312E-6,3.7220614050404483E-6,7.2406143330698057E-6,1.0982577725614212E-5,null,9.2597138520557121E-2,0.13015524843632725,{"$f":"C$17*$E$6/(6*8*'Steel Eurocode 3'!$X$8*'Steel Eurocode 3'!$E$10)*100*1000*AK92","v":0.10978742857142862},{"$f":"C$18*E$7/(6*8*'Steel Eurocode 3'!X$8*'Steel Eurocode 3'!E$10)*100*1000*Y92","v":7.9863289467100348E-2},{"$f":"C$14*B92*(8^3-2*8*B92^2+B92^3)/24/('Steel Eurocode 3'!E$10*'Steel Eurocode 3'!X$8)*100*1000","v":0.68010651602568617},null,21.063376896000008,22.983376896000006,3.6865866872154126E-7,1.2946300539271124E-6,2.5184745506329758E-6,3.8200270349962483E-6]
[14,0.41600000000000015,-102.25653734400002,236.809968,-3.5305323008883454,-3.5305323008883454,-1.1826861718342094,33.2109375,22.9921875,15.328125,10.21875,{"$f":"'Graph Properties'!C$3*8/2-B93*C$3","v":155.059968},13.815750000000005,9.5647500000000036,6.3765000000000018,4.2510000000000012,{"$f":"C$3*8/2*'Graph Properties'!B93-'Graph Properties'!C$3*B93^2/2","v":68.248537344000013},0.28805573391154482,0.40513998799099371,{"$f":"D$17*$E$6/(6*8*'Steel Eurocode 3'!$X$8*'Steel Eurocode 3'!$E$10)*100*1000*X93","v":0.3417825088816614},{"$f":"D$18*E$7/(6*8*'Steel Eurocode 3'!X$8*'Steel Eurocode 3'!E$10)*100*1000*Y93","v":0.24863447941511702},{"$f":"D$14*B93*(8^3-2*8*B93^2+B93^3)/24/('Steel Eurocode 3'!E$10*'Steel Eurocode 3'!X$8)*100*1000","v":2.2469195906890285},null,22.808008704000006,24.888008704000008,1.144867172254747E-6,4.025424511370195E-6,7.8342644335340413E-6,1.1885664313443978E-5,null,0.10019329875184167,0.14091825669251956,{"$f":"C$17*$E$6/(6*8*'Steel Eurocode 3'!$X$8*'Steel Eurocode 3'!$E$10)*100*1000*AK93","v":0.1188808726544909},{"$f":"C$18*E$7/(6*8*'Steel Eurocode 3'!X$8*'Steel Eurocode 3'!E$10)*100*1000*Y93","v":8.648155805743199E-2},{"$f":"C$14*B93*(8^3-2*8*B93^2+B93^3)/24/('Steel Eurocode 3'!E$10*'Steel Eurocode 3'!X$8)*100*1000","v":0.73621218567792535},null,22.808008704000006,24.888008704000008,3.982146686103468E-7,1.4001476561287636E-6,2.7249615420987973E-6,4.1341441090239928E-6]
[15,0.44800000000000018,-109.81230489600003,235.42550399999999,-3.7991051987521076,-3.7991051987521076,-1.2726569673352801,33.2109375,22.9921875,15.328125,10.21875,{"$f":"'Graph Properties'!C$3*8/2-B94*C$3","v":153.67550399999999},14.878500000000006,10.300500000000005,6.8670000000000027,4.5780000000000021,{"$f":"C$3*8/2*'Graph Properties'!B94-'Graph Properties'!C$3*B94^2/2","v":73.18830489600002},0.30981170967114235,0.43602618563922946,{"$f":"D$17*$E$6/(6*8*'Steel Eurocode 3'!$X$8*'Steel Eurocode 3'!$E$10)*100*1000*X94","v":0.3678878598949214},{"$f":"D$18*E$7/(6*8*'Steel Eurocode 3'!X$8*'Steel Eurocode 3'!E$10)*100*1000*Y94","v":0.26763646779529104},{"$f":"D$14*B94*(8^3-2*8*B94^2+B94^3)/24/('Steel Eurocode 3'!E$10*'Steel Eurocode 3'!X$8)*100*1000","v":2.4177429757515232},null,24.550084608000009,26.790084608000011,1.2290958046623864E-6,4.32721290137381E-6,8.4256376377038373E-6,1.2785899494096132E-5,null,0.10776059466822345,0.15166128196147122,{"$f":"C$17*$E$6/(6*8*'Steel Eurocode 3'!$X$8*'Steel Eurocode 3'!$E$10)*100*1000*AK94","v":0.1279609947460596},{"$f":"C$18*E$7/(6*8*'Steel Eurocode 3'!X$8*'Steel Eurocode 3'!E$10)*100*1000*Y94","v":9.3090945320101218E-2},{"$f":"C$14*B94*(8^3-2*8*B94^2+B94^3)/24/('Steel Eurocode 3'!E$10*'Steel Eurocode 3'!X$8)*100*1000","v":0.79218315063942457},null,24.550084608000009,26.790084608000011,4.2751158423039531E-7,1.5051175309126298E-6,2.9306565696361176E-6,4.4472693892508297E-6]
[16,0.4800000000000002,-117.32376960000005,234.04103999999998,-4.0670172362338439,-4.0670172362338439,-1.3624067917604878,33.2109375,22.9921875,15.328125,10.21875,{"$f":"'Graph Properties'!C$3*8/2-B95*C$3","v":152.29103999999998},15.941250000000007,11.036250000000004,7.3575000000000035,4.905000000000002,{"$f":"C$3*8/2*'Graph Properties'!B95-'Graph Properties'!C$3*B95^2/2","v":78.083769600000025},0.33147831707113679,0.46685051288466384,{"$f":"D$17*$E$6/(6*8*'Steel Eurocode 3'!$X$8*'Steel Eurocode 3'!$E$10)*100*1000*X95","v":0.39395196397297993},{"$f":"D$18*E$7/(6*8*'Steel Eurocode 3'!X$8*'Steel Eurocode 3'!E$10)*100*1000*Y95","v":0.28661095821866417},{"$f":"D$14*B95*(8^3-2*8*B95^2+B95^3)/24/('Steel Eurocode 3'!E$10*'Steel Eurocode 3'!X$8)*100*1000","v":2.5881254840863992},null,26.289408000000009,28.689408000000011,1.3125398548911689E-6,4.6273230256025366E-6,9.0145763822867191E-6,1.3683081511133358E-5,null,0.11529680593778673,0.16238278709031789,{"$f":"C$17*$E$6/(6*8*'Steel Eurocode 3'!$X$8*'Steel Eurocode 3'!$E$10)*100*1000*AK95","v":0.13702677007755823},{"$f":"C$18*E$7/(6*8*'Steel Eurocode 3'!X$8*'Steel Eurocode 3'!E$10)*100*1000*Y95","v":9.9690768076057076E-2},{"$f":"C$14*B95*(8^3-2*8*B95^2+B95^3)/24/('Steel Eurocode 3'!E$10*'Steel Eurocode 3'!X$8)*100*1000","v":0.84800966057876781},null,26.289408000000009,28.689408000000011,4.5653560170127622E-7,1.6095036610791434E-6,3.1355048286214677E-6,4.7593326995246467E-6]
[17,0.51200000000000023,-124.79093145600004,232.65657599999997,-4.3342232090918982,-4.3342232090918982,-1.4519205167929288,33.2109375,22.9921875,15.328125,10.21875,{"$f":"'Graph Properties'!C$3*8/2-B96*C$3","v":150.90657599999997},17.004000000000008,11.772000000000006,7.8480000000000034,5.232000000000002,{"$f":"C$3*8/2*'Graph Properties'!B96-'Graph Properties'!C$3*B96^2/2","v":82.934931456000029},0.35304917265727087,0.49760855041280982,{"$f":"D$17*$E$6/(6*8*'Steel Eurocode 3'!$X$8*'Steel Eurocode 3'!$E$10)*100*1000*X96","v":0.41997187490617988},{"$f":"D$18*E$7/(6*8*'Steel Eurocode 3'!X$8*'Steel Eurocode 3'!E$10)*100*1000*Y96","v":0.30555598654546484},{"$f":"D$14*B96*(8^3-2*8*B96^2+B96^3)/24/('Steel Eurocode 3'!E$10*'Steel Eurocode 3'!X$8)*100*1000","v":2.7580376245701728},null,28.025782272000011,30.585782272000014,1.3951621221338232E-6,4.9256538487065318E-6,9.6009256180891267E-6,1.4577011122217225E-5,null,0.12279971222861595,0.17308123492619465,{"$f":"C$17*$E$6/(6*8*'Steel Eurocode 3'!$X$8*'Steel Eurocode 3'!$E$10)*100*1000*AK96","v":0.14607717388041039},{"$f":"C$18*E$7/(6*8*'Steel Eurocode 3'!X$8*'Steel Eurocode 3'!E$10)*100*1000*Y96","v":0.10628034314624862},{"$f":"C$14*B96*(8^3-2*8*B96^2+B96^3)/24/('Steel Eurocode 3'!E$10*'Steel Eurocode 3'!X$8)*100*1000","v":0.90368205261145906},null,28.025782272000011,30.585782272000014,4.8527378161176458E-7,1.7132709038979242E-6,3.3394523889005663E-6,5.0702647381625128E-6]
[18,0.54400000000000026,-132.21379046400006,231.27211199999999,-4.6006781799726095,-4.6006781799726095,-1.5411831015626172,33.2109375,22.9921875,15.328125,10.21875,{"$f":"'Graph Properties'!C$3*8/2-B97*C$3","v":149.52211199999999},18.06675000000001,12.507750000000007,8.3385000000000034,5.5590000000000028,{"$f":"C$3*8/2*'Graph Properties'!B97-'Graph Properties'!C$3*B97^2/2","v":87.741790464000033},0.3745178929752872,0.52829587890918217,{"$f":"D$17*$E$6/(6*8*'Steel Eurocode 3'!$X$8*'Steel Eurocode 3'!$E$10)*100*1000*X97","v":0.44594464648486393},{"$f":"D$18*E$7/(6*8*'Steel Eurocode 3'!X$8*'Steel Eurocode 3'!E$10)*100*1000*Y97","v":0.32446958863592162},{"$f":"D$14*B97*(8^3-2*8*B97^2+B97^3)/24/('Steel Eurocode 3'!E$10*'Steel Eurocode 3'!X$8)*100*1000","v":2.927450172967355},null,29.759010816000014,32.47901081600002,1.4769279196819845E-6,5.2221068494348567E-6,1.0184532810016404E-5,1.5467491599108226E-5,null,0.13026709320879556,0.18375508831623724,{"$f":"C$17*$E$6/(6*8*'Steel Eurocode 3'!$X$8*'Steel Eurocode 3'!$E$10)*100*1000*AK97","v":0.1551111813860396},{"$f":"C$18*E$7/(6*8*'Steel Eurocode 3'!X$8*'Steel Eurocode 3'!E$10)*100*1000*Y97","v":0.11285898735162489},{"$f":"C$14*B97*(8^3-2*8*B97^2+B97^3)/24/('Steel Eurocode 3'!E$10*'Steel Eurocode 3'!X$8)*100*1000","v":0.95919075129991993},null,29.759010816000014,32.47901081600002,5.137140590198207E-7,1.8163849911077762E-6,3.5424461947883147E-6,5.3799970779506874E-6]
[19,0.57600000000000029,-139.59234662400007,229.88764799999998,-4.8663374784103137,-4.8663374784103137,-1.6301795926464857,33.2109375,22.9921875,15.328125,10.21875,{"$f":"'Graph Properties'!C$3*8/2-B98*C$3","v":148.13764799999998},19.129500000000011,13.243500000000006,8.8290000000000042,5.8860000000000028,{"$f":"C$3*8/2*'Graph Properties'!B98-'Graph Properties'!C$3*B98^2/2","v":92.504346624000036},0.39587809457092837,0.55890807905929463,{"$f":"D$17*$E$6/(6*8*'Steel Eurocode 3'!$X$8*'Steel Eurocode 3'!$E$10)*100*1000*X98","v":0.47186733249937485},{"$f":"D$18*E$7/(6*8*'Steel Eurocode 3'!X$8*'Steel Eurocode 3'!E$10)*100*1000*Y98","v":0.34334980035026297},{"$f":"D$14*B98*(8^3-2*8*B98^2+B98^3)/24/('Steel Eurocode 3'!E$10*'Steel Eurocode 3'!X$8)*100*1000","v":3.0963341719304536},null,31.488897024000018,34.36889702400002,1.5578050749261955E-6,5.5165860206354792E-6,1.0765247937072811E-5,1.6354328727665758E-5,null,0.13769672854640988,0.19440281010758084,{"$f":"C$17*$E$6/(6*8*'Steel Eurocode 3'!$X$8*'Steel Eurocode 3'!$E$10)*100*1000*AK98","v":0.16412776782586952},{"$f":"C$18*E$7/(6*8*'Steel Eurocode 3'!X$8*'Steel Eurocode 3'!E$10)*100*1000*Y98","v":0.11942601751313492},{"$f":"C$14*B98*(8^3-2*8*B98^2+B98^3)/24/('Steel Eurocode 3'!E$10*'Steel Eurocode 3'!X$8)*100*1000","v":1.0145262686534906},null,31.488897024000018,34.36889702400002,5.4184524345258977E-7,1.9188125289166886E-6,3.744434065068804E-6,5.6884621661446123E-6]
[20,0.60800000000000032,-146.92659993600009,228.50318399999998,-5.1311567008273409,-5.1311567008273409,-1.7188951240683856,33.2109375,22.9921875,15.328125,10.21875,{"$f":"'Graph Properties'!C$3*8/2-B99*C$3","v":146.75318399999998},20.192250000000012,13.979250000000008,9.319500000000005,6.2130000000000036,{"$f":"C$3*8/2*'Graph Properties'!B99-'Graph Properties'!C$3*B99^2/2","v":97.222599936000051},0.4171233939899372,0.58944073154866194,{"$f":"D$17*$E$6/(6*8*'Steel Eurocode 3'!$X$8*'Steel Eurocode 3'!$E$10)*100*1000*X99","v":0.49773698674005534},{"$f":"D$18*E$7/(6*8*'Steel Eurocode 3'!X$8*'Steel Eurocode 3'!E$10)*100*1000*Y99","v":0.36219465754871738},{"$f":"D$14*B99*(8^3-2*8*B99^2+B99^3)/24/('Steel Eurocode 3'!E$10*'Steel Eurocode 3'!X$8)*100*1000","v":3.2646609309999688},null,33.215244288000015,36.255244288000021,1.6377639293559064E-6,5.8089978692552775E-6,1.1342923492361496E-5,1.7237330807848116E-5,null,0.14508639790954339,0.20502286314736062,{"$f":"C$17*$E$6/(6*8*'Steel Eurocode 3'!$X$8*'Steel Eurocode 3'!$E$10)*100*1000*AK99","v":0.17312590843132358},{"$f":"C$18*E$7/(6*8*'Steel Eurocode 3'!X$8*'Steel Eurocode 3'!E$10)*100*1000*Y99","v":0.12598075045172774},{"$f":"C$14*B99*(8^3-2*8*B99^2+B99^3)/24/('Steel Eurocode 3'!E$10*'Steel Eurocode 3'!X$8)*100*1000","v":1.0696792041284304},null,33.215244288000015,36.255244288000021,5.696570189064023E-7,2.0205209980018361E-6,3.9453646929953041E-6,5.9955933244689104E-6]
[21,0.64000000000000035,-154.21655040000007,227.11871999999997,-5.3950917105340137,-5.3950917105340137,-1.8073149172990863,33.2109375,22.9921875,15.328125,10.21875,{"$f":"'Graph Properties'!C$3*8/2-B100*C$3","v":145.36871999999997},21.255000000000013,14.715000000000009,9.8100000000000058,6.5400000000000036,{"$f":"C$3*8/2*'Graph Properties'!B100-'Graph Properties'!C$3*B100^2/2","v":101.89655040000005},0.43824740777805615,0.61988941706279721,{"$f":"D$17*$E$6/(6*8*'Steel Eurocode 3'!$X$8*'Steel Eurocode 3'!$E$10)*100*1000*X100","v":0.52355066299724828},{"$f":"D$18*E$7/(6*8*'Steel Eurocode 3'!X$8*'Steel Eurocode 3'!E$10)*100*1000*Y100","v":0.38100219609151337},{"$f":"D$14*B100*(8^3-2*8*B100^2+B100^3)/24/('Steel Eurocode 3'!E$10*'Steel Eurocode 3'!X$8)*100*1000","v":3.4324020266043989},null,34.937856000000018,38.137856000000021,1.716777338559476E-6,6.0992514163400373E-6,1.1917414483084542E-5,1.8116308653712514E-5,null,0.15243388096628036,0.21561371028271209,{"$f":"C$17*$E$6/(6*8*'Steel Eurocode 3'!$X$8*'Steel Eurocode 3'!$E$10)*100*1000*AK100","v":0.18210457843382546},{"$f":"C$18*E$7/(6*8*'Steel Eurocode 3'!X$8*'Steel Eurocode 3'!E$10)*100*1000*Y100","v":0.13252250298835244},{"$f":"C$14*B100*(8^3-2*8*B100^2+B100^3)/24/('Steel Eurocode 3'!E$10*'Steel Eurocode 3'!X$8)*100*1000","v":1.124640244627916},null,34.937856000000018,38.137856000000021,5.971399438467743E-7,2.1214787535095778E-6,4.1451876462902757E-6,6.3013247491173962E-6]
[22,0.67200000000000037,-161.46219801600009,225.73425599999999,-5.6580986377286573,-5.6580986377286573,-1.8954242812562767,33.2109375,22.9921875,15.328125,10.21875,{"$f":"'Graph Properties'!C$3*8/2-B101*C$3","v":143.98425599999999},22.317750000000011,15.450750000000008,10.300500000000005,6.8670000000000035,{"$f":"C$3*8/2*'Graph Properties'!B101-'Graph Properties'!C$3*B101^2/2","v":106.52619801600005},0.45924375248102767,0.65024971628721562,{"$f":"D$17*$E$6/(6*8*'Steel Eurocode 3'!$X$8*'Steel Eurocode 3'!$E$10)*100*1000*X101","v":0.54930541506129626},{"$f":"D$18*E$7/(6*8*'Steel Eurocode 3'!X$8*'Steel Eurocode 3'!E$10)*100*1000*Y101","v":0.39977045183887944},{"$f":"D$14*B101*(8^3-2*8*B101^2+B101^3)/24/('Steel Eurocode 3'!E$10*'Steel Eurocode 3'!X$8)*100*1000","v":3.5995293020602381},null,36.656535552000015,40.016535552000022,1.7948206722241687E-6,6.3872581970344451E-6,1.2488578430542914E-5,1.8991075593415071E-5,null,0.15973695738470531,0.22617381436077069,{"$f":"C$17*$E$6/(6*8*'Steel Eurocode 3'!$X$8*'Steel Eurocode 3'!$E$10)*100*1000*AK101","v":0.1910627530647987},{"$f":"C$18*E$7/(6*8*'Steel Eurocode 3'!X$8*'Steel Eurocode 3'!E$10)*100*1000*Y101","v":0.13905059194395805},{"$f":"C$14*B101*(8^3-2*8*B101^2+B101^3)/24/('Steel Eurocode 3'!E$10*'Steel Eurocode 3'!X$8)*100*1000","v":1.179400164502044},null,36.656535552000015,40.016535552000022,6.2428545120840669E-7,2.2216550250554595E-6,4.3438533671453618E-6,6.6055915107530689E-6]
[23,0.7040000000000004,-168.66354278400007,224.34979199999998,-5.920133879497584,-5.920133879497584,-1.9832086123045629,33.2109375,22.9921875,15.328125,10.21875,{"$f":"'Graph Properties'!C$3*8/2-B102*C$3","v":142.59979199999998},23.380500000000012,16.186500000000009,10.791000000000006,7.1940000000000044,{"$f":"C$3*8/2*'Graph Properties'!B102-'Graph Properties'!C$3*B102^2/2","v":111.11154278400005},0.48010604464459483,0.68051720990743125,{"$f":"D$17*$E$6/(6*8*'Steel Eurocode 3'!$X$8*'Steel Eurocode 3'!$E$10)*100*1000*X102","v":0.57499829672254243},{"$f":"D$18*E$7/(6*8*'Steel Eurocode 3'!X$8*'Steel Eurocode 3'!E$10)*100*1000*Y102","v":0.4184974606510441},{"$f":"D$14*B102*(8^3-2*8*B102^2+B102^3)/24/('Steel Eurocode 3'!E$10*'Steel Eurocode 3'!X$8)*100*1000","v":3.7660148675719713},null,38.371086336000026,41.891086336000022,1.8718718141361589E-6,6.6729322605821071E-6,1.30562753701365E-5,1.9861447469210812E-5,null,0.16699340683290254,0.23670163822867171,{"$f":"C$17*$E$6/(6*8*'Steel Eurocode 3'!$X$8*'Steel Eurocode 3'!$E$10)*100*1000*AK102","v":0.19999940755566689},{"$f":"C$18*E$7/(6*8*'Steel Eurocode 3'!X$8*'Steel Eurocode 3'!E$10)*100*1000*Y102","v":0.14556433413949357},{"$f":"C$14*B102*(8^3-2*8*B102^2+B102^3)/24/('Steel Eurocode 3'!E$10*'Steel Eurocode 3'!X$8)*100*1000","v":1.2339498255478283},null,38.371086336000026,41.891086336000022,6.5108584839518567E-7,2.3210199167242112E-6,4.5413131722213915E-6,6.9083295545081086E-6]
[24,0.73600000000000043,-175.82058470400011,222.96532799999997,-6.1811540998151067,-6.1811540998151067,-2.0706533942554706,33.2109375,22.9921875,15.328125,10.21875,{"$f":"'Graph Properties'!C$3*8/2-B103*C$3","v":141.21532799999997},24.443250000000013,16.922250000000009,11.281500000000007,7.5210000000000043,{"$f":"C$3*8/2*'Graph Properties'!B103-'Graph Properties'!C$3*B103^2/2","v":115.65258470400006},0.50082790081450013,0.71068747860895709,{"$f":"D$17*$E$6/(6*8*'Steel Eurocode 3'!$X$8*'Steel Eurocode 3'!$E$10)*100*1000*X103","v":0.600626361771329},{"$f":"D$18*E$7/(6*8*'Steel Eurocode 3'!X$8*'Steel Eurocode 3'!E$10)*100*1000*Y103","v":0.43718125838823596},{"$f":"D$14*B103*(8^3-2*8*B103^2+B103^3)/24/('Steel Eurocode 3'!E$10*'Steel Eurocode 3'!X$8)*100*1000","v":3.9318311002320843},null,40.081311744000025,43.761311744000025,1.9479111621805252E-6,6.9561901703255259E-6,1.3620367851364087E-5,2.0727242637453657E-5,null,0.17420100897895657,0.24719564473355024,{"$f":"C$17*$E$6/(6*8*'Steel Eurocode 3'!$X$8*'Steel Eurocode 3'!$E$10)*100*1000*AK103","v":0.20891351713785353},{"$f":"C$18*E$7/(6*8*'Steel Eurocode 3'!X$8*'Steel Eurocode 3'!E$10)*100*1000*Y103","v":0.15206304639590812},{"$f":"C$14*B103*(8^3-2*8*B103^2+B103^3)/24/('Steel Eurocode 3'!E$10*'Steel Eurocode 3'!X$8)*100*1000","v":1.2882801770092021},null,40.081311744000025,43.761311744000025,6.7753431728018267E-7,2.4195444070697482E-6,4.7375192526483782E-6,7.2094756999838807E-6]
[25,0.76800000000000046,-182.93332377600009,221.58086399999996,-6.4411162295435336,-6.4411162295435336,-2.1577441983674435,33.2109375,22.9921875,15.328125,10.21875,{"$f":"'Graph Properties'!C$3*8/2-B104*C$3","v":139.83086399999996},25.506000000000014,17.658000000000012,11.772000000000007,7.8480000000000043,{"$f":"C$3*8/2*'Graph Properties'!B104-'Graph Properties'!C$3*B104^2/2","v":120.14932377600005},0.52140293753648603,0.74075610307730866,{"$f":"D$17*$E$6/(6*8*'Steel Eurocode 3'!$X$8*'Steel Eurocode 3'!$E$10)*100*1000*X104","v":0.62618666399799894},{"$f":"D$18*E$7/(6*8*'Steel Eurocode 3'!X$8*'Steel Eurocode 3'!E$10)*100*1000*Y104","v":0.45581988091068337},{"$f":"D$14*B104*(8^3-2*8*B104^2+B104^3)/24/('Steel Eurocode 3'!E$10*'Steel Eurocode 3'!X$8)*100*1000","v":4.0969506440210566},null,41.787015168000025,45.627015168000028,2.0229216283412571E-6,7.2369510037061169E-6,1.4180720937823376E-5,2.1588281968596462E-5,null,0.18135754349095165,0.25765429672254209,{"$f":"C$17*$E$6/(6*8*'Steel Eurocode 3'!$X$8*'Steel Eurocode 3'!$E$10)*100*1000*AK104","v":0.21780405704278225},{"$f":"C$18*E$7/(6*8*'Steel Eurocode 3'!X$8*'Steel Eurocode 3'!E$10)*100*1000*Y104","v":0.15854604553415069},{"$f":"C$14*B104*(8^3-2*8*B104^2+B104^3)/24/('Steel Eurocode 3'!E$10*'Steel Eurocode 3'!X$8)*100*1000","v":1.3423822555770171},null,41.787015168000025,45.627015168000028,7.0362491420565471E-7,2.5172003491151712E-6,4.9324246740255219E-6,7.5089676412509431E-6]
[26,0.80000000000000049,-190.0017600000001,220.19639999999998,-6.6999774664331628,-6.6999774664331628,-2.244466683345844,33.2109375,22.9921875,15.328125,10.21875,{"$f":"'Graph Properties'!C$3*8/2-B105*C$3","v":138.44639999999998},26.568750000000016,18.393750000000011,12.262500000000008,8.1750000000000043,{"$f":"C$3*8/2*'Graph Properties'!B105-'Graph Properties'!C$3*B105^2/2","v":124.60176000000006},0.54182477135629525,0.77071866399799904,{"$f":"D$17*$E$6/(6*8*'Steel Eurocode 3'!$X$8*'Steel Eurocode 3'!$E$10)*100*1000*X105","v":0.65167625719289524},{"$f":"D$18*E$7/(6*8*'Steel Eurocode 3'!X$8*'Steel Eurocode 3'!E$10)*100*1000*Y105","v":0.47441136407861484},{"$f":"D$14*B105*(8^3-2*8*B105^2+B105^3)/24/('Steel Eurocode 3'!E$10*'Steel Eurocode 3'!X$8)*100*1000","v":4.2613464098073583},null,43.488000000000028,47.488000000000028,2.0968886387012491E-6,7.5151363522642023E-6,1.4737202207210972E-5,2.2444388847190962E-5,null,0.1884607900369723,0.26807605704278231,{"$f":"C$17*$E$6/(6*8*'Steel Eurocode 3'!$X$8*'Steel Eurocode 3'!$E$10)*100*1000*AK105","v":0.22667000250187658},{"$f":"C$18*E$7/(6*8*'Steel Eurocode 3'!X$8*'Steel Eurocode 3'!E$10)*100*1000*Y105","v":0.16501264837517035},{"$f":"C$14*B105*(8^3-2*8*B105^2+B105^3)/24/('Steel Eurocode 3'!E$10*'Steel Eurocode 3'!X$8)*100*1000","v":1.3962471853890426},null,43.488000000000028,47.488000000000028,7.2935256998304331E-7,2.6139604703527662E-6,5.1259833764212079E-6,7.8067439468490312E-6]
[27,0.83200000000000052,-197.02589337600011,218.81193599999997,-6.9576952751222949,-6.9576952751222949,-2.3308065953429531,33.2109375,22.9921875,15.328125,10.21875,{"$f":"'Graph Properties'!C$3*8/2-B106*C$3","v":137.06193599999997},27.631500000000017,19.129500000000011,12.753000000000007,8.502000000000006,{"$f":"C$3*8/2*'Graph Properties'!B106-'Graph Properties'!C$3*B106^2/2","v":129.00989337600006},0.56208701881967083,0.80057074205654311,{"$f":"D$17*$E$6/(6*8*'Steel Eurocode 3'!$X$8*'Steel Eurocode 3'!$E$10)*100*1000*X106","v":0.67709219514636021},{"$f":"D$18*E$7/(6*8*'Steel Eurocode 3'!X$8*'Steel Eurocode 3'!E$10)*100*1000*Y106","v":0.49295374375225898},{"$f":"D$14*B106*(8^3-2*8*B106^2+B106^3)/24/('Steel Eurocode 3'!E$10*'Steel Eurocode 3'!X$8)*100*1000","v":4.4249915753474616},null,45.184069632000025,49.344069632000028,2.1698001334423053E-6,7.7906703216390127E-6,1.528968175132239E-5,2.3295389171887821E-5,null,0.19550852828510287,0.27845938854140628,{"$f":"C$17*$E$6/(6*8*'Steel Eurocode 3'!$X$8*'Steel Eurocode 3'!$E$10)*100*1000*AK106","v":0.23551032874656005},{"$f":"C$18*E$7/(6*8*'Steel Eurocode 3'!X$8*'Steel Eurocode 3'!E$10)*100*1000*Y106","v":0.17146217173991615},{"$f":"C$14*B106*(8^3-2*8*B106^2+B106^3)/24/('Steel Eurocode 3'!E$10*'Steel Eurocode 3'!X$8)*100*1000","v":1.4498661780299678},null,45.184069632000025,49.344069632000028,7.5471308989297569E-7,2.7097983727440044E-6,5.3181501743730054E-6,8.1027440597870683E-6]
[28,0.86400000000000055,-204.00572390400009,217.42747199999997,-7.2142273871372202,-7.2142273871372202,-2.4167497679579699,33.2109375,22.9921875,15.328125,10.21875,{"$f":"'Graph Properties'!C$3*8/2-B107*C$3","v":135.67747199999997},28.694250000000018,19.865250000000014,13.243500000000008,8.829000000000006,{"$f":"C$3*8/2*'Graph Properties'!B107-'Graph Properties'!C$3*B107^2/2","v":133.37372390400006},0.58218329647235445,0.8303079179384536,{"$f":"D$17*$E$6/(6*8*'Steel Eurocode 3'!$X$8*'Steel Eurocode 3'!$E$10)*100*1000*X107","v":0.70243153164873706},{"$f":"D$18*E$7/(6*8*'Steel Eurocode 3'!X$8*'Steel Eurocode 3'!E$10)*100*1000*Y107","v":0.51144505579184429},{"$f":"D$14*B107*(8^3-2*8*B107^2+B107^3)/24/('Steel Eurocode 3'!E$10*'Steel Eurocode 3'!X$8)*100*1000","v":4.5878595852858313},null,46.875027456000026,51.195027456000034,2.2416465668451352E-6,8.0634795315686796E-6,1.5838032176052052E-5,2.4141111355436589E-5,null,0.20249853790342767,0.28880275406554923,{"$f":"C$17*$E$6/(6*8*'Steel Eurocode 3'!$X$8*'Steel Eurocode 3'!$E$10)*100*1000*AK107","v":0.24432401100825635},{"$f":"C$18*E$7/(6*8*'Steel Eurocode 3'!X$8*'Steel Eurocode 3'!E$10)*100*1000*Y107","v":0.1778939324493371},{"$f":"C$14*B107*(8^3-2*8*B107^2+B107^3)/24/('Steel Eurocode 3'!E$10*'Steel Eurocode 3'!X$8)*100*1000","v":1.5032305325313995},null,46.875027456000026,51.195027456000034,7.797031536852644E-7,2.8046885327195409E-6,5.5088807568876693E-6,8.3969082975431615E-6]
[29,0.89600000000000057,-210.9412515840001,216.04300799999999,-7.4695318008922316,-7.4695318008922316,-2.5022821222370126,33.2109375,22.9921875,15.328125,10.21875,{"$f":"'Graph Properties'!C$3*8/2-B108*C$3","v":134.29300799999999},29.757000000000019,20.601000000000013,13.734000000000009,9.1560000000000059,{"$f":"C$3*8/2*'Graph Properties'!B108-'Graph Properties'!C$3*B108^2/2","v":137.69325158400005},0.60210722086008983,0.85992577232924716,{"$f":"D$17*$E$6/(6*8*'Steel Eurocode 3'!$X$8*'Steel Eurocode 3'!$E$10)*100*1000*X108","v":0.72769132049036833},{"$f":"D$18*E$7/(6*8*'Steel Eurocode 3'!X$8*'Steel Eurocode 3'!E$10)*100*1000*Y108","v":0.52988333605759919},{"$f":"D$14*B108*(8^3-2*8*B108^2+B108^3)/24/('Steel Eurocode 3'!E$10*'Steel Eurocode 3'!X$8)*100*1000","v":4.7499241511549268},null,48.56067686400003,53.040676864000034,2.3124209072893568E-6,8.333493115890255E-6,1.6382128601393278E-5,2.498138632468575E-5,null,0.20942859856003124,0.29910461646234698,{"$f":"C$17*$E$6/(6*8*'Steel Eurocode 3'!$X$8*'Steel Eurocode 3'!$E$10)*100*1000*AK108","v":0.25311002451838899},{"$f":"C$18*E$7/(6*8*'Steel Eurocode 3'!X$8*'Steel Eurocode 3'!E$10)*100*1000*Y108","v":0.18430724732438228},{"$f":"C$14*B108*(8^3-2*8*B108^2+B108^3)/24/('Steel Eurocode 3'!E$10*'Steel Eurocode 3'!X$8)*100*1000","v":1.5563316353718633},null,48.56067686400003,53.040676864000034,8.0432031557890676E-7,2.8986063011792194E-6,5.6981316874411398E-6,8.6891778520646094E-6]
[30,0.9280000000000006,-217.83247641600013,214.65854399999998,-7.7235667816896072,-7.7235667816896072,-2.5873896666731175,33.2109375,22.9921875,15.328125,10.21875,{"$f":"'Graph Properties'!C$3*8/2-B109*C$3","v":132.90854399999998},30.81975000000002,21.336750000000013,14.22450000000001,9.4830000000000059,{"$f":"C$3*8/2*'Graph Properties'!B109-'Graph Properties'!C$3*B109^2/2","v":141.96847641600007},0.62185240852861889,0.88941988591443644,{"$f":"D$17*$E$6/(6*8*'Steel Eurocode 3'!$X$8*'Steel Eurocode 3'!$E$10)*100*1000*X109","v":0.75286861546159678},{"$f":"D$18*E$7/(6*8*'Steel Eurocode 3'!X$8*'Steel Eurocode 3'!E$10)*100*1000*Y109","v":0.54826662040975216},{"$f":"D$14*B109*(8^3-2*8*B109^2+B109^3)/24/('Steel Eurocode 3'!E$10*'Steel Eurocode 3'!X$8)*100*1000","v":4.9111592513752029},null,50.240821248000032,54.880821248000032,2.3821186372534972E-6,8.6006427225396871E-6,1.692184866143831E-5,2.5816047520582675E-5,null,0.21629648992299799,0.3093634385789345,{"$f":"C$17*$E$6/(6*8*'Steel Eurocode 3'!$X$8*'Steel Eurocode 3'!$E$10)*100*1000*AK109","v":0.26186734450838145},{"$f":"C$18*E$7/(6*8*'Steel Eurocode 3'!X$8*'Steel Eurocode 3'!E$10)*100*1000*Y109","v":0.19070143318600072},{"$f":"C$14*B109*(8^3-2*8*B109^2+B109^3)/24/('Steel Eurocode 3'!E$10*'Steel Eurocode 3'!X$8)*100*1000","v":1.6091609604768029},null,50.240821248000032,54.880821248000032,8.2856300426208602E-7,2.9915279034920658E-6,5.8858604039785436E-6,8.9794947897678885E-6]
[31,0.96000000000000063,-224.67939840000011,213.27407999999997,-7.9762908617196295,-7.9762908617196295,-2.6720584972062391,33.2109375,22.9921875,15.328125,10.21875,{"$f":"'Graph Properties'!C$3*8/2-B110*C$3","v":131.52407999999997},31.882500000000022,22.072500000000016,14.715000000000011,9.8100000000000058,{"$f":"C$3*8/2*'Graph Properties'!B110-'Graph Properties'!C$3*B110^2/2","v":146.19939840000006},0.6414124760236849,0.91878583937953473,{"$f":"D$17*$E$6/(6*8*'Steel Eurocode 3'!$X$8*'Steel Eurocode 3'!$E$10)*100*1000*X110","v":0.77796047035276528},{"$f":"D$18*E$7/(6*8*'Steel Eurocode 3'!X$8*'Steel Eurocode 3'!E$10)*100*1000*Y110","v":0.56659294470853183},{"$f":"D$14*B110*(8^3-2*8*B110^2+B110^3)/24/('Steel Eurocode 3'!E$10*'Steel Eurocode 3'!X$8)*100*1000","v":5.0715391312551121},null,51.915264000000036,56.71526400000004,2.4507377533149876E-6,8.8648625135518355E-6,1.7457072504378297E-5,2.6644930898173644E-5,null,0.22309999166041211,0.31957768326244679,{"$f":"C$17*$E$6/(6*8*'Steel Eurocode 3'!$X$8*'Steel Eurocode 3'!$E$10)*100*1000*AK110","v":0.27059494620965746},{"$f":"C$18*E$7/(6*8*'Steel Eurocode 3'!X$8*'Steel Eurocode 3'!E$10)*100*1000*Y110","v":0.19707580685514148},{"$f":"C$14*B110*(8^3-2*8*B110^2+B110^3)/24/('Steel Eurocode 3'!E$10*'Steel Eurocode 3'!X$8)*100*1000","v":1.6617100692185813},null,51.915264000000036,56.71526400000004,8.524305228921697E-7,3.083430439496291E-6,6.0720252189141902E-6,9.2678020515386583E-6]
[32,0.99200000000000066,-231.48201753600014,211.88961599999996,-8.2276628400605674,-8.2276628400605674,-2.7562747972232531,33.2109375,22.9921875,15.328125,10.21875,{"$f":"'Graph Properties'!C$3*8/2-B111*C$3","v":130.13961599999996},32.945250000000023,22.808250000000015,15.20550000000001,10.137000000000008,{"$f":"C$3*8/2*'Graph Properties'!B111-'Graph Properties'!C$3*B111^2/2","v":150.38601753600008},0.66078103989102976,0.94801921341005813,{"$f":"D$17*$E$6/(6*8*'Steel Eurocode 3'!$X$8*'Steel Eurocode 3'!$E$10)*100*1000*X111","v":0.80296393895421625},{"$f":"D$18*E$7/(6*8*'Steel Eurocode 3'!X$8*'Steel Eurocode 3'!E$10)*100*1000*Y111","v":0.5848603448141666},{"$f":"D$14*B111*(8^3-2*8*B111^2+B111^3)/24/('Steel Eurocode 3'!E$10*'Steel Eurocode 3'!X$8)*100*1000","v":5.2310383029910978},null,53.583808512000033,58.543808512000034,2.5182787661501696E-6,9.1260891650604673E-6,1.7987682792503278E-5,2.746787492660386E-5,null,0.22983688344035816,0.32974581336002023,{"$f":"C$17*$E$6/(6*8*'Steel Eurocode 3'!$X$8*'Steel Eurocode 3'!$E$10)*100*1000*AK111","v":0.27929180485364041},{"$f":"C$18*E$7/(6*8*'Steel Eurocode 3'!X$8*'Steel Eurocode 3'!E$10)*100*1000*Y111","v":0.20342968515275356},{"$f":"C$14*B111*(8^3-2*8*B111^2+B111^3)/24/('Steel Eurocode 3'!E$10*'Steel Eurocode 3'!X$8)*100*1000","v":1.7139706104164805},null,53.583808512000033,58.543808512000034,8.7592304909571125E-7,3.174291883499293E-6,6.2565853191315757E-6,9.554043452731778E-6]
[33,1.0240000000000007,-238.22856182400014,209.52415199999993,-8.4776417859931819,-8.4776417859931819,-2.8400248387108129,32.22993749999997,22.9921875,15.328125,10.21875,{"$f":"'Graph Properties'!C$3*8/2-B112*C$3","v":128.75515199999995},33.996228000000023,23.544000000000015,15.69600000000001,10.464000000000008,{"$f":"C$3*8/2*'Graph Properties'!B112-'Graph Properties'!C$3*B112^2/2","v":154.52833382400007},0.67995171999088233,0.97711558869151938,{"$f":"D$17*$E$6/(6*8*'Steel Eurocode 3'!$X$8*'Steel Eurocode 3'!$E$10)*100*1000*X112","v":0.82787607505629279},{"$f":"D$18*E$7/(6*8*'Steel Eurocode 3'!X$8*'Steel Eurocode 3'!E$10)*100*1000*Y112","v":0.60306685658688508},{"$f":"D$14*B112*(8^3-2*8*B112^2+B112^3)/24/('Steel Eurocode 3'!E$10*'Steel Eurocode 3'!X$8)*100*1000","v":5.3896315456676023},null,55.246258176000033,60.366258176000038,2.5847446673894326E-6,9.3842618672982555E-6,1.8513564702202216E-5,2.828472058911741E-5,null,0.23650494608378519,0.33986629171878946,{"$f":"C$17*$E$6/(6*8*'Steel Eurocode 3'!$X$8*'Steel Eurocode 3'!$E$10)*100*1000*AK112","v":0.28795689567175403},{"$f":"C$18*E$7/(6*8*'Steel Eurocode 3'!X$8*'Steel Eurocode 3'!E$10)*100*1000*Y112","v":0.20976238489978608},{"$f":"C$14*B112*(8^3-2*8*B112^2+B112^3)/24/('Steel Eurocode 3'!E$10*'Steel Eurocode 3'!X$8)*100*1000","v":1.7659343203366982},null,55.246258176000033,60.366258176000038,8.9904162343980248E-7,3.2640910842776545E-6,6.4395007659833799E-6,9.8381636831712749E-6]
[34,1.0560000000000007,-244.89025526400013,206.83168799999993,-8.7261871206761867,-8.7261871206761867,-2.9232950106642228,30.92193749999997,22.9921875,15.328125,10.21875,{"$f":"'Graph Properties'!C$3*8/2-B113*C$3","v":127.37068799999997},35.006658000000023,24.279750000000018,16.186500000000009,10.791000000000007,{"$f":"C$3*8/2*'Graph Properties'!B113-'Graph Properties'!C$3*B113^2/2","v":158.62634726400009},0.69891822117343605,1.0060705459094328,{"$f":"D$17*$E$6/(6*8*'Steel Eurocode 3'!$X$8*'Steel Eurocode 3'!$E$10)*100*1000*X113","v":0.85269393244933778},{"$f":"D$18*E$7/(6*8*'Steel Eurocode 3'!X$8*'Steel Eurocode 3'!E$10)*100*1000*Y113","v":0.62121051588691567},{"$f":"D$14*B113*(8^3-2*8*B113^2+B113^3)/24/('Steel Eurocode 3'!E$10*'Steel Eurocode 3'!X$8)*100*1000","v":5.5472939052570638},null,56.902416384000041,62.182416384000042,2.6501401128624262E-6,9.6393223245967875E-6,1.9034605923962983E-5,2.909531138305731E-5,null,0.24310198997336913,0.34993758118588969,{"$f":"C$17*$E$6/(6*8*'Steel Eurocode 3'!$X$8*'Steel Eurocode 3'!$E$10)*100*1000*AK113","v":0.29658919389542182},{"$f":"C$18*E$7/(6*8*'Steel Eurocode 3'!X$8*'Steel Eurocode 3'!E$10)*100*1000*Y113","v":0.21607322291718803},{"$f":"C$14*B113*(8^3-2*8*B113^2+B113^3)/24/('Steel Eurocode 3'!E$10*'Steel Eurocode 3'!X$8)*100*1000","v":1.817593022692354},null,56.902416384000041,62.182416384000042,9.2178786534345252E-7,3.3528077650771435E-6,6.6207324952914723E-6,1.0120108307150369E-5]
[35,1.0880000000000007,-251.46578985600013,204.13922399999993,-8.9732587581551222,-8.9732587581551222,-3.0060718681339917,29.61393749999997,22.9921875,15.328125,10.21875,{"$f":"'Graph Properties'!C$3*8/2-B114*C$3","v":125.98622399999996},35.975232000000027,25.015500000000017,16.67700000000001,11.118000000000007,{"$f":"C$3*8/2*'Graph Properties'!B114-'Graph Properties'!C$3*B114^2/2","v":162.68005785600008},0.71767447428771614,1.0348796657493131,{"$f":"D$17*$E$6/(6*8*'Steel Eurocode 3'!$X$8*'Steel Eurocode 3'!$E$10)*100*1000*X114","v":0.87741456492369341},{"$f":"D$18*E$7/(6*8*'Steel Eurocode 3'!X$8*'Steel Eurocode 3'!E$10)*100*1000*Y114","v":0.63928935857448688},{"$f":"D$14*B114*(8^3-2*8*B114^2+B114^3)/24/('Steel Eurocode 3'!E$10*'Steel Eurocode 3'!X$8)*100*1000","v":5.7040006946199124},null,58.552086528000032,63.992086528000037,2.7144700125093837E-6,9.8912147553865449E-6,1.955069666237235E-5,2.989949331986548E-5,null,0.24962590410007515,0.35995814460845671,{"$f":"C$17*$E$6/(6*8*'Steel Eurocode 3'!$X$8*'Steel Eurocode 3'!$E$10)*100*1000*AK114","v":0.30518767475606723},{"$f":"C$18*E$7/(6*8*'Steel Eurocode 3'!X$8*'Steel Eurocode 3'!E$10)*100*1000*Y114","v":0.22236151602590845},{"$f":"C$14*B114*(8^3-2*8*B114^2+B114^3)/24/('Steel Eurocode 3'!E$10*'Steel Eurocode 3'!X$8)*100*1000","v":1.8689386286434839},null,58.552086528000032,63.992086528000037,9.4416348261195937E-7,3.4404225236127112E-6,6.8002423173469038E-6,1.0399823763431471E-5]
[36,1.1200000000000008,-257.95516560000016,201.44675999999993,-9.2188171307325,-9.2188171307325,-3.0883421410502341,28.30593749999997,22.9921875,15.328125,10.21875,{"$f":"'Graph Properties'!C$3*8/2-B115*C$3","v":124.60175999999996},36.901950000000021,25.751250000000017,17.167500000000011,11.445000000000007,{"$f":"C$3*8/2*'Graph Properties'!B115-'Graph Properties'!C$3*B115^2/2","v":166.68946560000009},0.73621466155171988,1.0635385288966726,{"$f":"D$17*$E$6/(6*8*'Steel Eurocode 3'!$X$8*'Steel Eurocode 3'!$E$10)*100*1000*X115","v":0.902035026269703},{"$f":"D$18*E$7/(6*8*'Steel Eurocode 3'!X$8*'Steel Eurocode 3'!E$10)*100*1000*Y115","v":0.65730142050982743},{"$f":"D$14*B115*(8^3-2*8*B115^2+B115^3)/24/('Steel Eurocode 3'!E$10*'Steel Eurocode 3'!X$8)*100*1000","v":5.8597274935045762},null,60.195072000000039,65.795072000000047,2.7777392766797336E-6,1.0139885892196932E-5,2.0061729636115991E-5,3.0697114925082716E-5,null,0.2560746648875547,0.36992644483362536,{"$f":"C$17*$E$6/(6*8*'Steel Eurocode 3'!$X$8*'Steel Eurocode 3'!$E$10)*100*1000*AK115","v":0.31375131348511404},{"$f":"C$18*E$7/(6*8*'Steel Eurocode 3'!X$8*'Steel Eurocode 3'!E$10)*100*1000*Y115","v":0.22862658104689643},{"$f":"C$14*B115*(8^3-2*8*B115^2+B115^3)/24/('Steel Eurocode 3'!E$10*'Steel Eurocode 3'!X$8)*100*1000","v":1.9199631367970436},null,60.195072000000039,65.795072000000047,9.6617018319295083E-7,3.526916832068498E-6,6.9779929169099091E-6,1.0677257365246163E-5]
[37,1.1520000000000008,-264.35838249600016,198.75429599999993,-9.4628231890087164,-9.4628231890087164,-3.1700927342369027,26.997937499999967,22.9921875,15.328125,10.21875,{"$f":"'Graph Properties'!C$3*8/2-B116*C$3","v":123.21729599999996},37.786812000000026,26.48700000000002,17.658000000000012,11.772000000000007,{"$f":"C$3*8/2*'Graph Properties'!B116-'Graph Properties'!C$3*B116^2/2","v":170.65457049600008},0.75453321659333439,1.0920427160370285,{"$f":"D$17*$E$6/(6*8*'Steel Eurocode 3'!$X$8*'Steel Eurocode 3'!$E$10)*100*1000*X116","v":0.92655237027770909},{"$f":"D$18*E$7/(6*8*'Steel Eurocode 3'!X$8*'Steel Eurocode 3'!E$10)*100*1000*Y116","v":0.6752447375531655},{"$f":"D$14*B116*(8^3-2*8*B116^2+B116^3)/24/('Steel Eurocode 3'!E$10*'Steel Eurocode 3'!X$8)*100*1000","v":6.0144501485474793},null,61.831176192000044,67.591176192000049,2.8399528157229049E-6,1.0385284981656249E-5,2.05676000779785E-5,3.1488027238348784E-5,null,0.2624463362063772,0.37984094470853186,{"$f":"C$17*$E$6/(6*8*'Steel Eurocode 3'!$X$8*'Steel Eurocode 3'!$E$10)*100*1000*AK116","v":0.32227908531398575},{"$f":"C$18*E$7/(6*8*'Steel Eurocode 3'!X$8*'Steel Eurocode 3'!E$10)*100*1000*Y116","v":0.23486773480110099},{"$f":"C$14*B116*(8^3-2*8*B116^2+B116^3)/24/('Steel Eurocode 3'!E$10*'Steel Eurocode 3'!X$8)*100*1000","v":1.9706586332069067},null,61.831176192000044,67.591176192000049,9.8780967503405384E-7,3.6122730370978256E-6,7.1539478532099126E-6,1.0952357300295231E-5]
[38,1.1840000000000008,-270.67544054400014,196.06183199999992,-9.705238401882049,-9.705238401882049,-3.251310727411783,25.689937499999967,22.9921875,15.328125,10.21875,{"$f":"'Graph Properties'!C$3*8/2-B117*C$3","v":121.83283199999997},38.629818000000022,27.222750000000019,18.148500000000013,12.099000000000009,{"$f":"C$3*8/2*'Graph Properties'!B117-'Graph Properties'!C$3*B117^2/2","v":174.57537254400009},0.77262482445033809,1.1203878078558924,{"$f":"D$17*$E$6/(6*8*'Steel Eurocode 3'!$X$8*'Steel Eurocode 3'!$E$10)*100*1000*X117","v":0.95096365073805433},{"$f":"D$18*E$7/(6*8*'Steel Eurocode 3'!X$8*'Steel Eurocode 3'!E$10)*100*1000*Y117","v":0.6931173455647297},{"$f":"D$14*B117*(8^3-2*8*B117^2+B117^3)/24/('Steel Eurocode 3'!E$10*'Steel Eurocode 3'!X$8)*100*1000","v":6.1681447732730348},null,63.460202496000043,69.380202496000052,2.9011155399883259E-6,1.0627363784491707E-5,2.1068205734843365E-5,3.2272083813402289E-5,null,0.26873906937403064,0.38970010708031039,{"$f":"C$17*$E$6/(6*8*'Steel Eurocode 3'!$X$8*'Steel Eurocode 3'!$E$10)*100*1000*AK117","v":0.33076996547410581},{"$f":"C$18*E$7/(6*8*'Steel Eurocode 3'!X$8*'Steel Eurocode 3'!E$10)*100*1000*Y117","v":0.24108429410947116},{"$f":"C$14*B117*(8^3-2*8*B117^2+B117^3)/24/('Steel Eurocode 3'!E$10*'Steel Eurocode 3'!X$8)*100*1000","v":2.0210172913738651},null,63.460202496000043,69.380202496000052,1.009083666082896E-6,3.6964743598232029E-6,7.3280715599455201E-6,1.1225072630748624E-5]
[39,1.2160000000000009,-276.90633974400009,193.36936799999992,-9.9460247565486739,-9.9460247565486739,-3.3319833751865038,24.381937499999964,22.9921875,15.328125,10.21875,{"$f":"'Graph Properties'!C$3*8/2-B118*C$3","v":120.44836799999996},39.430968000000021,27.958500000000019,18.639000000000014,12.426000000000009,{"$f":"C$3*8/2*'Graph Properties'!B118-'Graph Properties'!C$3*B118^2/2","v":178.45187174400007},0.79048442157040044,1.1485693850387799,{"$f":"D$17*$E$6/(6*8*'Steel Eurocode 3'!$X$8*'Steel Eurocode 3'!$E$10)*100*1000*X118","v":0.97526592144108171},{"$f":"D$18*E$7/(6*8*'Steel Eurocode 3'!X$8*'Steel Eurocode 3'!E$10)*100*1000*Y118","v":0.71091728040474855},{"$f":"D$14*B118*(8^3-2*8*B118^2+B118^3)/24/('Steel Eurocode 3'!E$10*'Steel Eurocode 3'!X$8)*100*1000","v":6.3207877480936627},null,65.08195430400005,71.161954304000048,2.9612323598254263E-6,1.086607657552943E-5,2.1563446867693006E-5,3.3049140718080805E-5,null,0.27495110315492188,0.39950239479609756,{"$f":"C$17*$E$6/(6*8*'Steel Eurocode 3'!$X$8*'Steel Eurocode 3'!$E$10)*100*1000*AK118","v":0.33922292919689795},{"$f":"C$18*E$7/(6*8*'Steel Eurocode 3'!X$8*'Steel Eurocode 3'!E$10)*100*1000*Y118","v":0.24727557579295598},{"$f":"C$14*B118*(8^3-2*8*B118^2+B118^3)/24/('Steel Eurocode 3'!E$10*'Steel Eurocode 3'!X$8)*100*1000","v":2.0710313722456304},null,65.08195430400005,71.161954304000048,1.0299938642871048E-6,3.7795048958363235E-6,7.5003293452845243E-6,1.14953532932455E-5]
[40,1.2480000000000009,-283.05108009600019,190.67690399999992,-10.185144758502636,-10.185144758502636,-3.4120981070665239,23.073937499999964,22.9921875,15.328125,10.21875,{"$f":"'Graph Properties'!C$3*8/2-B119*C$3","v":119.06390399999995},40.190262000000025,28.694250000000022,19.129500000000014,12.753000000000009,{"$f":"C$3*8/2*'Graph Properties'!B119-'Graph Properties'!C$3*B119^2/2","v":182.28406809600008},0.80810719581108081,1.1765830282712042,{"$f":"D$17*$E$6/(6*8*'Steel Eurocode 3'!$X$8*'Steel Eurocode 3'!$E$10)*100*1000*X119","v":0.99945623617713364},{"$f":"D$18*E$7/(6*8*'Steel Eurocode 3'!X$8*'Steel Eurocode 3'!E$10)*100*1000*Y119","v":0.72864257793345077},{"$f":"D$14*B119*(8^3-2*8*B119^2+B119^3)/24/('Steel Eurocode 3'!E$10*'Steel Eurocode 3'!X$8)*100*1000","v":6.4723557203097668},null,66.696235008000045,72.936235008000054,3.0203081855836341E-6,1.1101380143694442E-5,2.2053226251608716E-5,3.3819056534320759E-5,null,0.281080763760376,0.40924627070302744,{"$f":"C$17*$E$6/(6*8*'Steel Eurocode 3'!$X$8*'Steel Eurocode 3'!$E$10)*100*1000*AK119","v":0.34763695171378561},{"$f":"C$18*E$7/(6*8*'Steel Eurocode 3'!X$8*'Steel Eurocode 3'!E$10)*100*1000*Y119","v":0.25344089667250458},{"$f":"C$14*B119*(8^3-2*8*B119^2+B119^3)/24/('Steel Eurocode 3'!E$10*'Steel Eurocode 3'!X$8)*100*1000","v":2.1206932242168306},null,66.696235008000045,72.936235008000054,1.0505419775943074E-6,3.8613496151980675E-6,7.6706873918639031E-6,1.1763150098894177E-5]
[41,1.2800000000000009,-289.10966160000015,187.98443999999992,-10.422561431535881,-10.422561431535881,-3.4916425274511464,21.765937499999964,22.9921875,15.328125,10.21875,{"$f":"'Graph Properties'!C$3*8/2-B120*C$3","v":117.67943999999996},40.90770000000002,29.430000000000021,19.620000000000015,13.080000000000009,{"$f":"C$3*8/2*'Graph Properties'!B120-'Graph Properties'!C$3*B120^2/2","v":186.07196160000009},0.82548858643983025,1.2044243182386796,{"$f":"D$17*$E$6/(6*8*'Steel Eurocode 3'!$X$8*'Steel Eurocode 3'!$E$10)*100*1000*X120","v":1.0235316487365531},{"$f":"D$18*E$7/(6*8*'Steel Eurocode 3'!X$8*'Steel Eurocode 3'!E$10)*100*1000*Y120","v":0.74629127401106443},{"$f":"D$14*B120*(8^3-2*8*B120^2+B120^3)/24/('Steel Eurocode 3'!E$10*'Steel Eurocode 3'!X$8)*100*1000","v":6.6228256041097531},null,68.30284800000004,74.702848000000046,3.0783479276123783E-6,1.1333233792010682E-5,2.253744917577073E-5,3.4581692358157527E-5,null,0.28712646484863669,0.4189301976482363,{"$f":"C$17*$E$6/(6*8*'Steel Eurocode 3'!$X$8*'Steel Eurocode 3'!$E$10)*100*1000*AK120","v":0.35601100825619236},{"$f":"C$18*E$7/(6*8*'Steel Eurocode 3'!X$8*'Steel Eurocode 3'!E$10)*100*1000*Y120","v":0.25957957356906586},{"$f":"C$14*B120*(8^3-2*8*B120^2+B120^3)/24/('Steel Eurocode 3'!E$10*'Steel Eurocode 3'!X$8)*100*1000","v":2.169995283129015},null,68.30284800000004,74.702848000000046,1.0707297139521314E-6,3.9419943624384982E-6,7.8391127567898186E-6,1.2028414733272182E-5]
[42,1.3120000000000009,-295.08208425600014,185.29197599999992,-10.658238317738231,-10.658238317738231,-3.5706044156335053,20.457937499999961,22.9921875,15.328125,10.21875,{"$f":"'Graph Properties'!C$3*8/2-B121*C$3","v":116.29497599999996},41.583282000000025,30.16575000000002,20.110500000000016,13.407000000000009,{"$f":"C$3*8/2*'Graph Properties'!B121-'Graph Properties'!C$3*B121^2/2","v":189.8155522560001},0.84262428413398993,1.2320888356267208,{"$f":"D$17*$E$6/(6*8*'Steel Eurocode 3'!$X$8*'Steel Eurocode 3'!$E$10)*100*1000*X121","v":1.0474892129096831},{"$f":"D$18*E$7/(6*8*'Steel Eurocode 3'!X$8*'Steel Eurocode 3'!E$10)*100*1000*Y121","v":0.76386140449781847},{"$f":"D$14*B121*(8^3-2*8*B121^2+B121^3)/24/('Steel Eurocode 3'!E$10*'Steel Eurocode 3'!X$8)*100*1000","v":6.7721745805700193},null,69.901596672000053,76.461596672000056,3.1353564962610863E-6,1.1561599337600985E-5,2.3016023443458164E-5,3.5336911799725372E-5,null,0.2930867075248661,0.42855263847885938,{"$f":"C$17*$E$6/(6*8*'Steel Eurocode 3'!$X$8*'Steel Eurocode 3'!$E$10)*100*1000*AK121","v":0.36434407405554198},{"$f":"C$18*E$7/(6*8*'Steel Eurocode 3'!X$8*'Steel Eurocode 3'!E$10)*100*1000*Y121","v":0.26569092330358901},{"$f":"C$14*B121*(8^3-2*8*B121^2+B121^3)/24/('Steel Eurocode 3'!E$10*'Steel Eurocode 3'!X$8)*100*1000","v":2.2189300722706489},null,69.901596672000053,76.461596672000056,1.0905587813082038E-6,4.0214258565568648E-6,8.0055733716376228E-6,1.2291099756426216E-5]
[43,1.344000000000001,-300.96834806400017,182.59951199999992,-10.892139477497402,-10.892139477497402,-3.6489717258005752,19.149937499999961,22.9921875,15.328125,10.21875,{"$f":"'Graph Properties'!C$3*8/2-B122*C$3","v":114.91051199999995},42.217008000000014,30.901500000000024,20.601000000000013,13.734000000000011,{"$f":"C$3*8/2*'Graph Properties'!B122-'Graph Properties'!C$3*B122^2/2","v":193.51484006400011},0.8595102309807916,1.2595721611208412,{"$f":"D$17*$E$6/(6*8*'Steel Eurocode 3'!$X$8*'Steel Eurocode 3'!$E$10)*100*1000*X122","v":1.0713259824868659},{"$f":"D$18*E$7/(6*8*'Steel Eurocode 3'!X$8*'Steel Eurocode 3'!E$10)*100*1000*Y122","v":0.78135100525394119},{"$f":"D$14*B122*(8^3-2*8*B122^2+B122^3)/24/('Steel Eurocode 3'!E$10*'Steel Eurocode 3'!X$8)*100*1000","v":6.920380097654963},null,71.492284416000047,78.21228441600006,3.1913388018791892E-6,1.1786441111687105E-5,2.348885937204905E-5,3.6084580983257464E-5,null,0.29896008034114496,0.43811205604203174,{"$f":"C$17*$E$6/(6*8*'Steel Eurocode 3'!$X$8*'Steel Eurocode 3'!$E$10)*100*1000*AK122","v":0.37263512434325774},{"$f":"C$18*E$7/(6*8*'Steel Eurocode 3'!X$8*'Steel Eurocode 3'!E$10)*100*1000*Y122","v":0.27177426269702298},{"$f":"C$14*B122*(8^3-2*8*B122^2+B122^3)/24/('Steel Eurocode 3'!E$10*'Steel Eurocode 3'!X$8)*100*1000","v":2.2674902023771177},null,71.492284416000047,78.21228441600006,1.1100308876101526E-6,4.0996316910216023E-6,8.1700380424518449E-6,1.2551158602872162E-5]
[44,1.376000000000001,-306.76845302400017,179.90704799999992,-11.12422948949899,-11.12422948949899,-3.7267325870331662,17.841937499999958,22.9921875,15.328125,10.21875,{"$f":"'Graph Properties'!C$3*8/2-B123*C$3","v":113.52604799999995},42.808878000000014,31.637250000000023,21.091500000000014,14.061000000000011,{"$f":"C$3*8/2*'Graph Properties'!B123-'Graph Properties'!C$3*B123^2/2","v":197.16982502400009},0.8761426204773588,1.2868698754065557,{"$f":"D$17*$E$6/(6*8*'Steel Eurocode 3'!$X$8*'Steel Eurocode 3'!$E$10)*100*1000*X123","v":1.0950390112584447},{"$f":"D$18*E$7/(6*8*'Steel Eurocode 3'!X$8*'Steel Eurocode 3'!E$10)*100*1000*Y123","v":0.79875811213966086},{"$f":"D$14*B123*(8^3-2*8*B123^2+B123^3)/24/('Steel Eurocode 3'!E$10*'Steel Eurocode 3'!X$8)*100*1000","v":7.0674198702169706},null,73.074714624000052,79.954714624000047,3.246299754816114E-6,1.2007725959589701E-5,2.3955869793020337E-5,3.6824568547085894E-5,null,0.30474525929647256,0.44760691318488888,{"$f":"C$17*$E$6/(6*8*'Steel Eurocode 3'!$X$8*'Steel Eurocode 3'!$E$10)*100*1000*AK123","v":0.38088313435076337},{"$f":"C$18*E$7/(6*8*'Steel Eurocode 3'!X$8*'Steel Eurocode 3'!E$10)*100*1000*Y123","v":0.27782890857031678},{"$f":"C$14*B123*(8^3-2*8*B123^2+B123^3)/24/('Steel Eurocode 3'!E$10*'Steel Eurocode 3'!X$8)*100*1000","v":2.3156683716307249},null,73.074714624000052,79.954714624000047,1.1291477408056046E-6,4.1766003337703301E-6,8.3324764497462037E-6,1.2808545581595093E-5]
[45,1.408000000000001,-312.48239913600014,177.21458399999989,-11.354473450726482,-11.354473450726482,-3.8038753033059267,16.533937499999958,22.9921875,15.328125,10.21875,{"$f":"'Graph Properties'!C$3*8/2-B124*C$3","v":112.14158399999995},43.358892000000012,32.373000000000026,21.582000000000015,14.388000000000011,{"$f":"C$3*8/2*'Graph Properties'!B124-'Graph Properties'!C$3*B124^2/2","v":200.7805071360001},0.8925178975307041,1.3139775591693785,{"$f":"D$17*$E$6/(6*8*'Steel Eurocode 3'!$X$8*'Steel Eurocode 3'!$E$10)*100*1000*X124","v":1.1186253530147621},{"$f":"D$18*E$7/(6*8*'Steel Eurocode 3'!X$8*'Steel Eurocode 3'!E$10)*100*1000*Y124","v":0.81608076101520666},{"$f":"D$14*B124*(8^3-2*8*B124^2+B124^3)/24/('Steel Eurocode 3'!E$10*'Steel Eurocode 3'!X$8)*100*1000","v":7.213271879996431},null,74.648690688000059,81.688690688000065,3.3002442654212898E-6,1.2225423240728332E-5,2.4416970051947865E-5,3.755674564364165E-5,null,0.31044100783676665,0.4570356727545663,{"$f":"C$17*$E$6/(6*8*'Steel Eurocode 3'!$X$8*'Steel Eurocode 3'!$E$10)*100*1000*AK124","v":0.38908707930948244},{"$f":"C$18*E$7/(6*8*'Steel Eurocode 3'!X$8*'Steel Eurocode 3'!E$10)*100*1000*Y124","v":0.28385417774441962},{"$f":"C$14*B124*(8^3-2*8*B124^2+B124^3)/24/('Steel Eurocode 3'!E$10*'Steel Eurocode 3'!X$8)*100*1000","v":2.3634573656606914},null,74.648690688000059,81.688690688000065,1.1479110488421876E-6,4.2523211272098541E-6,8.4928591485036061E-6,1.3063215876049269E-5]
[46,1.4400000000000011,-318.1101864000002,174.52211999999992,-11.582836976461241,-11.582836976461241,-3.8803883534873407,15.225937499999958,22.9921875,15.328125,10.21875,{"$f":"'Graph Properties'!C$3*8/2-B125*C$3","v":110.75711999999996},43.867050000000013,33.108750000000022,22.072500000000016,14.715000000000011,{"$f":"C$3*8/2*'Graph Properties'!B125-'Graph Properties'!C$3*B125^2/2","v":204.3468864000001},0.90863275845773239,1.340890793094822,{"$f":"D$17*$E$6/(6*8*'Steel Eurocode 3'!$X$8*'Steel Eurocode 3'!$E$10)*100*1000*X125","v":1.1420820615461604},{"$f":"D$18*E$7/(6*8*'Steel Eurocode 3'!X$8*'Steel Eurocode 3'!E$10)*100*1000*Y125","v":0.8333169877408062},{"$f":"D$14*B125*(8^3-2*8*B125^2+B125^3)/24/('Steel Eurocode 3'!E$10*'Steel Eurocode 3'!X$8)*100*1000","v":7.3579143756217213},null,76.214016000000044,83.414016000000046,3.3531772440441461E-6,1.2439504828621471E-5,2.4872078008506391E-5,3.828098593945461E-5,null,0.31604617685486353,0.46639679759819919,{"$f":"C$17*$E$6/(6*8*'Steel Eurocode 3'!$X$8*'Steel Eurocode 3'!$E$10)*100*1000*AK125","v":0.39724593445083839},{"$f":"C$18*E$7/(6*8*'Steel Eurocode 3'!X$8*'Steel Eurocode 3'!E$10)*100*1000*Y125","v":0.28984938704028035},{"$f":"C$14*B125*(8^3-2*8*B125^2+B125^3)/24/('Steel Eurocode 3'!E$10*'Steel Eurocode 3'!X$8)*100*1000","v":2.4108500575431595},null,76.214016000000044,83.414016000000046,1.1663225196675289E-6,4.3267842882161641E-6,8.6511575681761368E-6,1.3315125544158128E-5]
[47,1.4720000000000011,-323.65181481600018,171.82965599999989,-11.809286200282532,-11.809286200282532,-3.9562603913397298,13.917937499999955,22.9921875,15.328125,10.21875,{"$f":"'Graph Properties'!C$3*8/2-B126*C$3","v":109.37265599999995},44.333352000000012,33.844500000000025,22.563000000000017,15.04200000000001,{"$f":"C$3*8/2*'Graph Properties'!B126-'Graph Properties'!C$3*B126^2/2","v":207.86896281600011},0.92448415098523962,1.3676051578684023,{"$f":"D$17*$E$6/(6*8*'Steel Eurocode 3'!$X$8*'Steel Eurocode 3'!$E$10)*100*1000*X126","v":1.1654061906429831},{"$f":"D$18*E$7/(6*8*'Steel Eurocode 3'!X$8*'Steel Eurocode 3'!E$10)*100*1000*Y126","v":0.85046482817668867},{"$f":"D$14*B126*(8^3-2*8*B126^2+B126^3)/24/('Steel Eurocode 3'!E$10*'Steel Eurocode 3'!X$8)*100*1000","v":7.5013258726092182},null,77.770493952000052,85.130493952000052,3.4051036010341109E-6,1.2649945110886507E-5,2.5321114036469585E-5,3.899716561515361E-5,null,0.32155970469051814,0.47568875056292265,{"$f":"C$17*$E$6/(6*8*'Steel Eurocode 3'!$X$8*'Steel Eurocode 3'!$E$10)*100*1000*AK126","v":0.405358675006255},{"$f":"C$18*E$7/(6*8*'Steel Eurocode 3'!X$8*'Steel Eurocode 3'!E$10)*100*1000*Y126","v":0.29581385327884818},{"$f":"C$14*B126*(8^3-2*8*B126^2+B126^3)/24/('Steel Eurocode 3'!E$10*'Steel Eurocode 3'!X$8)*100*1000","v":2.457839407801186},null,77.770493952000052,85.130493952000052,1.1843838612292557E-6,4.3999809081344368E-6,8.8073440126850738E-6,1.35642315183143E-5]
[48,1.5040000000000011,-329.1072843840002,169.13719199999991,-12.033787774067495,-12.033787774067495,-4.0314802455192531,12.609937499999955,22.9921875,15.328125,10.21875,{"$f":"'Graph Properties'!C$3*8/2-B127*C$3","v":107.98819199999994},44.757798000000008,34.580250000000028,23.053500000000017,15.369000000000012,{"$f":"C$3*8/2*'Graph Properties'!B127-'Graph Properties'!C$3*B127^2/2","v":211.34673638400014},0.94006927424991005,1.3941162341756326,{"$f":"D$17*$E$6/(6*8*'Steel Eurocode 3'!$X$8*'Steel Eurocode 3'!$E$10)*100*1000*X127","v":1.1885947940955728},{"$f":"D$18*E$7/(6*8*'Steel Eurocode 3'!X$8*'Steel Eurocode 3'!E$10)*100*1000*Y127","v":0.86752231818308245},{"$f":"D$14*B127*(8^3-2*8*B127^2+B127^3)/24/('Steel Eurocode 3'!E$10*'Steel Eurocode 3'!X$8)*100*1000","v":7.6434851533632964},null,79.317927936000061,86.837927936000057,3.4560282467406128E-6,1.2856720989239714E-5,2.576400102371002E-5,3.9705163365466344E-5,null,0.32698061713040355,0.48490999449587208,{"$f":"C$17*$E$6/(6*8*'Steel Eurocode 3'!$X$8*'Steel Eurocode 3'!$E$10)*100*1000*AK127","v":0.41342427620715572},{"$f":"C$18*E$7/(6*8*'Steel Eurocode 3'!X$8*'Steel Eurocode 3'!E$10)*100*1000*Y127","v":0.30174689328107207},{"$f":"C$14*B127*(8^3-2*8*B127^2+B127^3)/24/('Steel Eurocode 3'!E$10*'Steel Eurocode 3'!X$8)*100*1000","v":2.5044184644047496},null,79.317927936000061,86.837927936000057,1.2020967814749957E-6,4.4719029527790315E-6,8.9613916604208764E-6,1.3810491605379597E-5]
[49,1.5360000000000011,-334.47659510400018,166.44472799999988,-12.256308867991153,-12.256308867991153,-4.1060369195759066,11.301937499999955,22.9921875,15.328125,10.21875,{"$f":"'Graph Properties'!C$3*8/2-B128*C$3","v":106.60372799999995},45.140388000000009,35.316000000000024,23.544000000000018,15.696000000000012,{"$f":"C$3*8/2*'Graph Properties'!B128-'Graph Properties'!C$3*B128^2/2","v":214.78020710400011},0.9553855787983212,1.4204196027020266,{"$f":"D$17*$E$6/(6*8*'Steel Eurocode 3'!$X$8*'Steel Eurocode 3'!$E$10)*100*1000*X128","v":1.2116449256942718},{"$f":"D$18*E$7/(6*8*'Steel Eurocode 3'!X$8*'Steel Eurocode 3'!E$10)*100*1000*Y128","v":0.88448749362021595},{"$f":"D$14*B128*(8^3-2*8*B128^2+B128^3)/24/('Steel Eurocode 3'!E$10*'Steel Eurocode 3'!X$8)*100*1000","v":7.7843712671763177},null,80.856121344000059,88.536121344000065,3.5059560915130809E-6,1.3059811879496293E-5,2.6200664372199162E-5,4.0404860399219429E-5,null,0.33230802740811183,0.49405899224418315,{"$f":"C$17*$E$6/(6*8*'Steel Eurocode 3'!$X$8*'Steel Eurocode 3'!$E$10)*100*1000*AK128","v":0.42144171328496405},{"$f":"C$18*E$7/(6*8*'Steel Eurocode 3'!X$8*'Steel Eurocode 3'!E$10)*100*1000*Y128","v":0.30764782386790113},{"$f":"C$14*B128*(8^3-2*8*B128^2+B128^3)/24/('Steel Eurocode 3'!E$10*'Steel Eurocode 3'!X$8)*100*1000","v":2.5505803627707464},null,80.856121344000059,88.536121344000065,1.2194629883523758E-6,4.5425432624334942E-6,9.1132745642431884E-6,1.405386448668502E-5]
[50,1.5680000000000012,-339.7597469760002,163.75226399999988,-12.476817170526431,-12.476817170526431,-4.1799195919535244,9.9939374999999515,22.9921875,15.328125,10.21875,{"$f":"'Graph Properties'!C$3*8/2-B129*C$3","v":105.21926399999994},45.481122000000013,36.051750000000027,24.034500000000019,16.02300000000001,{"$f":"C$3*8/2*'Graph Properties'!B129-'Graph Properties'!C$3*B129^2/2","v":218.16937497600014},0.97043076658694072,1.4465108441331012,{"$f":"D$17*$E$6/(6*8*'Steel Eurocode 3'!$X$8*'Steel Eurocode 3'!$E$10)*100*1000*X129","v":1.2345536392294232},{"$f":"D$18*E$7/(6*8*'Steel Eurocode 3'!X$8*'Steel Eurocode 3'!E$10)*100*1000*Y129","v":0.90135839034831755},{"$f":"D$14*B129*(8^3-2*8*B129^2+B129^3)/24/('Steel Eurocode 3'!E$10*'Steel Eurocode 3'!X$8)*100*1000","v":7.9239635302286482},null,82.384877568000064,90.224877568000068,3.5548920457009442E-6,1.3259199711570352E-5,2.663103199800741E-5,4.1096140439338423E-5,null,0.33754113620415332,0.50313420665499164,{"$f":"C$17*$E$6/(6*8*'Steel Eurocode 3'!$X$8*'Steel Eurocode 3'!$E$10)*100*1000*AK129","v":0.42940996147110372},{"$f":"C$18*E$7/(6*8*'Steel Eurocode 3'!X$8*'Steel Eurocode 3'!E$10)*100*1000*Y129","v":0.3135159618602843},{"$f":"C$14*B129*(8^3-2*8*B129^2+B129^3)/24/('Steel Eurocode 3'!E$10*'Steel Eurocode 3'!X$8)*100*1000","v":2.5963183257629909},null,82.384877568000064,90.224877568000068,1.2364841898090239E-6,4.6118955518505578E-6,9.2629676514808383E-6,1.4294309718030755E-5]
[51,1.6000000000000012,-344.9567400000002,161.05979999999988,-12.69528088844412,-12.69528088844412,-4.2531176159897726,8.6859374999999517,22.9921875,15.328125,10.21875,{"$f":"'Graph Properties'!C$3*8/2-B130*C$3","v":103.83479999999994},45.780000000000008,36.78750000000003,24.52500000000002,16.350000000000012,{"$f":"C$3*8/2*'Graph Properties'!B130-'Graph Properties'!C$3*B130^2/2","v":221.51424000000011},0.98520279098212593,1.4723855391543665,{"$f":"D$17*$E$6/(6*8*'Steel Eurocode 3'!$X$8*'Steel Eurocode 3'!$E$10)*100*1000*X130","v":1.2573179884913694},{"$f":"D$18*E$7/(6*8*'Steel Eurocode 3'!X$8*'Steel Eurocode 3'!E$10)*100*1000*Y130","v":0.91813304422761599},{"$f":"D$14*B130*(8^3-2*8*B130^2+B130^3)/24/('Steel Eurocode 3'!E$10*'Steel Eurocode 3'!X$8)*100*1000","v":8.0622415255886413},null,83.904000000000053,91.904000000000067,3.6028410196536302E-6,1.3454868929474889E-5,2.705503433130405E-5,4.1778889722847716E-5,null,0.34267923164595682,0.51213410057543185,{"$f":"C$17*$E$6/(6*8*'Steel Eurocode 3'!$X$8*'Steel Eurocode 3'!$E$10)*100*1000*AK130","v":0.43732799599699806},{"$f":"C$18*E$7/(6*8*'Steel Eurocode 3'!X$8*'Steel Eurocode 3'!E$10)*100*1000*Y130","v":0.3193506240791707},{"$f":"C$14*B130*(8^3-2*8*B130^2+B130^3)/24/('Steel Eurocode 3'!E$10*'Steel Eurocode 3'!X$8)*100*1000","v":2.6416256636922153},null,83.904000000000053,91.904000000000067,1.253162093792567E-6,4.6799544102521351E-6,9.4104467239318429E-6,1.4531787729686161E-5]
[52,1.6320000000000012,-350.06757417600022,158.36733599999988,-12.911668746812913,-12.911668746812913,-4.3256205199161624,7.3779374999999483,22.9921875,15.328125,10.21875,{"$f":"'Graph Properties'!C$3*8/2-B131*C$3","v":102.45033599999994},46.037022000000007,37.523250000000026,25.015500000000017,16.677000000000014,{"$f":"C$3*8/2*'Graph Properties'!B131-'Graph Properties'!C$3*B131^2/2","v":224.81480217600014},0.99969985676012629,1.4980392684513404,{"$f":"D$17*$E$6/(6*8*'Steel Eurocode 3'!$X$8*'Steel Eurocode 3'!$E$10)*100*1000*X131","v":1.2799350272704539},{"$f":"D$18*E$7/(6*8*'Steel Eurocode 3'!X$8*'Steel Eurocode 3'!E$10)*100*1000*Y131","v":0.93480949111833944},{"$f":"D$14*B131*(8^3-2*8*B131^2+B131^3)/24/('Steel Eurocode 3'!E$10*'Steel Eurocode 3'!X$8)*100*1000","v":8.1991851032126526},null,85.413292032000058,93.573292032000055,3.6498079237205703E-6,1.3646806491321833E-5,2.7472604316357285E-5,4.2452997000870689E-5,null,0.34772168930786984,0.5210571368526401,{"$f":"C$17*$E$6/(6*8*'Steel Eurocode 3'!$X$8*'Steel Eurocode 3'!$E$10)*100*1000*AK131","v":0.44519479209407087},{"$f":"C$18*E$7/(6*8*'Steel Eurocode 3'!X$8*'Steel Eurocode 3'!E$10)*100*1000*Y131","v":0.32515112734550933},{"$f":"C$14*B131*(8^3-2*8*B131^2+B131^3)/24/('Steel Eurocode 3'!E$10*'Steel Eurocode 3'!X$8)*100*1000","v":2.6864957743160724},null,85.413292032000058,93.573292032000055,1.2694984082506331E-6,4.7467153013293316E-6,9.5556884578634016E-6,1.4766259826389803E-5]
[53,1.6640000000000013,-355.09224950400016,155.67487199999988,-13.125949988999379,-13.125949988999379,-4.3974180068580351,6.0699374999999485,22.9921875,15.328125,10.21875,{"$f":"'Graph Properties'!C$3*8/2-B132*C$3","v":101.06587199999994},46.252188000000004,38.259000000000029,25.506000000000018,17.004000000000012,{"$f":"C$3*8/2*'Graph Properties'!B132-'Graph Properties'!C$3*B132^2/2","v":228.07106150400011},1.0139204201070813,1.5234676127095335,{"$f":"D$17*$E$6/(6*8*'Steel Eurocode 3'!$X$8*'Steel Eurocode 3'!$E$10)*100*1000*X132","v":1.3024018093570187},{"$f":"D$18*E$7/(6*8*'Steel Eurocode 3'!X$8*'Steel Eurocode 3'!E$10)*100*1000*Y132","v":0.95138576688071685},{"$f":"D$14*B132*(8^3-2*8*B132^2+B132^3)/24/('Steel Eurocode 3'!E$10*'Steel Eurocode 3'!X$8)*100*1000","v":8.3347743799450278},null,86.912557056000054,95.232557056000061,3.69579766825119E-6,1.3835001869322001E-5,2.7883677411534226E-5,4.3118353538629561E-5,null,0.35266797221115848,0.52990177833375052,{"$f":"C$17*$E$6/(6*8*'Steel Eurocode 3'!$X$8*'Steel Eurocode 3'!$E$10)*100*1000*AK132","v":0.45300932499374563},{"$f":"C$18*E$7/(6*8*'Steel Eurocode 3'!X$8*'Steel Eurocode 3'!E$10)*100*1000*Y132","v":0.33091678848024925},{"$f":"C$14*B132*(8^3-2*8*B132^2+B132^3)/24/('Steel Eurocode 3'!E$10*'Steel Eurocode 3'!X$8)*100*1000","v":2.7309221428391308},null,86.912557056000054,95.232557056000061,1.2854948411308486E-6,4.812174563242434E-6,9.698670404011904E-6,1.499768818734941E-5]
[54,1.6960000000000013,-360.03076598400025,152.98240799999988,-13.338094376667975,-13.338094376667975,-4.4684999548345727,4.7619374999999486,22.9921875,15.328125,10.21875,{"$f":"'Graph Properties'!C$3*8/2-B133*C$3","v":99.681407999999934},46.425498000000005,38.994750000000032,25.996500000000019,17.331000000000014,{"$f":"C$3*8/2*'Graph Properties'!B133-'Graph Properties'!C$3*B133^2/2","v":231.28301798400014},1.0278631886190202,1.5486661526144618,{"$f":"D$17*$E$6/(6*8*'Steel Eurocode 3'!$X$8*'Steel Eurocode 3'!$E$10)*100*1000*X133","v":1.3247153885414071},{"$f":"D$18*E$7/(6*8*'Steel Eurocode 3'!X$8*'Steel Eurocode 3'!E$10)*100*1000*Y133","v":0.9678599073749764},{"$f":"D$14*B133*(8^3-2*8*B133^2+B133^3)/24/('Steel Eurocode 3'!E$10*'Steel Eurocode 3'!X$8)*100*1000","v":8.4689897395181095},null,88.40159846400006,96.881598464000064,3.7408151635949207E-6,1.4019447049785122E-5,2.8288191589300876E-5,4.3774853115445493E-5,null,0.35751763082400706,0.53866648786589966,{"$f":"C$17*$E$6/(6*8*'Steel Eurocode 3'!$X$8*'Steel Eurocode 3'!$E$10)*100*1000*AK133","v":0.46077056992744592},{"$f":"C$18*E$7/(6*8*'Steel Eurocode 3'!X$8*'Steel Eurocode 3'!E$10)*100*1000*Y133","v":0.33664692430433957},{"$f":"C$14*B133*(8^3-2*8*B133^2+B133^3)/24/('Steel Eurocode 3'!E$10*'Steel Eurocode 3'!X$8)*100*1000","v":2.7748983419128805},null,88.40159846400006,96.881598464000064,1.3011531003808417E-6,4.8763294086209126E-6,9.8393709875829138E-6,1.522603586624191E-5]
[55,1.7280000000000013,-364.8831236160002,150.28994399999988,-13.548072189781056,-13.548072189781056,-4.5388564167587928,3.4539374999999453,22.9921875,15.328125,10.21875,{"$f":"'Graph Properties'!C$3*8/2-B134*C$3","v":98.296943999999939},46.556952000000003,39.730500000000028,26.48700000000002,17.658000000000012,{"$f":"C$3*8/2*'Graph Properties'!B134-'Graph Properties'!C$3*B134^2/2","v":234.45067161600014},1.041527121301866,1.5736304688516396,{"$f":"D$17*$E$6/(6*8*'Steel Eurocode 3'!$X$8*'Steel Eurocode 3'!$E$10)*100*1000*X134","v":1.3468728186139616},{"$f":"D$18*E$7/(6*8*'Steel Eurocode 3'!X$8*'Steel Eurocode 3'!E$10)*100*1000*Y134","v":0.98422994846134682},{"$f":"D$14*B134*(8^3-2*8*B134^2+B134^3)/24/('Steel Eurocode 3'!E$10*'Steel Eurocode 3'!X$8)*100*1000","v":8.6018118325522419},null,89.880219648000065,98.520219648000065,3.7848653201011886E-6,1.4200136533119848E-5,2.8686087336222184E-5,4.4422392024738581E-5,null,0.36227030306151847,0.54734972829622253,{"$f":"C$17*$E$6/(6*8*'Steel Eurocode 3'!$X$8*'Steel Eurocode 3'!$E$10)*100*1000*AK134","v":0.46847750212659534},{"$f":"C$18*E$7/(6*8*'Steel Eurocode 3'!X$8*'Steel Eurocode 3'!E$10)*100*1000*Y134","v":0.34234085163872924},{"$f":"C$14*B134*(8^3-2*8*B134^2+B134^3)/24/('Steel Eurocode 3'!E$10*'Steel Eurocode 3'!X$8)*100*1000","v":2.8184180316357277},null,89.880219648000065,98.520219648000065,1.3164748939482395E-6,4.9391779245634243E-6,9.9777695082511931E-6,1.5451266791213418E-5]
[56,1.7600000000000013,-369.64932240000024,147.59747999999988,-13.755854226598846,-13.755854226598846,-4.6084776204375526,2.1459374999999454,22.9921875,15.328125,10.21875,{"$f":"'Graph Properties'!C$3*8/2-B135*C$3","v":96.912479999999931},46.646550000000005,40.466250000000031,26.97750000000002,17.985000000000014,{"$f":"C$3*8/2*'Graph Properties'!B135-'Graph Properties'!C$3*B135^2/2","v":237.57402240000016},1.0549114285714292,1.5983561421065802,{"$f":"D$17*$E$6/(6*8*'Steel Eurocode 3'!$X$8*'Steel Eurocode 3'!$E$10)*100*1000*X135","v":1.3688711533650249},{"$f":"D$18*E$7/(6*8*'Steel Eurocode 3'!X$8*'Steel Eurocode 3'!E$10)*100*1000*Y135","v":1.0004939260000565},{"$f":"D$14*B135*(8^3-2*8*B135^2+B135^3)/24/('Steel Eurocode 3'!E$10*'Steel Eurocode 3'!X$8)*100*1000","v":8.7332215765557546},null,91.348224000000059,100.14822400000007,3.8279530481194253E-6,1.4377067333833716E-5,2.9077307652961961E-5,4.5060869074027762E-5,null,0.36692571428571441,0.55594996247185369,{"$f":"C$17*$E$6/(6*8*'Steel Eurocode 3'!$X$8*'Steel Eurocode 3'!$E$10)*100*1000*AK135","v":0.47612909682261728},{"$f":"C$18*E$7/(6*8*'Steel Eurocode 3'!X$8*'Steel Eurocode 3'!E$10)*100*1000*Y135","v":0.34799788730436737},{"$f":"C$14*B135*(8^3-2*8*B135^2+B135^3)/24/('Steel Eurocode 3'!E$10*'Steel Eurocode 3'!X$8)*100*1000","v":2.8614749595529996},null,91.348224000000059,100.14822400000007,1.3314619297806693E-6,5.0007190726378132E-6,1.0113846140160682E-5,1.5673345764879219E-5]
[57,1.7920000000000014,-374.3293623360002,144.90501599999988,-13.961411803679463,-13.961411803679463,-4.6773539685715413,0.8379374999999456,22.9921875,15.328125,10.21875,{"$f":"'Graph Properties'!C$3*8/2-B136*C$3","v":95.528015999999937},46.694292000000004,41.202000000000034,27.468000000000021,18.312000000000015,{"$f":"C$3*8/2*'Graph Properties'!B136-'Graph Properties'!C$3*B136^2/2","v":240.65307033600013},1.0680155722534128,1.6228387530647994,{"$f":"D$17*$E$6/(6*8*'Steel Eurocode 3'!$X$8*'Steel Eurocode 3'!$E$10)*100*1000*X136","v":1.3907074465849398},{"$f":"D$18*E$7/(6*8*'Steel Eurocode 3'!X$8*'Steel Eurocode 3'!E$10)*100*1000*Y136","v":1.0166498758513338},{"$f":"D$14*B136*(8^3-2*8*B136^2+B136^3)/24/('Steel Eurocode 3'!E$10*'Steel Eurocode 3'!X$8)*100*1000","v":8.8632001559249769},null,92.80541491200006,101.76541491200007,3.8700832579990569E-6,1.4550238980533186E-5,2.9461798054282944E-5,4.5690185584930939E-5,null,0.37148367730553483,0.56446565323993037,{"$f":"C$17*$E$6/(6*8*'Steel Eurocode 3'!$X$8*'Steel Eurocode 3'!$E$10)*100*1000*AK136","v":0.48372432924693554},{"$f":"C$18*E$7/(6*8*'Steel Eurocode 3'!X$8*'Steel Eurocode 3'!E$10)*100*1000*Y136","v":0.35361734812220297},{"$f":"C$14*B136*(8^3-2*8*B136^2+B136^3)/24/('Steel Eurocode 3'!E$10*'Steel Eurocode 3'!X$8)*100*1000","v":2.9040629606569381},null,92.80541491200006,101.76541491200007,1.3461159158257588E-6,5.0609526888811072E-6,1.0247581931924501E-5,1.5892238464323804E-5]
[58,1.8240000000000014,-378.92324342400025,142.21255199999987,-14.164716755878912,-14.164716755878912,-4.7454760387552914,-0.47006250000005423,22.9921875,15.328125,10.21875,{"$f":"'Graph Properties'!C$3*8/2-B137*C$3","v":94.143551999999929},46.700178000000001,41.93775000000003,27.958500000000022,18.639000000000014,{"$f":"C$3*8/2*'Graph Properties'!B137-'Graph Properties'!C$3*B137^2/2","v":243.68781542400015},1.0808392655834105,1.6470738824118105,{"$f":"D$17*$E$6/(6*8*'Steel Eurocode 3'!$X$8*'Steel Eurocode 3'!$E$10)*100*1000*X137","v":1.4123787520640494},{"$f":"D$18*E$7/(6*8*'Steel Eurocode 3'!X$8*'Steel Eurocode 3'!E$10)*100*1000*Y137","v":1.0326958338754075},{"$f":"D$14*B137*(8^3-2*8*B137^2+B137^3)/24/('Steel Eurocode 3'!E$10*'Steel Eurocode 3'!X$8)*100*1000","v":8.9917290219442343},null,94.251595776000073,103.37159577600008,3.9112608600895128E-6,1.4719653515923616E-5,2.9839506569046798E-5,4.6310245393164904E-5,null,0.37594409237683835,0.57289526344758623,{"$f":"C$17*$E$6/(6*8*'Steel Eurocode 3'!$X$8*'Steel Eurocode 3'!$E$10)*100*1000*AK137","v":0.49126217463097366},{"$f":"C$18*E$7/(6*8*'Steel Eurocode 3'!X$8*'Steel Eurocode 3'!E$10)*100*1000*Y137","v":0.35919855091318514},{"$f":"C$14*B137*(8^3-2*8*B137^2+B137^3)/24/('Steel Eurocode 3'!E$10*'Steel Eurocode 3'!X$8)*100*1000","v":2.9461759573867079},null,94.251595776000073,103.37159577600008,1.3604385600311351E-6,5.1198794837995187E-6,1.0378958806624973E-5,1.6107911441100836E-5]
[59,1.8560000000000014,-383.43096566400015,139.52008799999987,-14.365741436351076,-14.365741436351076,-4.8128345834771658,-1.7780625000000612,22.9921875,15.328125,10.21875,{"$f":"'Graph Properties'!C$3*8/2-B138*C$3","v":92.759087999999934},46.664207999999995,42.673500000000033,28.449000000000023,18.966000000000015,{"$f":"C$3*8/2*'Graph Properties'!B138-'Graph Properties'!C$3*B138^2/2","v":246.67825766400011},1.0933824732069057,1.6710571108331254,{"$f":"D$17*$E$6/(6*8*'Steel Eurocode 3'!$X$8*'Steel Eurocode 3'!$E$10)*100*1000*X138","v":1.4338821235926955},{"$f":"D$18*E$7/(6*8*'Steel Eurocode 3'!X$8*'Steel Eurocode 3'!E$10)*100*1000*Y138","v":1.0486298359325059},{"$f":"D$14*B138*(8^3-2*8*B138^2+B138^3)/24/('Steel Eurocode 3'!E$10*'Steel Eurocode 3'!X$8)*100*1000","v":9.1187898927858431},null,95.686569984000059,104.96656998400007,3.9514907647402239E-6,1.488531549680928E-5,3.0210383740214068E-5,4.6920954848545322E-5,null,0.38030694720240199,0.58123725594195685,{"$f":"C$17*$E$6/(6*8*'Steel Eurocode 3'!$X$8*'Steel Eurocode 3'!$E$10)*100*1000*AK138","v":0.49874160820615498},{"$f":"C$18*E$7/(6*8*'Steel Eurocode 3'!X$8*'Steel Eurocode 3'!E$10)*100*1000*Y138","v":0.36474081249826285},{"$f":"C$14*B138*(8^3-2*8*B138^2+B138^3)/24/('Steel Eurocode 3'!E$10*'Steel Eurocode 3'!X$8)*100*1000","v":2.9878079596283897},null,95.686569984000059,104.96656998400007,1.3744315703444255E-6,5.1775010423684451E-6,1.0507959561813589E-5,1.6320332121233157E-5]
[60,1.8880000000000015,-387.85252905600021,136.82762399999987,-14.564458716547744,-14.564458716547744,-4.8794205301193694,-3.086062500000061,22.9921875,15.328125,10.21875,{"$f":"'Graph Properties'!C$3*8/2-B139*C$3","v":91.374623999999926},46.586382,43.409250000000036,28.939500000000024,19.293000000000013,{"$f":"C$3*8/2*'Graph Properties'!B139-'Graph Properties'!C$3*B139^2/2","v":249.62439705600013},1.1056454111792735,1.6947840190142616,{"$f":"D$17*$E$6/(6*8*'Steel Eurocode 3'!$X$8*'Steel Eurocode 3'!$E$10)*100*1000*X139","v":1.4552146149612222},{"$f":"D$18*E$7/(6*8*'Steel Eurocode 3'!X$8*'Steel Eurocode 3'!E$10)*100*1000*Y139","v":1.0644499178828575},{"$f":"D$14*B139*(8^3-2*8*B139^2+B139^3)/24/('Steel Eurocode 3'!E$10*'Steel Eurocode 3'!X$8)*100*1000","v":9.2443647535101281},null,97.110140928000064,106.55014092800008,3.9907778823006162E-6,1.5047231994093353E-5,3.0574382624844205E-5,4.7522222814986822E-5,null,0.38457231693192129,0.5894900935701779,{"$f":"C$17*$E$6/(6*8*'Steel Eurocode 3'!$X$8*'Steel Eurocode 3'!$E$10)*100*1000*AK139","v":0.5061616052039033},{"$f":"C$18*E$7/(6*8*'Steel Eurocode 3'!X$8*'Steel Eurocode 3'!E$10)*100*1000*Y139","v":0.37024344969838513},{"$f":"C$14*B139*(8^3-2*8*B139^2+B139^3)/24/('Steel Eurocode 3'!E$10*'Steel Eurocode 3'!X$8)*100*1000","v":3.0289530647149818},null,97.110140928000064,106.55014092800008,1.3880966547132577E-6,5.2338198240324707E-6,1.0634567869511028E-5,1.6529468805212807E-5]
[61,1.9200000000000015,-392.18793360000018,134.13515999999987,-14.760841986218562,-14.760841986218562,-4.9452249809579438,-4.3940625000000608,22.9921875,15.328125,10.21875,{"$f":"'Graph Properties'!C$3*8/2-B140*C$3","v":89.990159999999932},46.466699999999996,44.145000000000032,29.430000000000021,19.620000000000015,{"$f":"C$3*8/2*'Graph Properties'!B140-'Graph Properties'!C$3*B140^2/2","v":252.52623360000013},1.1176285469657807,1.7182501876407315,{"$f":"D$17*$E$6/(6*8*'Steel Eurocode 3'!$X$8*'Steel Eurocode 3'!$E$10)*100*1000*X140","v":1.4763732799599711},{"$f":"D$18*E$7/(6*8*'Steel Eurocode 3'!X$8*'Steel Eurocode 3'!E$10)*100*1000*Y140","v":1.0801541155866909},{"$f":"D$14*B140*(8^3-2*8*B140^2+B140^3)/24/('Steel Eurocode 3'!E$10*'Steel Eurocode 3'!X$8)*100*1000","v":9.3684358560653873},null,98.522112000000064,108.12211200000007,4.0291271231201189E-6,1.5205412592777925E-5,3.0931458794095596E-5,4.811396067050291E-5,null,0.38874036416201052,0.59765223917938481,{"$f":"C$17*$E$6/(6*8*'Steel Eurocode 3'!$X$8*'Steel Eurocode 3'!$E$10)*100*1000*AK140","v":0.51352114085564216},{"$f":"C$18*E$7/(6*8*'Steel Eurocode 3'!X$8*'Steel Eurocode 3'!E$10)*100*1000*Y140","v":0.37570577933450111},{"$f":"C$14*B140*(8^3-2*8*B140^2+B140^3)/24/('Steel Eurocode 3'!E$10*'Steel Eurocode 3'!X$8)*100*1000","v":3.0696054574264053},null,98.522112000000064,108.12211200000007,1.401435521085259E-6,5.2888391627053646E-6,1.0758768276207161E-5,1.6735290668001009E-5]
[62,1.9520000000000015,-396.43717929600018,131.44269599999987,-14.954865153411088,-14.954865153411088,-5.0102392131627633,-5.7020625000000607,22.9921875,15.328125,10.21875,{"$f":"'Graph Properties'!C$3*8/2-B141*C$3","v":88.605695999999938},46.305161999999996,44.880750000000035,29.920500000000022,19.947000000000017,{"$f":"C$3*8/2*'Graph Properties'!B141-'Graph Properties'!C$3*B141^2/2","v":255.38376729600009},1.1293325994415815,1.7414511973980491,{"$f":"D$17*$E$6/(6*8*'Steel Eurocode 3'!$X$8*'Steel Eurocode 3'!$E$10)*100*1000*X141","v":1.4973551723792857},{"$f":"D$18*E$7/(6*8*'Steel Eurocode 3'!X$8*'Steel Eurocode 3'!E$10)*100*1000*Y141","v":1.0957404649042346},{"$f":"D$14*B141*(8^3-2*8*B141^2+B141^3)/24/('Steel Eurocode 3'!E$10*'Steel Eurocode 3'!X$8)*100*1000","v":9.4909857192879361},null,99.922286592000077,109.68228659200008,4.066543397548163E-6,1.5359869391963978E-5,3.1281570333225486E-5,4.8696082307205975E-5,null,0.39281133893620229,0.60572215561671272,{"$f":"C$17*$E$6/(6*8*'Steel Eurocode 3'!$X$8*'Steel Eurocode 3'!$E$10)*100*1000*AK141","v":0.52081919039279501},{"$f":"C$18*E$7/(6*8*'Steel Eurocode 3'!X$8*'Steel Eurocode 3'!E$10)*100*1000*Y141","v":0.38112711822755985},{"$f":"C$14*B141*(8^3-2*8*B141^2+B141^3)/24/('Steel Eurocode 3'!E$10*'Steel Eurocode 3'!X$8)*100*1000","v":3.1097594099894934},null,99.922286592000077,109.68228659200008,1.4144498774080566E-6,5.3425632667700798E-6,1.0880546202861039E-5,1.6937767759028168E-5]
[63,1.9840000000000015,-400.60026614400022,128.75023199999987,-15.14650264447075,-15.14650264447075,-5.0744546787975455,-7.0100625000000605,22.9921875,15.328125,10.21875,{"$f":"'Graph Properties'!C$3*8/2-B142*C$3","v":87.221231999999929},46.101767999999986,45.616500000000038,30.411000000000023,20.274000000000015,{"$f":"C$3*8/2*'Graph Properties'!B142-'Graph Properties'!C$3*B142^2/2","v":258.19699814400013},1.1407585388917247,1.7643826289717306,{"$f":"D$17*$E$6/(6*8*'Steel Eurocode 3'!$X$8*'Steel Eurocode 3'!$E$10)*100*1000*X142","v":1.5181573460095084},{"$f":"D$18*E$7/(6*8*'Steel Eurocode 3'!X$8*'Steel Eurocode 3'!E$10)*100*1000*Y142","v":1.111207001695717},{"$f":"D$14*B142*(8^3-2*8*B142^2+B142^3)/24/('Steel Eurocode 3'!E$10*'Steel Eurocode 3'!X$8)*100*1000","v":9.61199712890207},null,101.31046809600006,111.23046809600007,4.1030316159341744E-6,1.5510617004851422E-5,3.1624677841590096E-5,4.9268504131307402E-5,null,0.39678557874494763,0.6136983057292974,{"$f":"C$17*$E$6/(6*8*'Steel Eurocode 3'!$X$8*'Steel Eurocode 3'!$E$10)*100*1000*AK142","v":0.52805472904678552},{"$f":"C$18*E$7/(6*8*'Steel Eurocode 3'!X$8*'Steel Eurocode 3'!E$10)*100*1000*Y142","v":0.38650678319851023},{"$f":"C$14*B142*(8^3-2*8*B142^2+B142^3)/24/('Steel Eurocode 3'!E$10*'Steel Eurocode 3'!X$8)*100*1000","v":3.1494092820780049},null,101.31046809600006,111.23046809600007,1.427141431629278E-6,5.3949972190787548E-6,1.0999887944900902E-5,1.7136871002193876E-5]
[64,2.0160000000000013,-404.68242614400015,126.71176799999994,-15.335729403386157,-15.335729403386157,-5.1378630045921136,-7.6640625,22.9921875,15.328125,10.21875,{"$f":"'Graph Properties'!C$3*8/2-B143*C$3","v":85.836767999999935},45.861749999999986,46.352250000000033,30.90150000000002,20.601000000000013,{"$f":"C$3*8/2*'Graph Properties'!B143-'Graph Properties'!C$3*B143^2/2","v":260.96592614400009},1.1519075863564345,1.7870400630472862,{"$f":"D$17*$E$6/(6*8*'Steel Eurocode 3'!$X$8*'Steel Eurocode 3'!$E$10)*100*1000*X143","v":1.5387768546409819},{"$f":"D$18*E$7/(6*8*'Steel Eurocode 3'!X$8*'Steel Eurocode 3'!E$10)*100*1000*Y143","v":1.1265517618213667},{"$f":"D$14*B143*(8^3-2*8*B143^2+B143^3)/24/('Steel Eurocode 3'!E$10*'Steel Eurocode 3'!X$8)*100*1000","v":9.7314531375200879},null,102.68645990400006,112.76645990400006,4.1385966886275823E-6,1.5657672552191926E-5,3.1960744432644495E-5,4.9831145063117359E-5,null,0.40066350829789021,0.62157915236427363,{"$f":"C$17*$E$6/(6*8*'Steel Eurocode 3'!$X$8*'Steel Eurocode 3'!$E$10)*100*1000*AK143","v":0.53522673204903715},{"$f":"C$18*E$7/(6*8*'Steel Eurocode 3'!X$8*'Steel Eurocode 3'!E$10)*100*1000*Y143","v":0.39184409106830143},{"$f":"C$14*B143*(8^3-2*8*B143^2+B143^3)/24/('Steel Eurocode 3'!E$10*'Steel Eurocode 3'!X$8)*100*1000","v":3.1885495208126109},null,102.68645990400006,112.76645990400006,1.4395118916965505E-6,5.4461469746754526E-6,1.1116780672224173E-5,1.733257219586691E-5]
[65,2.0480000000000014,-408.71505129600018,125.32730399999994,-15.522520842030882,-15.522520842030882,-5.2004559746352008,-7.6640625,22.9921875,15.328125,10.21875,{"$f":"'Graph Properties'!C$3*8/2-B144*C$3","v":84.452303999999941},{"$f":"IF(B144>D$4, IF(B144<(D$4+E$4),G$4*B144-C$4/2*(B144-D$4)^2,-(8-B144)*H$4),G$4*B144)","v":45.616499999999988},{"$f":"IF(B144>D$5, IF(B144<(D$5+E$5),G$5*B144-C$5/2*(B144-D$5)^2,-(8-B144)*H$5),G$5*B144)","v":47.088000000000029},31.392000000000021,20.928000000000015,{"$f":"C$3*8/2*'Graph Properties'!B144-'Graph Properties'!C$3*B144^2/2","v":263.69055129600008},1.1627811638729051,1.8094190803102328,{"$f":"D$17*$E$6/(6*8*'Steel Eurocode 3'!$X$8*'Steel Eurocode 3'!$E$10)*100*1000*X144","v":1.5592107520640492},{"$f":"D$18*E$7/(6*8*'Steel Eurocode 3'!X$8*'Steel Eurocode 3'!E$10)*100*1000*Y144","v":1.1417727811414125},{"$f":"D$14*B144*(8^3-2*8*B144^2+B144^3)/24/('Steel Eurocode 3'!E$10*'Steel Eurocode 3'!X$8)*100*1000","v":9.8493370646422829},null,{"$f":"IF(B144<D$6,B144*(8^2-B144^2-E$6^2),8/E$6*(B144-D$6)^3+(8^2-E$6^2)*B144-B144^3)","v":104.05006540800007},{"$f":"IF(B144<D$7,B144*(8^2-B144^2-E$7^2),8/E$7*(B144-D$7)^3+(8^2-E$7^2)*B144-B144^3)","v":114.29006540800007},{"$f":"IF(B144<D$4,B144*D$15/(24*K$2*K$3)*((D$4^2)*(2*K$2-D$4)^2-2*(D$4*B144^2)*(2*K$2-D$4)+K$2*B144^3),D$15/(24*K$2*K$3)*(D$4^2*(K$2-B144))*(4*B144*K$2-2*B144^2-D$4^2))","v":4.1732435259778177E-6},{"$f":"IF(B144<I$4,B144*D$15/(24*K$2*K$3)*((I$4^2)*(2*K$2-I$4)^2-2*(I$4*B144^2)*(2*K$2-I$4)+K$2*B144^3),D$15/(24*K$2*K$3)*(I$4^2*(K$2-B144))*(4*B144*K$2-2*B144^2-I$4^2))","v":1.5801055164706868E-5},{"$f":"IF(B144<D$5,B144*D$16/(24*K$2*K$3)*((D$5^2)*(2*K$2-D$5)^2-2*(D$5*B144^2)*(2*K$2-D$5)+K$2*B144^3),D$16/(24*K$2*K$3)*(D$5^2*(K$2-B144))*(4*B144*K$2-2*B144^2-D$5^2))","v":3.2289735733942691E-5},{"$f":"IF(B144<I$5,B144*D$16/(24*K$2*K$3)*((I$5^2)*(2*K$2-I$5)^2-2*(I$5*B144^2)*(2*K$2-I$5)+K$2*B144^3),D$16/(24*K$2*K$3)*(I$5^2*(K$2-B144))*(4*B144*K$2-2*B144^2-I$5^2))","v":5.038392653704502E-5},null,0.40444562221666264,0.62936315836877688,{"$f":"C$17*$E$6/(6*8*'Steel Eurocode 3'!$X$8*'Steel Eurocode 3'!$E$10)*100*1000*AK144","v":0.54233417463097366},{"$f":"C$18*E$7/(6*8*'Steel Eurocode 3'!X$8*'Steel Eurocode 3'!E$10)*100*1000*Y144","v":0.39713835865788255},{"$f":"C$14*B144*(8^3-2*8*B144^2+B144^3)/24/('Steel Eurocode 3'!E$10*'Steel Eurocode 3'!X$8)*100*1000","v":3.2271746607609058},null,{"$f":"IF(B144<D$6,B144*(8^2-B144^2-E$6^2),8/E$6*(B144-D$6)^3+(8^2-E$6^2)*B144-B144^3)","v":104.05006540800007},{"$f":"IF(B144<D$7,B144*(8^2-B144^2-E$7^2),8/E$7*(B144-D$7)^3+(8^2-E$7^2)*B144-B144^3)","v":114.29006540800007},{"$f":"IF(B144<D$4,B144*C$15/(24*K$2*K$3)*((D$4^2)*(2*K$2-D$4)^2-2*(D$4*B144^2)*(2*K$2-D$4)+K$2*B144^3),C$15/(24*K$2*K$3)*(D$4^2*(K$2-B144))*(4*B144*K$2-2*B144^2-D$4^2))","v":1.4515629655575019E-6},{"$f":"IF(B144<I$4,B144*C$15/(24*K$2*K$3)*((I$4^2)*(2*K$2-I$4)^2-2*(I$4*B144^2)*(2*K$2-I$4)+K$2*B144^3),C$15/(24*K$2*K$3)*(I$4^2*(K$2-B144))*(4*B144*K$2-2*B144^2-I$4^2))","v":5.4960191877241283E-6},{"$f":"IF(B144<D$5,B144*C$16/(24*K$2*K$3)*((D$5^2)*(2*K$2-D$5)^2-2*(D$5*B144^2)*(2*K$2-D$5)+K$2*B144^3),C$16/(24*K$2*K$3)*(D$5^2*(K$2-B144))*(4*B144*K$2-2*B144^2-D$5^2))","v":1.1231212429197459E-5},{"$f":"IF(B144<I$5,B144*C$16/(24*K$2*K$3)*((I$5^2)*(2*K$2-I$5)^2-2*(I$5*B144^2)*(2*K$2-I$5)+K$2*B144^3),C$16/(24*K$2*K$3)*(I$5^2*(K$2-B144))*(4*B144*K$2-2*B144^2-I$5^2))","v":1.7524844012885227E-5}]
[66,{"$f":"B144+8/250","v":2.0800000000000014},-412.70337360000019,123.94283999999993,-15.706852689579414,-15.706852689579414,-5.2622254779973892,-7.6640625,22.9921875,15.328125,10.21875,{"$f":"'Graph Properties'!C$3*8/2-B145*C$3","v":83.067839999999933},45.371249999999989,47.823750000000032,31.882500000000022,21.255000000000013,{"$f":"C$3*8/2*'Graph Properties'!B145-'Graph Properties'!C$3*B145^2/2","v":266.3708736000001},1.1733807438912522,1.8315152614460855,{"$f":"D$17*$E$6/(6*8*'Steel Eurocode 3'!$X$8*'Steel Eurocode 3'!$E$10)*100*1000*X145","v":1.5794560920690528},{"$f":"D$18*E$7/(6*8*'Steel Eurocode 3'!X$8*'Steel Eurocode 3'!E$10)*100*1000*Y145","v":1.1568680955160824},{"$f":"D$14*B145*(8^3-2*8*B145^2+B145^3)/24/('Steel Eurocode 3'!E$10*'Steel Eurocode 3'!X$8)*100*1000","v":9.9656324966569407},null,105.40108800000006,115.80108800000006,4.2069770383343074E-6,1.5940784477246831E-5,3.2611619887137589E-5,5.0926772501598442E-5,null,0.40813243265782678,0.63704878658994257,{"$f":"C$17*$E$6/(6*8*'Steel Eurocode 3'!$X$8*'Steel Eurocode 3'!$E$10)*100*1000*AK145","v":0.54937603202401841},{"$f":"C$18*E$7/(6*8*'Steel Eurocode 3'!X$8*'Steel Eurocode 3'!E$10)*100*1000*Y145","v":0.40238890278820244},{"$f":"C$14*B145*(8^3-2*8*B145^2+B145^3)/24/('Steel Eurocode 3'!E$10*'Steel Eurocode 3'!X$8)*100*1000","v":3.2652793239373992},null,105.40108800000006,115.80108800000006,1.4632963611597592E-6,5.544620687738027E-6,1.1343172134656553E-5,1.7713660000555979E-5]
[67,2.1120000000000014,{"$f":"-SUM(M146:Q146)","v":-416.64739305600017},{"$f":"H146+I146+J146+K146+L146","v":122.55837599999994},{"$f":"IF(E$10=2,G146,F146)","v":-15.888700942748947},{"$f":"-SUM(R146:V146)","v":-15.888700942748947},{"$f":"-SUM(AE146:AI146)","v":-5.3231634914239034},{"$f":"IF(B146>D$4, IF(B146<(D$4+E$4),G$4-C$4*(B146-D$4),H$4),G$4)","v":-7.6640625},{"$f":"IF(B146>D$5, IF(B146<(D$5+E$5),G$5-C$5*(B146-D$5),H$5),G$5)","v":22.9921875},{"$f":"IF(B146>D$6,-H$6,G$6)","v":15.328125},{"$f":"IF(B146>D$7,-H$7,G$7)","v":10.21875},{"$f":"'Graph Properties'!C$3*8/2-B146*C$3","v":81.683375999999939},45.125999999999983,48.559500000000035,{"$f":"IF(B146<D$6,G$6*B146,G$6*B146-C$6*(B146-D$6))","v":32.373000000000019},{"$f":"IF(B146<D$7,G$7*B146,G$7*B146-C$7*(B146-D$7))","v":21.582000000000015},{"$f":"C$3*8/2*'Graph Properties'!B146-'Graph Properties'!C$3*B146^2/2","v":269.00689305600008},{"$f":"(AA146-Z146)*1000*100","v":1.1837077995163043},{"$f":"(AC146-AB146)*1000*100","v":1.8533241871403563},{"$f":"D$17*$E$6/(6*8*'Steel Eurocode 3'!$X$8*'Steel Eurocode 3'!$E$10)*100*1000*X146","v":1.5995099284463359},{"$f":"D$18*E$7/(6*8*'Steel Eurocode 3'!X$8*'Steel Eurocode 3'!E$10)*100*1000*Y146","v":1.171835740805605},{"$f":"D$14*B146*(8^3-2*8*B146^2+B146^3)/24/('Steel Eurocode 3'!E$10*'Steel Eurocode 3'!X$8)*100*1000","v":10.080323286840347},null,106.73933107200006,117.29933107200007,4.2398021360464807E-6,1.6076880131209524E-5,3.2926367547980999E-5,5.1459609419384561E-5,null,{"$f":"(AN146-AM146)*1000*100","v":0.41172445200567104},{"$f":"(AP146-AO146)*1000*100","v":0.64463449987490673},{"$f":"C$17*$E$6/(6*8*'Steel Eurocode 3'!$X$8*'Steel Eurocode 3'!$E$10)*100*1000*AK146","v":0.55635127945959506},{"$f":"C$18*E$7/(6*8*'Steel Eurocode 3'!X$8*'Steel Eurocode 3'!E$10)*100*1000*Y146","v":0.40759504028021037},{"$f":"C$14*B146*(8^3-2*8*B146^2+B146^3)/24/('Steel Eurocode 3'!E$10*'Steel Eurocode 3'!X$8)*100*1000","v":3.3028582198035203},null,106.73933107200006,117.29933107200007,1.4747137864509498E-6,5.59195830650766E-6,1.1452649581906434E-5,1.7898994580655501E-5]
[68,2.1440000000000015,-420.54710966400023,121.17391199999993,-16.068041865144675,-16.068041865144675,-5.3832620791068893,-7.6640625,22.9921875,15.328125,10.21875,{"$f":"'Graph Properties'!C$3*8/2-B147*C$3","v":80.29891199999993},44.880749999999985,49.295250000000031,32.863500000000023,21.909000000000017,{"$f":"C$3*8/2*'Graph Properties'!B147-'Graph Properties'!C$3*B147^2/2","v":271.59860966400015},1.1937638038528899,1.8748414380785596,{"$f":"D$17*$E$6/(6*8*'Steel Eurocode 3'!$X$8*'Steel Eurocode 3'!$E$10)*100*1000*X147","v":1.6193693149862409},{"$f":"D$18*E$7/(6*8*'Steel Eurocode 3'!X$8*'Steel Eurocode 3'!E$10)*100*1000*Y147","v":1.1866737528702089},{"$f":"D$14*B147*(8^3-2*8*B147^2+B147^3)/24/('Steel Eurocode 3'!E$10*'Steel Eurocode 3'!X$8)*100*1000","v":10.193393555356774},null,108.06459801600006,118.78459801600006,4.2717237294637659E-6,1.6209361767992665E-5,3.3233951886323648E-5,5.1982366267109244E-5,null,0.4152221926444834,0.65211876107080347,{"$f":"C$17*$E$6/(6*8*'Steel Eurocode 3'!$X$8*'Steel Eurocode 3'!$E$10)*100*1000*AK147","v":0.56325889216912717},{"$f":"C$18*E$7/(6*8*'Steel Eurocode 3'!X$8*'Steel Eurocode 3'!E$10)*100*1000*Y147","v":0.41275608795485524},{"$f":"C$14*B147*(8^3-2*8*B147^2+B147^3)/24/('Steel Eurocode 3'!E$10*'Steel Eurocode 3'!X$8)*100*1000","v":3.3399061452676198},null,108.06459801600006,118.78459801600006,1.4858169493787008E-6,5.6380388758235351E-6,1.1559635438721268E-5,1.8080823049429303E-5]
[69,2.1760000000000015,-424.40252342400015,119.78944799999994,-16.244851987259779,-16.244851987259779,-5.442513392685405,-7.6640625,22.9921875,15.328125,10.21875,{"$f":"'Graph Properties'!C$3*8/2-B148*C$3","v":78.914447999999936},44.635499999999986,50.031000000000034,33.354000000000021,22.236000000000015,{"$f":"C$3*8/2*'Graph Properties'!B148-'Graph Properties'!C$3*B148^2/2","v":274.14602342400008},1.2035502300058383,1.8960625949462104,{"$f":"D$17*$E$6/(6*8*'Steel Eurocode 3'!$X$8*'Steel Eurocode 3'!$E$10)*100*1000*X148","v":1.6390313054791106},{"$f":"D$18*E$7/(6*8*'Steel Eurocode 3'!X$8*'Steel Eurocode 3'!E$10)*100*1000*Y148","v":1.201380167570123},{"$f":"D$14*B148*(8^3-2*8*B148^2+B148^3)/24/('Steel Eurocode 3'!E$10*'Steel Eurocode 3'!X$8)*100*1000","v":10.304827689258497},null,109.37669222400007,120.25669222400008,4.3027467289355915E-6,1.6338249028993975E-5,3.3534348586115154E-5,5.2494974535577259E-5,null,0.41862616695855237,0.65950003302476867,{"$f":"C$17*$E$6/(6*8*'Steel Eurocode 3'!$X$8*'Steel Eurocode 3'!$E$10)*100*1000*AK148","v":0.5700978453840384},{"$f":"C$18*E$7/(6*8*'Steel Eurocode 3'!X$8*'Steel Eurocode 3'!E$10)*100*1000*Y148","v":0.41787136263308616},{"$f":"C$14*B148*(8^3-2*8*B148^2+B148^3)/24/('Steel Eurocode 3'!E$10*'Steel Eurocode 3'!X$8)*100*1000","v":3.3764179846849594},null,109.37669222400007,120.25669222400008,1.4966075578906403E-6,5.6828692274761635E-6,1.1664121247344401E-5,1.8259121577592089E-5]
[70,2.2080000000000015,-428.21363433600015,118.40498399999993,-16.419108106475448,-16.419108106475448,-5.5009096712454371,-7.6640625,22.9921875,15.328125,10.21875,{"$f":"'Graph Properties'!C$3*8/2-B149*C$3","v":77.529983999999928},44.390249999999988,50.766750000000037,33.844500000000025,22.563000000000017,{"$f":"C$3*8/2*'Graph Properties'!B149-'Graph Properties'!C$3*B149^2/2","v":276.64913433600009},1.213068551079977,1.916983238428823,{"$f":"D$17*$E$6/(6*8*'Steel Eurocode 3'!$X$8*'Steel Eurocode 3'!$E$10)*100*1000*X149","v":1.6584929537152877},{"$f":"D$18*E$7/(6*8*'Steel Eurocode 3'!X$8*'Steel Eurocode 3'!E$10)*100*1000*Y149","v":1.2159530207655751},{"$f":"D$14*B149*(8^3-2*8*B149^2+B149^3)/24/('Steel Eurocode 3'!E$10*'Steel Eurocode 3'!X$8)*100*1000","v":10.414610342485787},null,110.67541708800006,121.71541708800007,4.3328760448113877E-6,1.6463561555611159E-5,3.3827535845404066E-5,5.2997368229692297E-5,null,0.42193688733216583,0.66677677858393847,{"$f":"C$17*$E$6/(6*8*'Steel Eurocode 3'!$X$8*'Steel Eurocode 3'!$E$10)*100*1000*AK149","v":0.57686711433575222},{"$f":"C$18*E$7/(6*8*'Steel Eurocode 3'!X$8*'Steel Eurocode 3'!E$10)*100*1000*Y149","v":0.42294018113585208},{"$f":"C$14*B149*(8^3-2*8*B149^2+B149^3)/24/('Steel Eurocode 3'!E$10*'Steel Eurocode 3'!X$8)*100*1000","v":3.4123887098577286},null,110.67541708800006,121.71541708800007,1.5070873199343953E-6,5.7264561932560538E-6,1.1766099424488369E-5,1.8433867210327754E-5]
[71,2.2400000000000015,-431.98044240000013,117.02051999999993,-16.590787287060859,-16.590787287060859,-5.5584432413198819,-7.6640625,22.9921875,15.328125,10.21875,{"$f":"'Graph Properties'!C$3*8/2-B150*C$3","v":76.145519999999934},44.144999999999982,51.502500000000033,34.335000000000022,22.890000000000015,{"$f":"C$3*8/2*'Graph Properties'!B150-'Graph Properties'!C$3*B150^2/2","v":279.10794240000007},1.2223202401801352,1.9375989492119106,{"$f":"D$17*$E$6/(6*8*'Steel Eurocode 3'!$X$8*'Steel Eurocode 3'!$E$10)*100*1000*X150","v":1.677751313485115},{"$f":"D$18*E$7/(6*8*'Steel Eurocode 3'!X$8*'Steel Eurocode 3'!E$10)*100*1000*Y150","v":1.2303903483167939},{"$f":"D$14*B150*(8^3-2*8*B150^2+B150^3)/24/('Steel Eurocode 3'!E$10*'Steel Eurocode 3'!X$8)*100*1000","v":10.522726435866904},null,111.96057600000006,123.16057600000006,4.3621165874405811E-6,1.6585318989241933E-5,3.4113494376337824E-5,5.3489483868456928E-5,null,0.42515486614961229,0.6739474605954473,{"$f":"C$17*$E$6/(6*8*'Steel Eurocode 3'!$X$8*'Steel Eurocode 3'!$E$10)*100*1000*AK150","v":0.58356567425569217},{"$f":"C$18*E$7/(6*8*'Steel Eurocode 3'!X$8*'Steel Eurocode 3'!E$10)*100*1000*Y150","v":0.42796186028410216},{"$f":"C$14*B150*(8^3-2*8*B150^2+B150^3)/24/('Steel Eurocode 3'!E$10*'Steel Eurocode 3'!X$8)*100*1000","v":3.4478133800350279},null,111.96057600000006,123.16057600000006,1.5172579434575933E-6,5.7688066049537163E-6,1.1865563261334895E-5,1.8605037867289368E-5]
[72,2.2720000000000016,-435.70294761600019,115.63605599999993,-16.759866860173187,-16.759866860173187,-5.6151065168885577,-7.6640625,22.9921875,15.328125,10.21875,{"$f":"'Graph Properties'!C$3*8/2-B151*C$3","v":74.761055999999925},43.899749999999983,52.238250000000036,34.825500000000027,23.217000000000017,{"$f":"C$3*8/2*'Graph Properties'!B151-'Graph Properties'!C$3*B151^2/2","v":281.52244761600014},1.231306770411142,1.9579053079809874,{"$f":"D$17*$E$6/(6*8*'Steel Eurocode 3'!$X$8*'Steel Eurocode 3'!$E$10)*100*1000*X151","v":1.6968034385789355},{"$f":"D$18*E$7/(6*8*'Steel Eurocode 3'!X$8*'Steel Eurocode 3'!E$10)*100*1000*Y151","v":1.2446901860840085},{"$f":"D$14*B151*(8^3-2*8*B151^2+B151^3)/24/('Steel Eurocode 3'!E$10*'Steel Eurocode 3'!X$8)*100*1000","v":10.629161157118112},null,113.23197235200007,124.59197235200008,4.3904732671726027E-6,1.6703540971284024E-5,3.4392207405162772E-5,5.3971260484972644E-5,null,0.42828061579517984,0.68101054190642996,{"$f":"C$17*$E$6/(6*8*'Steel Eurocode 3'!$X$8*'Steel Eurocode 3'!$E$10)*100*1000*AK151","v":0.59019250037528193},{"$f":"C$18*E$7/(6*8*'Steel Eurocode 3'!X$8*'Steel Eurocode 3'!E$10)*100*1000*Y151","v":0.43293571689878546},{"$f":"C$14*B151*(8^3-2*8*B151^2+B151^3)/24/('Steel Eurocode 3'!E$10*'Steel Eurocode 3'!X$8)*100*1000","v":3.4826871419128809},null,113.23197235200007,124.59197235200008,1.5271211364078616E-6,5.8099272943596597E-6,1.1962506923534878E-5,1.8772612342599179E-5]
[73,2.3040000000000016,-439.3811499840001,114.25159199999993,-16.926324423857594,-16.926324423857594,-5.6708919993782025,-7.6640625,22.9921875,15.328125,10.21875,{"$f":"'Graph Properties'!C$3*8/2-B152*C$3","v":73.376591999999931},43.654499999999985,52.974000000000039,35.316000000000024,23.544000000000015,{"$f":"C$3*8/2*'Graph Properties'!B152-'Graph Properties'!C$3*B152^2/2","v":283.89264998400006},1.2400296148778254,1.9778978954215665,{"$f":"D$17*$E$6/(6*8*'Steel Eurocode 3'!$X$8*'Steel Eurocode 3'!$E$10)*100*1000*X152","v":1.7156463827870916},{"$f":"D$18*E$7/(6*8*'Steel Eurocode 3'!X$8*'Steel Eurocode 3'!E$10)*100*1000*Y152","v":1.2588505699274464},{"$f":"D$14*B152*(8^3-2*8*B152^2+B152^3)/24/('Steel Eurocode 3'!E$10*'Steel Eurocode 3'!X$8)*100*1000","v":10.733899960843665},null,114.48940953600007,126.00940953600006,4.4179509943568802E-6,1.6818247143135134E-5,3.4663660672224187E-5,5.4442639626439851E-5,null,0.43131464865315661,0.68796448536402321,{"$f":"C$17*$E$6/(6*8*'Steel Eurocode 3'!$X$8*'Steel Eurocode 3'!$E$10)*100*1000*AK152","v":0.59674656792594483},{"$f":"C$18*E$7/(6*8*'Steel Eurocode 3'!X$8*'Steel Eurocode 3'!E$10)*100*1000*Y152","v":0.43786106780085082},{"$f":"C$14*B152*(8^3-2*8*B152^2+B152^3)/24/('Steel Eurocode 3'!E$10*'Steel Eurocode 3'!X$8)*100*1000","v":3.5170052296342273},null,114.48940953600007,126.00940953600006,1.5366786067328276E-6,5.8498250932643935E-6,1.2056925451208411E-5,1.8936570304848644E-5]
[74,2.3360000000000016,-443.01504950400022,112.86712799999992,-17.090137843047248,-17.090137843047248,-5.7257922776624728,-7.6640625,22.9921875,15.328125,10.21875,{"$f":"'Graph Properties'!C$3*8/2-B153*C$3","v":71.992127999999923},43.409249999999986,53.709750000000035,35.806500000000028,23.871000000000016,{"$f":"C$3*8/2*'Graph Properties'!B153-'Graph Properties'!C$3*B153^2/2","v":286.21854950400012},1.2484902466850138,1.9975722922191665,{"$f":"D$17*$E$6/(6*8*'Steel Eurocode 3'!$X$8*'Steel Eurocode 3'!$E$10)*100*1000*X153","v":1.7342771998999262},{"$f":"D$18*E$7/(6*8*'Steel Eurocode 3'!X$8*'Steel Eurocode 3'!E$10)*100*1000*Y153","v":1.272869535707337},{"$f":"D$14*B153*(8^3-2*8*B153^2+B153^3)/24/('Steel Eurocode 3'!E$10*'Steel Eurocode 3'!X$8)*100*1000","v":10.836928568535804},null,115.73269094400007,127.41269094400008,4.444554679342841E-6,1.6929457146192981E-5,3.4927842431966213E-5,5.4903565354157877E-5,null,0.43425747710783091,0.69480775381536197,{"$f":"C$17*$E$6/(6*8*'Steel Eurocode 3'!$X$8*'Steel Eurocode 3'!$E$10)*100*1000*AK153","v":0.60322685213910476},{"$f":"C$18*E$7/(6*8*'Steel Eurocode 3'!X$8*'Steel Eurocode 3'!E$10)*100*1000*Y153","v":0.44273722981124758},{"$f":"C$14*B153*(8^3-2*8*B153^2+B153^3)/24/('Steel Eurocode 3'!E$10*'Steel Eurocode 3'!X$8)*100*1000","v":3.5507629647889276},null,115.73269094400007,127.41269094400008,1.5459320623801187E-6,5.8885068334584279E-6,1.214881475894477E-5,1.909689229709839E-5]
[75,2.3680000000000017,-446.60464617600019,111.48266399999993,-17.251285249563303,-17.251285249563303,-5.7798000280619384,-7.6640625,22.9921875,15.328125,10.21875,{"$f":"'Graph Properties'!C$3*8/2-B154*C$3","v":70.607663999999929},43.163999999999987,54.445500000000038,36.297000000000025,24.198000000000018,{"$f":"C$3*8/2*'Graph Properties'!B154-'Graph Properties'!C$3*B154^2/2","v":288.5001461760001},1.2566901389375371,2.0169240790592955,{"$f":"D$17*$E$6/(6*8*'Steel Eurocode 3'!$X$8*'Steel Eurocode 3'!$E$10)*100*1000*X154","v":1.7526929437077821},{"$f":"D$18*E$7/(6*8*'Steel Eurocode 3'!X$8*'Steel Eurocode 3'!E$10)*100*1000*Y154","v":1.2867451192839083},{"$f":"D$14*B154*(8^3-2*8*B154^2+B154^3)/24/('Steel Eurocode 3'!E$10*'Steel Eurocode 3'!X$8)*100*1000","v":10.938232968574782},null,116.96161996800006,128.80161996800007,4.4702892324799163E-6,1.7037190621855285E-5,3.5184743452931929E-5,5.5353984243524881E-5,null,0.43710961354349104,0.70153881010758112,{"$f":"C$17*$E$6/(6*8*'Steel Eurocode 3'!$X$8*'Steel Eurocode 3'!$E$10)*100*1000*AK154","v":0.60963232824618507},{"$f":"C$18*E$7/(6*8*'Steel Eurocode 3'!X$8*'Steel Eurocode 3'!E$10)*100*1000*Y154","v":0.44756351975092451},{"$f":"C$14*B154*(8^3-2*8*B154^2+B154^3)/24/('Steel Eurocode 3'!E$10*'Steel Eurocode 3'!X$8)*100*1000","v":3.5839557564137561},null,116.96161996800006,128.80161996800007,1.554883211297362E-6,5.9259793467322726E-6,1.2238171635802412E-5,1.9253559736878223E-5]
[76,2.4000000000000017,-450.14994000000013,110.09819999999992,-17.409745042114928,-17.409745042114928,-5.8329080143440954,-7.6640625,22.9921875,15.328125,10.21875,{"$f":"'Graph Properties'!C$3*8/2-B155*C$3","v":69.22319999999992},42.918749999999982,55.181250000000041,36.787500000000023,24.525000000000016,{"$f":"C$3*8/2*'Graph Properties'!B155-'Graph Properties'!C$3*B155^2/2","v":290.73744000000011},1.2646307647402222,2.0359488366274716,{"$f":"D$17*$E$6/(6*8*'Steel Eurocode 3'!$X$8*'Steel Eurocode 3'!$E$10)*100*1000*X155","v":1.7708906680010021},{"$f":"D$18*E$7/(6*8*'Steel Eurocode 3'!X$8*'Steel Eurocode 3'!E$10)*100*1000*Y155","v":1.300475356517389},{"$f":"D$14*B155*(8^3-2*8*B155^2+B155^3)/24/('Steel Eurocode 3'!E$10*'Steel Eurocode 3'!X$8)*100*1000","v":11.037799416228841},null,118.17600000000007,130.17600000000007,4.4951595641175343E-6,1.7141467211519758E-5,3.5434357017763334E-5,5.5793845384038048E-5,null,0.43987157034442514,0.70815611708781645,{"$f":"C$17*$E$6/(6*8*'Steel Eurocode 3'!$X$8*'Steel Eurocode 3'!$E$10)*100*1000*AK155","v":0.61596197147860943},{"$f":"C$18*E$7/(6*8*'Steel Eurocode 3'!X$8*'Steel Eurocode 3'!E$10)*100*1000*Y155","v":0.45233925444083084},{"$f":"C$14*B155*(8^3-2*8*B155^2+B155^3)/24/('Steel Eurocode 3'!E$10*'Steel Eurocode 3'!X$8)*100*1000","v":3.6165791009924133},null,118.17600000000007,130.17600000000007,1.5635337614321855E-6,5.962249464876437E-6,1.2324993745308987E-5,1.9406554916187152E-5]
[77,2.4320000000000017,-453.65093097600015,108.71373599999993,-17.56549588629926,-17.56549588629926,-5.8851090877233503,-7.6640625,22.9921875,15.328125,10.21875,{"$f":"'Graph Properties'!C$3*8/2-B156*C$3","v":67.838735999999926},42.673499999999983,55.917000000000037,37.278000000000027,24.852000000000018,{"$f":"C$3*8/2*'Graph Properties'!B156-'Graph Properties'!C$3*B156^2/2","v":292.93043097600008},1.2723135971978987,2.0546421456092081,{"$f":"D$17*$E$6/(6*8*'Steel Eurocode 3'!$X$8*'Steel Eurocode 3'!$E$10)*100*1000*X156","v":1.7888674265699285},{"$f":"D$18*E$7/(6*8*'Steel Eurocode 3'!X$8*'Steel Eurocode 3'!E$10)*100*1000*Y156","v":1.3140582832680074},{"$f":"D$14*B156*(8^3-2*8*B156^2+B156^3)/24/('Steel Eurocode 3'!E$10*'Steel Eurocode 3'!X$8)*100*1000","v":11.135614433654215},null,119.37563443200006,131.53563443200008,4.5191705846051211E-6,1.7242306556584109E-5,3.5676678923201297E-5,5.6223100379293379E-5,null,0.44254385989492118,0.71465813760320285,{"$f":"C$17*$E$6/(6*8*'Steel Eurocode 3'!$X$8*'Steel Eurocode 3'!$E$10)*100*1000*AK156","v":0.62221475706780116},{"$f":"C$18*E$7/(6*8*'Steel Eurocode 3'!X$8*'Steel Eurocode 3'!E$10)*100*1000*Y156","v":0.45706375070191557},{"$f":"C$14*B156*(8^3-2*8*B156^2+B156^3)/24/('Steel Eurocode 3'!E$10*'Steel Eurocode 3'!X$8)*100*1000","v":3.6486285824555091},null,119.37563443200006,131.53563443200008,1.5718854207322159E-6,5.997324019681428E-6,1.2409279625461321E-5,1.955586100149335E-5]
[78,2.4640000000000017,-457.10761910400021,107.32927199999992,-17.718516714601446,-17.718516714601446,-5.936396186861038,-7.6640625,22.9921875,15.328125,10.21875,{"$f":"'Graph Properties'!C$3*8/2-B157*C$3","v":66.454271999999918},42.428249999999984,56.65275000000004,37.768500000000024,25.179000000000016,{"$f":"C$3*8/2*'Graph Properties'!B157-'Graph Properties'!C$3*B157^2/2","v":295.07911910400014},1.2797401094153953,2.0729995866900177,{"$f":"D$17*$E$6/(6*8*'Steel Eurocode 3'!$X$8*'Steel Eurocode 3'!$E$10)*100*1000*X157","v":1.8066202732049048},{"$f":"D$18*E$7/(6*8*'Steel Eurocode 3'!X$8*'Steel Eurocode 3'!E$10)*100*1000*Y157","v":1.3274919353959924},{"$f":"D$14*B157*(8^3-2*8*B157^2+B157^3)/24/('Steel Eurocode 3'!E$10*'Steel Eurocode 3'!X$8)*100*1000","v":11.231664809895136},null,120.56032665600006,132.88032665600008,4.5423272042921083E-6,1.7339728298446061E-5,3.591170748008564E-5,5.6641703346985819E-5,null,0.44512699457926785,0.7210433345008761,{"$f":"C$17*$E$6/(6*8*'Steel Eurocode 3'!$X$8*'Steel Eurocode 3'!$E$10)*100*1000*AK157","v":0.62838966024518428},{"$f":"C$18*E$7/(6*8*'Steel Eurocode 3'!X$8*'Steel Eurocode 3'!E$10)*100*1000*Y157","v":0.46173632535512771},{"$f":"C$14*B157*(8^3-2*8*B157^2+B157^3)/24/('Steel Eurocode 3'!E$10*'Steel Eurocode 3'!X$8)*100*1000","v":3.6800998721805818},null,120.56032665600006,132.88032665600008,1.5799398971450812E-6,6.0312098429377594E-6,1.2491028688725438E-5,1.9701462033734199E-5]
[79,2.4960000000000018,-460.52000438400023,105.94480799999992,-17.868786726394628,-17.868786726394628,-5.986762337865402,-7.6640625,22.9921875,15.328125,10.21875,{"$f":"'Graph Properties'!C$3*8/2-B158*C$3","v":65.069807999999924},42.182999999999986,57.388500000000043,38.259000000000029,25.506000000000018,{"$f":"C$3*8/2*'Graph Properties'!B158-'Graph Properties'!C$3*B158^2/2","v":297.18350438400012},1.2869117744975405,2.0910167405554172,{"$f":"D$17*$E$6/(6*8*'Steel Eurocode 3'!$X$8*'Steel Eurocode 3'!$E$10)*100*1000*X158","v":1.8241462616962736},{"$f":"D$18*E$7/(6*8*'Steel Eurocode 3'!X$8*'Steel Eurocode 3'!E$10)*100*1000*Y158","v":1.3407743487615722},{"$f":"D$14*B158*(8^3-2*8*B158^2+B158^3)/24/('Steel Eurocode 3'!E$10*'Steel Eurocode 3'!X$8)*100*1000","v":11.325937600883826},null,121.72988006400007,134.20988006400009,4.5646343335279254E-6,1.743375207850333E-5,3.613944351335503E-5,5.7049610918909199E-5,null,0.44762148678175312,0.72731017062797132,{"$f":"C$17*$E$6/(6*8*'Steel Eurocode 3'!$X$8*'Steel Eurocode 3'!$E$10)*100*1000*AK158","v":0.63448565624218201},{"$f":"C$18*E$7/(6*8*'Steel Eurocode 3'!X$8*'Steel Eurocode 3'!E$10)*100*1000*Y158","v":0.46635629522141636},{"$f":"C$14*B158*(8^3-2*8*B158^2+B158^3)/24/('Steel Eurocode 3'!E$10*'Steel Eurocode 3'!X$8)*100*1000","v":3.7109887289920791},null,121.72988006400007,134.20988006400009,1.5876988986184087E-6,6.0639137664359397E-6,1.2570241222036534E-5,1.9843342928316247E-5]
[80,2.5280000000000018,-463.88808681600017,104.56034399999992,-18.016285387939941,-18.016285387939941,-6.0362006542916102,-7.6640625,22.9921875,15.328125,10.21875,{"$f":"'Graph Properties'!C$3*8/2-B159*C$3","v":63.685343999999915},41.93774999999998,58.124250000000039,38.749500000000026,25.83300000000002,{"$f":"C$3*8/2*'Graph Properties'!B159-'Graph Properties'!C$3*B159^2/2","v":299.24358681600012},1.2938300655491619,2.1086891878909189,{"$f":"D$17*$E$6/(6*8*'Steel Eurocode 3'!$X$8*'Steel Eurocode 3'!$E$10)*100*1000*X159","v":1.8414424458343768},{"$f":"D$18*E$7/(6*8*'Steel Eurocode 3'!X$8*'Steel Eurocode 3'!E$10)*100*1000*Y159","v":1.3539035592249751},{"$f":"D$14*B159*(8^3-2*8*B159^2+B159^3)/24/('Steel Eurocode 3'!E$10*'Steel Eurocode 3'!X$8)*100*1000","v":11.418420129440509},null,122.88409804800006,135.52409804800007,4.5860968826619973E-6,1.7524397538153618E-5,3.6359890362047106E-5,5.7446782240956294E-5,null,0.45002784888666503,0.73345710883162396,{"$f":"C$17*$E$6/(6*8*'Steel Eurocode 3'!$X$8*'Steel Eurocode 3'!$E$10)*100*1000*AK159","v":0.64050172029021801},{"$f":"C$18*E$7/(6*8*'Steel Eurocode 3'!X$8*'Steel Eurocode 3'!E$10)*100*1000*Y159","v":0.47092297712173042},{"$f":"C$14*B159*(8^3-2*8*B159^2+B159^3)/24/('Steel Eurocode 3'!E$10*'Steel Eurocode 3'!X$8)*100*1000","v":3.7412909991613725},null,122.88409804800006,135.52409804800007,1.595164133099825E-6,6.0954426219664752E-6,1.2646918386798993E-5,1.9981489475115232E-5]
[81,2.5600000000000018,-467.21186640000019,103.17587999999992,-18.160992432386522,-18.160992432386522,-6.0847043371417477,-7.6640625,22.9921875,15.328125,10.21875,{"$f":"'Graph Properties'!C$3*8/2-B160*C$3","v":62.300879999999921},41.692499999999981,58.860000000000042,39.24000000000003,26.160000000000018,{"$f":"C$3*8/2*'Graph Properties'!B160-'Graph Properties'!C$3*B160^2/2","v":301.25936640000009},1.30049645567509,2.1260125093820381,{"$f":"D$17*$E$6/(6*8*'Steel Eurocode 3'!$X$8*'Steel Eurocode 3'!$E$10)*100*1000*X160","v":1.8585058794095584},{"$f":"D$18*E$7/(6*8*'Steel Eurocode 3'!X$8*'Steel Eurocode 3'!E$10)*100*1000*Y160","v":1.3668776026464302},{"$f":"D$14*B160*(8^3-2*8*B160^2+B160^3)/24/('Steel Eurocode 3'!E$10*'Steel Eurocode 3'!X$8)*100*1000","v":11.509099985273405},null,124.02278400000006,136.82278400000007,4.6067197620437558E-6,1.7611684318794655E-5,3.6573053879298379E-5,5.7833178973118762E-5,null,0.45234659327829213,0.7394826119589698,{"$f":"C$17*$E$6/(6*8*'Steel Eurocode 3'!$X$8*'Steel Eurocode 3'!$E$10)*100*1000*AK160","v":0.64643682762071586},{"$f":"C$18*E$7/(6*8*'Steel Eurocode 3'!X$8*'Steel Eurocode 3'!E$10)*100*1000*Y160","v":0.47543568787701912},{"$f":"C$14*B160*(8^3-2*8*B160^2+B160^3)/24/('Steel Eurocode 3'!E$10*'Steel Eurocode 3'!X$8)*100*1000","v":3.7710026164067507},null,124.02278400000006,136.82278400000007,1.6023373085369584E-6,6.1258032413198795E-6,1.272106221888639E-5,2.0115888338476089E-5]
[82,2.5920000000000019,-470.49134313600018,101.79141599999991,-18.302887859771484,-18.302887859771484,-6.1322666748648178,-7.6640625,22.9921875,15.328125,10.21875,{"$f":"'Graph Properties'!C$3*8/2-B161*C$3","v":60.916415999999913},41.447249999999983,59.595750000000045,39.730500000000028,26.48700000000002,{"$f":"C$3*8/2*'Graph Properties'!B161-'Graph Properties'!C$3*B161^2/2","v":303.23084313600009},1.3069124179801523,2.1429822857142873,{"$f":"D$17*$E$6/(6*8*'Steel Eurocode 3'!$X$8*'Steel Eurocode 3'!$E$10)*100*1000*X161","v":1.8753336162121603},{"$f":"D$18*E$7/(6*8*'Steel Eurocode 3'!X$8*'Steel Eurocode 3'!E$10)*100*1000*Y161","v":1.3796945148861657},{"$f":"D$14*B161*(8^3-2*8*B161^2+B161^3)/24/('Steel Eurocode 3'!E$10*'Steel Eurocode 3'!X$8)*100*1000","v":11.59796502497872},null,125.14574131200006,138.10574131200008,4.6265078820226286E-6,1.769563206182415E-5,3.6778942432344267E-5,5.8208765289487139E-5,null,0.45457823234092237,0.74538514285714352,{"$f":"C$17*$E$6/(6*8*'Steel Eurocode 3'!$X$8*'Steel Eurocode 3'!$E$10)*100*1000*AK161","v":0.65228995346509921},{"$f":"C$18*E$7/(6*8*'Steel Eurocode 3'!X$8*'Steel Eurocode 3'!E$10)*100*1000*Y161","v":0.4798937443082314},{"$f":"C$14*B161*(8^3-2*8*B161^2+B161^3)/24/('Steel Eurocode 3'!E$10*'Steel Eurocode 3'!X$8)*100*1000","v":3.8001196018934218},null,125.14574131200006,138.10574131200008,1.6092201328774359E-6,6.1550024562866596E-6,1.2792675628641484E-5,2.0246527057212919E-5]
[83,2.6240000000000019,-473.72651702400015,100.40695199999992,-18.441951937019965,-18.441951937019965,-6.1788810433567436,-7.6640625,22.9921875,15.328125,10.21875,{"$f":"'Graph Properties'!C$3*8/2-B162*C$3","v":59.531951999999919},41.201999999999984,60.331500000000041,40.221000000000032,26.814000000000018,{"$f":"C$3*8/2*'Graph Properties'!B162-'Graph Properties'!C$3*B162^2/2","v":305.15801702400006},1.3130794255691773,2.15959409757318,{"$f":"D$17*$E$6/(6*8*'Steel Eurocode 3'!$X$8*'Steel Eurocode 3'!$E$10)*100*1000*X162","v":1.8919227100325255},{"$f":"D$18*E$7/(6*8*'Steel Eurocode 3'!X$8*'Steel Eurocode 3'!E$10)*100*1000*Y162","v":1.39235233180441},{"$f":"D$14*B162*(8^3-2*8*B162^2+B162^3)/24/('Steel Eurocode 3'!E$10*'Steel Eurocode 3'!X$8)*100*1000","v":11.685003372040672},null,126.25277337600006,139.37277337600008,4.6454661529480457E-6,1.7776260408639819E-5,3.6977566902519125E-5,5.8573507878250926E-5,null,0.4567232784588442,0.75116316437328046,{"$f":"C$17*$E$6/(6*8*'Steel Eurocode 3'!$X$8*'Steel Eurocode 3'!$E$10)*100*1000*AK162","v":0.65806007305479153},{"$f":"C$18*E$7/(6*8*'Steel Eurocode 3'!X$8*'Steel Eurocode 3'!E$10)*100*1000*Y162","v":0.48429646323631637},{"$f":"C$14*B162*(8^3-2*8*B162^2+B162^3)/24/('Steel Eurocode 3'!E$10*'Steel Eurocode 3'!X$8)*100*1000","v":3.8286380642335112},null,126.25277337600006,139.37277337600008,1.6158143140688853E-6,6.1830470986573275E-6,1.2861762400876217E-5,2.0373394044609021E-5]
[84,2.6560000000000019,-476.91738806400019,99.02248799999991,-18.578165197945076,-18.578165197945076,-6.224540905960362,-7.6640625,22.9921875,15.328125,10.21875,{"$f":"'Graph Properties'!C$3*8/2-B163*C$3","v":58.14748799999991},40.956749999999985,61.067250000000044,40.711500000000029,27.14100000000002,{"$f":"C$3*8/2*'Graph Properties'!B163-'Graph Properties'!C$3*B163^2/2","v":307.04088806400011},1.3189989515469935,2.1758435256442343,{"$f":"D$17*$E$6/(6*8*'Steel Eurocode 3'!$X$8*'Steel Eurocode 3'!$E$10)*100*1000*X163","v":1.9082702146609971},{"$f":"D$18*E$7/(6*8*'Steel Eurocode 3'!X$8*'Steel Eurocode 3'!E$10)*100*1000*Y163","v":1.4048490892613914},{"$f":"D$14*B163*(8^3-2*8*B163^2+B163^3)/24/('Steel Eurocode 3'!E$10*'Steel Eurocode 3'!X$8)*100*1000","v":11.770203416831459},null,127.34368358400008,140.62368358400008,4.6635994851694331E-6,1.7853589000639369E-5,3.7168940685256178E-5,5.8927375941698521E-5,null,0.45878224401634571,0.75681513935451639,{"$f":"C$17*$E$6/(6*8*'Steel Eurocode 3'!$X$8*'Steel Eurocode 3'!$E$10)*100*1000*AK163","v":0.66374616162121636},{"$f":"C$18*E$7/(6*8*'Steel Eurocode 3'!X$8*'Steel Eurocode 3'!E$10)*100*1000*Y163","v":0.48864316148222303},{"$f":"C$14*B163*(8^3-2*8*B163^2+B163^3)/24/('Steel Eurocode 3'!E$10*'Steel Eurocode 3'!X$8)*100*1000","v":3.8565541994860606},null,127.34368358400008,140.62368358400008,1.6221215600589331E-6,6.2099440002223893E-6,1.2928327194871714E-5,2.0496478588416877E-5]
[85,2.6880000000000019,-480.06395625600015,97.638023999999916,-18.711508443247922,-18.711508443247922,-6.2692398134654344,-7.6640625,22.9921875,15.328125,10.21875,{"$f":"'Graph Properties'!C$3*8/2-B164*C$3","v":56.763023999999916},40.71149999999998,61.803000000000047,41.202000000000027,27.468000000000021,{"$f":"C$3*8/2*'Graph Properties'!B164-'Graph Properties'!C$3*B164^2/2","v":308.87945625600008},1.3246724690184306,2.1917261506129595,{"$f":"D$17*$E$6/(6*8*'Steel Eurocode 3'!$X$8*'Steel Eurocode 3'!$E$10)*100*1000*X164","v":1.9243731838879174},{"$f":"D$18*E$7/(6*8*'Steel Eurocode 3'!X$8*'Steel Eurocode 3'!E$10)*100*1000*Y164","v":1.4171828231173389},{"$f":"D$14*B164*(8^3-2*8*B164^2+B164^3)/24/('Steel Eurocode 3'!E$10*'Steel Eurocode 3'!X$8)*100*1000","v":11.853553816611274},null,128.41827532800008,141.85827532800008,4.6809127890362217E-6,1.792763747922053E-5,3.7353079690087577E-5,5.9270341196217174E-5,null,0.46075564139771497,0.76233953064798599,{"$f":"C$17*$E$6/(6*8*'Steel Eurocode 3'!$X$8*'Steel Eurocode 3'!$E$10)*100*1000*AK164","v":0.66934719439579726},{"$f":"C$18*E$7/(6*8*'Steel Eurocode 3'!X$8*'Steel Eurocode 3'!E$10)*100*1000*Y164","v":0.4929331558669004},{"$f":"C$14*B164*(8^3-2*8*B164^2+B164^3)/24/('Steel Eurocode 3'!E$10*'Steel Eurocode 3'!X$8)*100*1000","v":3.8838642911570358},null,128.41827532800008,141.85827532800008,1.6281435787952075E-6,6.2356999927723571E-6,1.299237554437829E-5,2.0615770850858149E-5]
[86,2.720000000000002,-483.1662216000002,96.253559999999908,-18.841962740517623,-18.841962740517623,-6.3129714041086409,-7.6640625,22.9921875,15.328125,10.21875,{"$f":"'Graph Properties'!C$3*8/2-B165*C$3","v":55.378559999999908},40.466249999999981,62.538750000000043,41.692500000000031,27.795000000000019,{"$f":"C$3*8/2*'Graph Properties'!B165-'Graph Properties'!C$3*B165^2/2","v":310.67372160000014},1.3301014510883165,2.2072375531648749,{"$f":"D$17*$E$6/(6*8*'Steel Eurocode 3'!$X$8*'Steel Eurocode 3'!$E$10)*100*1000*X165","v":1.9402286715036292},{"$f":"D$18*E$7/(6*8*'Steel Eurocode 3'!X$8*'Steel Eurocode 3'!E$10)*100*1000*Y165","v":1.4293515692324807},{"$f":"D$14*B165*(8^3-2*8*B165^2+B165^3)/24/('Steel Eurocode 3'!E$10*'Steel Eurocode 3'!X$8)*100*1000","v":11.935043495528319},null,129.47635200000008,143.07635200000007,4.6974109748978417E-6,1.7998425485781007E-5,3.7530002340644383E-5,5.9602377872293131E-5,null,0.46264398298724058,0.76773480110082581,{"$f":"C$17*$E$6/(6*8*'Steel Eurocode 3'!$X$8*'Steel Eurocode 3'!$E$10)*100*1000*AK165","v":0.67486214660995791},{"$f":"C$18*E$7/(6*8*'Steel Eurocode 3'!X$8*'Steel Eurocode 3'!E$10)*100*1000*Y165","v":0.49716576321129757},{"$f":"C$14*B165*(8^3-2*8*B165^2+B165^3)/24/('Steel Eurocode 3'!E$10*'Steel Eurocode 3'!X$8)*100*1000","v":3.9105647101993188},null,129.47635200000008,143.07635200000007,1.6338820782253359E-6,6.2603219080977411E-6,1.3053913857615439E-5,2.0731261868623698E-5]
[87,2.752000000000002,-486.22418409600016,94.869095999999914,-18.969509424231266,-18.969509424231266,-6.3557294035735712,-7.6640625,22.9921875,15.328125,10.21875,{"$f":"'Graph Properties'!C$3*8/2-B166*C$3","v":53.994095999999914},40.220999999999982,63.274500000000046,42.183000000000028,28.122000000000021,{"$f":"C$3*8/2*'Graph Properties'!B166-'Graph Properties'!C$3*B166^2/2","v":312.4236840960001},1.3352873708614794,2.2223733139854898,{"$f":"D$17*$E$6/(6*8*'Steel Eurocode 3'!$X$8*'Steel Eurocode 3'!$E$10)*100*1000*X166","v":1.955833731298475},{"$f":"D$18*E$7/(6*8*'Steel Eurocode 3'!X$8*'Steel Eurocode 3'!E$10)*100*1000*Y166","v":1.4413533634670457},{"$f":"D$14*B166*(8^3-2*8*B166^2+B166^3)/24/('Steel Eurocode 3'!E$10*'Steel Eurocode 3'!X$8)*100*1000","v":12.014661644618776},null,130.51771699200006,144.27771699200008,4.7130989531037164E-6,1.8065972661718513E-5,3.7699729574656567E-5,5.9923462714511464E-5,null,0.46444778116921026,0.77299941356017043,{"$f":"C$17*$E$6/(6*8*'Steel Eurocode 3'!$X$8*'Steel Eurocode 3'!$E$10)*100*1000*AK166","v":0.68028999349512176},{"$f":"C$18*E$7/(6*8*'Steel Eurocode 3'!X$8*'Steel Eurocode 3'!E$10)*100*1000*Y166","v":0.50134030033636368},{"$f":"C$14*B166*(8^3-2*8*B166^2+B166^3)/24/('Steel Eurocode 3'!E$10*'Steel Eurocode 3'!X$8)*100*1000","v":3.9366519150127055},null,130.51771699200006,144.27771699200008,1.6393387662969449E-6,6.2838165779890475E-6,1.3112949417271847E-5,2.0842943552873551E-5]
[88,2.784000000000002,-489.2378437440002,93.484631999999905,-19.094130095753968,-19.094130095753968,-6.3975076249907463,-7.6640625,22.9921875,15.328125,10.21875,{"$f":"'Graph Properties'!C$3*8/2-B167*C$3","v":52.609631999999905},39.975749999999984,64.010250000000042,42.673500000000033,28.449000000000019,{"$f":"C$3*8/2*'Graph Properties'!B167-'Graph Properties'!C$3*B167^2/2","v":314.12934374400015},1.3402317014427492,2.2371290137603213,{"$f":"D$17*$E$6/(6*8*'Steel Eurocode 3'!$X$8*'Steel Eurocode 3'!$E$10)*100*1000*X167","v":1.971185417062798},{"$f":"D$18*E$7/(6*8*'Steel Eurocode 3'!X$8*'Steel Eurocode 3'!E$10)*100*1000*Y167","v":1.4531862416812618},{"$f":"D$14*B167*(8^3-2*8*B167^2+B167^3)/24/('Steel Eurocode 3'!E$10*'Steel Eurocode 3'!X$8)*100*1000","v":12.092397721806838},null,131.54217369600005,145.46217369600006,4.7279816340032809E-6,1.8130298648430771E-5,3.7862284843952974E-5,6.0233574981556187E-5,null,0.46616754832791263,0.77813183087315518,{"$f":"C$17*$E$6/(6*8*'Steel Eurocode 3'!$X$8*'Steel Eurocode 3'!$E$10)*100*1000*AK167","v":0.68562971028271236},{"$f":"C$18*E$7/(6*8*'Steel Eurocode 3'!X$8*'Steel Eurocode 3'!E$10)*100*1000*Y167","v":0.50545608406304754},{"$f":"C$14*B167*(8^3-2*8*B167^2+B167^3)/24/('Steel Eurocode 3'!E$10*'Steel Eurocode 3'!X$8)*100*1000","v":3.9621224514439182},null,131.54217369600005,145.46217369600006,1.6445153509576627E-6,6.3061908342367892E-6,1.3169490380505383E-5,2.0950808689236934E-5]
[89,2.8160000000000021,-492.2072005440001,92.100167999999911,-19.215806623338811,-19.215806623338811,-6.4382999689375957,-7.6640625,22.9921875,15.328125,10.21875,{"$f":"'Graph Properties'!C$3*8/2-B168*C$3","v":51.225167999999911},39.730499999999978,64.746000000000052,43.16400000000003,28.776000000000021,{"$f":"C$3*8/2*'Graph Properties'!B168-'Graph Properties'!C$3*B168^2/2","v":315.79070054400006},1.3449359159369532,2.2515002331748826,{"$f":"D$17*$E$6/(6*8*'Steel Eurocode 3'!$X$8*'Steel Eurocode 3'!$E$10)*100*1000*X168","v":1.9862807825869413},{"$f":"D$18*E$7/(6*8*'Steel Eurocode 3'!X$8*'Steel Eurocode 3'!E$10)*100*1000*Y168","v":1.4648482397353579},{"$f":"D$14*B168*(8^3-2*8*B168^2+B168^3)/24/('Steel Eurocode 3'!E$10*'Steel Eurocode 3'!X$8)*100*1000","v":12.168241451904677},null,132.54952550400006,146.62952550400007,4.7420639279459613E-6,1.8191423087315493E-5,3.8017694114461416E-5,6.0532696446210241E-5,null,0.46780379684763584,0.78313051588691562,{"$f":"C$17*$E$6/(6*8*'Steel Eurocode 3'!$X$8*'Steel Eurocode 3'!$E$10)*100*1000*AK168","v":0.69088027220415349},{"$f":"C$18*E$7/(6*8*'Steel Eurocode 3'!X$8*'Steel Eurocode 3'!E$10)*100*1000*Y168","v":0.50951243121229839},{"$f":"C$14*B168*(8^3-2*8*B168^2+B168^3)/24/('Steel Eurocode 3'!E$10*'Steel Eurocode 3'!X$8)*100*1000","v":3.986972952786592},null,132.54952550400006,146.62952550400007,1.6494135401551167E-6,6.3274515086314748E-6,1.3223545778943102E-5,2.1054850937812257E-5]
[90,2.8480000000000021,-495.1322544960002,90.715703999999903,-19.334521142126889,-19.334521142126889,-6.4781004234384696,-7.6640625,22.9921875,15.328125,10.21875,{"$f":"'Graph Properties'!C$3*8/2-B169*C$3","v":49.840703999999903},39.485249999999979,65.481750000000048,43.654500000000034,29.103000000000023,{"$f":"C$3*8/2*'Graph Properties'!B169-'Graph Properties'!C$3*B169^2/2","v":317.40775449600011},1.3494014874489202,2.265482552914686,{"$f":"D$17*$E$6/(6*8*'Steel Eurocode 3'!$X$8*'Steel Eurocode 3'!$E$10)*100*1000*X169","v":2.0011168816612468},{"$f":"D$18*E$7/(6*8*'Steel Eurocode 3'!X$8*'Steel Eurocode 3'!E$10)*100*1000*Y169","v":1.4763373934895625},{"$f":"D$14*B169*(8^3-2*8*B169^2+B169^3)/24/('Steel Eurocode 3'!E$10*'Steel Eurocode 3'!X$8)*100*1000","v":12.242182826612474},null,133.53957580800005,147.77957580800006,4.7553507452811834E-6,1.8249365619770385E-5,3.8165985866208566E-5,6.0820811395355429E-5,null,0.46935703911266791,0.78799393144858665,{"$f":"C$17*$E$6/(6*8*'Steel Eurocode 3'!$X$8*'Steel Eurocode 3'!$E$10)*100*1000*AK169","v":0.69604065449086849},{"$f":"C$18*E$7/(6*8*'Steel Eurocode 3'!X$8*'Steel Eurocode 3'!E$10)*100*1000*Y169","v":0.51350865860506512},{"$f":"C$14*B169*(8^3-2*8*B169^2+B169^3)/24/('Steel Eurocode 3'!E$10*'Steel Eurocode 3'!X$8)*100*1000","v":4.0112001397812813},null,133.53957580800005,147.77957580800006,1.6540350418369335E-6,6.347605432963612E-6,1.3275125518681238E-5,2.1155064833167104E-5]
[91,2.8800000000000021,-498.01300560000016,89.331239999999909,-19.450256054147289,-19.450256054147289,-6.5169030639646435,-7.6640625,22.9921875,15.328125,10.21875,{"$f":"'Graph Properties'!C$3*8/2-B170*C$3","v":48.456239999999909},39.239999999999981,66.217500000000044,44.145000000000032,29.430000000000021,{"$f":"C$3*8/2*'Graph Properties'!B170-'Graph Properties'!C$3*B170^2/2","v":318.98050560000007},1.3536298890834797,2.2790715536652497,{"$f":"D$17*$E$6/(6*8*'Steel Eurocode 3'!$X$8*'Steel Eurocode 3'!$E$10)*100*1000*X170","v":2.0156907680760585},{"$f":"D$18*E$7/(6*8*'Steel Eurocode 3'!X$8*'Steel Eurocode 3'!E$10)*100*1000*Y170","v":1.4876517388041042},{"$f":"D$14*B170*(8^3-2*8*B170^2+B170^3)/24/('Steel Eurocode 3'!E$10*'Steel Eurocode 3'!X$8)*100*1000","v":12.314212104518395},null,134.51212800000008,148.91212800000008,4.7678469963583806E-6,1.8304145887193178E-5,3.8307191093319992E-5,6.1097906629972487E-5,null,0.4708277875072972,0.79272054040530426,{"$f":"C$17*$E$6/(6*8*'Steel Eurocode 3'!$X$8*'Steel Eurocode 3'!$E$10)*100*1000*AK170","v":0.70110983237428115},{"$f":"C$18*E$7/(6*8*'Steel Eurocode 3'!X$8*'Steel Eurocode 3'!E$10)*100*1000*Y170","v":0.51744408306229694},{"$f":"C$14*B170*(8^3-2*8*B170^2+B170^3)/24/('Steel Eurocode 3'!E$10*'Steel Eurocode 3'!X$8)*100*1000","v":4.0348008206154642},null,134.51212800000008,148.91212800000008,1.6583815639507411E-6,6.366659439023713E-6,1.3324240380285218E-5,2.125144578433826E-5]
[92,2.9120000000000021,-500.8494538560002,87.9467759999999,-19.562994028317075,-19.562994028317075,-6.5547020534343003,-7.6640625,22.9921875,15.328125,10.21875,{"$f":"'Graph Properties'!C$3*8/2-B171*C$3","v":47.0717759999999},38.994749999999982,66.953250000000054,44.635500000000036,29.757000000000023,{"$f":"C$3*8/2*'Graph Properties'!B171-'Graph Properties'!C$3*B171^2/2","v":320.50895385600006},1.3576225939454596,2.2922628161120837,{"$f":"D$17*$E$6/(6*8*'Steel Eurocode 3'!$X$8*'Steel Eurocode 3'!$E$10)*100*1000*X171","v":2.0299994956217176},{"$f":"D$18*E$7/(6*8*'Steel Eurocode 3'!X$8*'Steel Eurocode 3'!E$10)*100*1000*Y171","v":1.498789311539211},{"$f":"D$14*B171*(8^3-2*8*B171^2+B171^3)/24/('Steel Eurocode 3'!E$10*'Steel Eurocode 3'!X$8)*100*1000","v":12.384319811098603},null,135.46698547200006,150.02698547200009,4.7795575915269798E-6,1.8355783530981575E-5,3.8441343304020242E-5,6.136397146514108E-5,null,0.47221655441581201,0.79730880560420347,{"$f":"C$17*$E$6/(6*8*'Steel Eurocode 3'!$X$8*'Steel Eurocode 3'!$E$10)*100*1000*AK171","v":0.70608678108581469},{"$f":"C$18*E$7/(6*8*'Steel Eurocode 3'!X$8*'Steel Eurocode 3'!E$10)*100*1000*Y171","v":0.52131802140494288},{"$f":"C$14*B171*(8^3-2*8*B171^2+B171^3)/24/('Steel Eurocode 3'!E$10*'Steel Eurocode 3'!X$8)*100*1000","v":4.0577718909235276},null,135.46698547200006,150.02698547200009,1.6624548144441667E-6,6.3846203586022864E-6,1.337090201878965E-5,2.1343990074831685E-5]
[93,2.9440000000000022,-503.64159926400021,86.562311999999906,-19.672718000441343,-19.672718000441343,-6.5914916422125494,-7.6640625,22.9921875,15.328125,10.21875,{"$f":"'Graph Properties'!C$3*8/2-B172*C$3","v":45.687311999999906},38.749499999999983,67.68900000000005,45.126000000000033,30.084000000000021,{"$f":"C$3*8/2*'Graph Properties'!B172-'Graph Properties'!C$3*B172^2/2","v":321.99309926400008},1.3613810751396882,2.3050519209407052,{"$f":"D$17*$E$6/(6*8*'Steel Eurocode 3'!$X$8*'Steel Eurocode 3'!$E$10)*100*1000*X172","v":2.0440401180885677},{"$f":"D$18*E$7/(6*8*'Steel Eurocode 3'!X$8*'Steel Eurocode 3'!E$10)*100*1000*Y172","v":1.5097481475551118},{"$f":"D$14*B172*(8^3-2*8*B172^2+B172^3)/24/('Steel Eurocode 3'!E$10*'Steel Eurocode 3'!X$8)*100*1000","v":12.452496738717269},null,136.40395161600006,151.12395161600008,4.7904874411364077E-6,1.840429819253329E-5,3.8568478520632706E-5,6.161899773003976E-5,null,0.47352385222250021,0.80175718989241929,{"$f":"C$17*$E$6/(6*8*'Steel Eurocode 3'!$X$8*'Steel Eurocode 3'!$E$10)*100*1000*AK172","v":0.71097047585689299},{"$f":"C$18*E$7/(6*8*'Steel Eurocode 3'!X$8*'Steel Eurocode 3'!E$10)*100*1000*Y172","v":0.52512979045395181},{"$f":"C$14*B172*(8^3-2*8*B172^2+B172^3)/24/('Steel Eurocode 3'!E$10*'Steel Eurocode 3'!X$8)*100*1000","v":4.0801103337867852},null,136.40395161600006,151.12395161600008,1.6662565012648377E-6,6.4014950234898399E-6,1.3415122963698334E-5,2.1432694862622527E-5]
[94,2.9760000000000022,-506.38944182400019,85.177847999999898,-19.779411173213155,-19.779411173213155,-6.6272661681114204,-7.6640625,22.9921875,15.328125,10.21875,{"$f":"'Graph Properties'!C$3*8/2-B173*C$3","v":44.302847999999898},38.504249999999978,68.424750000000046,45.61650000000003,30.411000000000023,{"$f":"C$3*8/2*'Graph Properties'!B173-'Graph Properties'!C$3*B173^2/2","v":323.43294182400007},1.364906805770995,2.3174344488366283,{"$f":"D$17*$E$6/(6*8*'Steel Eurocode 3'!$X$8*'Steel Eurocode 3'!$E$10)*100*1000*X173","v":2.0578096892669517},{"$f":"D$18*E$7/(6*8*'Steel Eurocode 3'!X$8*'Steel Eurocode 3'!E$10)*100*1000*Y173","v":1.5205262827120349},{"$f":"D$14*B173*(8^3-2*8*B173^2+B173^3)/24/('Steel Eurocode 3'!E$10*'Steel Eurocode 3'!X$8)*100*1000","v":12.518733946626545},null,137.32282982400008,152.20282982400008,4.8006414555360969E-6,1.8449709513246047E-5,3.8688635279579687E-5,6.1862979767945972E-5,null,0.47475019331165053,0.80606415611708848,{"$f":"C$17*$E$6/(6*8*'Steel Eurocode 3'!$X$8*'Steel Eurocode 3'!$E$10)*100*1000*AK173","v":0.71575989191893963},{"$f":"C$18*E$7/(6*8*'Steel Eurocode 3'!X$8*'Steel Eurocode 3'!E$10)*100*1000*Y173","v":0.52887870703027295},{"$f":"C$14*B173*(8^3-2*8*B173^2+B173^3)/24/('Steel Eurocode 3'!E$10*'Steel Eurocode 3'!X$8)*100*1000","v":4.1018132197334687},null,137.32282982400008,152.20282982400008,1.6697883323603815E-6,6.4172902654768864E-6,1.3456916618984239E-5,2.1517558180155123E-5]
[95,3.0080000000000022,-509.09167353600026,83.466383999999806,-19.88305701625449,-19.88305701625449,-6.6620200564040832,-7.6640625,22.665187499999909,15.328125,10.21875,{"$f":"'Graph Properties'!C$3*8/2-B174*C$3","v":42.91838399999989},38.258999999999979,69.159192000000061,46.107000000000035,30.738000000000024,{"$f":"C$3*8/2*'Graph Properties'!B174-'Graph Properties'!C$3*B174^2/2","v":324.82848153600014},1.3682012589442083,2.3294059805262837,{"$f":"D$17*$E$6/(6*8*'Steel Eurocode 3'!$X$8*'Steel Eurocode 3'!$E$10)*100*1000*X174","v":2.0713052629472117},{"$f":"D$18*E$7/(6*8*'Steel Eurocode 3'!X$8*'Steel Eurocode 3'!E$10)*100*1000*Y174","v":1.5311217528702092},{"$f":"D$14*B174*(8^3-2*8*B174^2+B174^3)/24/('Steel Eurocode 3'!E$10*'Steel Eurocode 3'!X$8)*100*1000","v":12.583022760966578},null,138.22342348800007,153.26342348800009,4.8100245450754741E-6,1.849203713451756E-5,3.8801854630973239E-5,6.2095914436236077E-5,null,0.47589609006755068,0.81022816713957702,{"$f":"C$17*$E$6/(6*8*'Steel Eurocode 3'!$X$8*'Steel Eurocode 3'!$E$10)*100*1000*AK174","v":0.72045400450337793},{"$f":"C$18*E$7/(6*8*'Steel Eurocode 3'!X$8*'Steel Eurocode 3'!E$10)*100*1000*Y174","v":0.53256408795485533},{"$f":"C$14*B174*(8^3-2*8*B174^2+B174^3)/24/('Steel Eurocode 3'!E$10*'Steel Eurocode 3'!X$8)*100*1000","v":4.1228777067387226},null,138.22342348800007,153.26342348800009,1.6730520156784256E-6,6.4320129163539321E-6,1.3496297262947213E-5,2.1598578934342982E-5]
[96,3.0400000000000023,-511.71951840000014,80.773919999999819,-19.983639291486401,-19.983639291486401,-6.6957478286492673,-7.6640625,21.35718749999991,15.328125,10.21875,{"$f":"'Graph Properties'!C$3*8/2-B175*C$3","v":41.53391999999991},38.01374999999998,69.863550000000046,46.597500000000032,31.065000000000023,{"$f":"C$3*8/2*'Graph Properties'!B175-'Graph Properties'!C$3*B175^2/2","v":326.17971840000007},1.3712659077641565,2.3409621221471668,{"$f":"D$17*$E$6/(6*8*'Steel Eurocode 3'!$X$8*'Steel Eurocode 3'!$E$10)*100*1000*X175","v":2.084523892919691},{"$f":"D$18*E$7/(6*8*'Steel Eurocode 3'!X$8*'Steel Eurocode 3'!E$10)*100*1000*Y175","v":1.5415325938898627},{"$f":"D$14*B175*(8^3-2*8*B175^2+B175^3)/24/('Steel Eurocode 3'!E$10*'Steel Eurocode 3'!X$8)*100*1000","v":12.645354774765524},null,139.10553600000006,154.30553600000007,4.8186416201039671E-6,1.8531300697745532E-5,3.8908179884913694E-5,6.2317801106385364E-5,null,0.47696205487448912,0.81424769465988456,{"$f":"C$17*$E$6/(6*8*'Steel Eurocode 3'!$X$8*'Steel Eurocode 3'!$E$10)*100*1000*AK175","v":0.72505178884163157},{"$f":"C$18*E$7/(6*8*'Steel Eurocode 3'!X$8*'Steel Eurocode 3'!E$10)*100*1000*Y175","v":0.53618525004864781},{"$f":"C$14*B175*(8^3-2*8*B175^2+B175^3)/24/('Steel Eurocode 3'!E$10*'Steel Eurocode 3'!X$8)*100*1000","v":4.1433010402246149},null,139.10553600000006,154.30553600000007,1.6760492591665972E-6,6.445669807911489E-6,1.3533279959969977E-5,2.1675756906568823E-5]
[97,3.0720000000000023,-514.26120441600017,78.081455999999804,-20.081142194137833,-20.081142194137833,-6.728444151737806,-7.6640625,20.049187499999906,15.328125,10.21875,{"$f":"'Graph Properties'!C$3*8/2-B176*C$3","v":40.149455999999901},37.768499999999982,70.526052000000035,47.088000000000036,31.392000000000024,{"$f":"C$3*8/2*'Graph Properties'!B176-'Graph Properties'!C$3*B176^2/2","v":327.48665241600008},1.3741022253356685,2.3520986462566937,{"$f":"D$17*$E$6/(6*8*'Steel Eurocode 3'!$X$8*'Steel Eurocode 3'!$E$10)*100*1000*X176","v":2.0974626329747319},{"$f":"D$18*E$7/(6*8*'Steel Eurocode 3'!X$8*'Steel Eurocode 3'!E$10)*100*1000*Y176","v":1.5517568416312242},{"$f":"D$14*B176*(8^3-2*8*B176^2+B176^3)/24/('Steel Eurocode 3'!E$10*'Steel Eurocode 3'!X$8)*100*1000","v":12.705721847939516},null,139.96897075200005,155.32897075200006,4.8264975909710058E-6,1.856751984432769E-5,3.9007655201401056E-5,6.2528641663967994E-5,null,0.47794860011675422,0.8181212682631982,{"$f":"C$17*$E$6/(6*8*'Steel Eurocode 3'!$X$8*'Steel Eurocode 3'!$E$10)*100*1000*AK176","v":0.72955222016512411},{"$f":"C$18*E$7/(6*8*'Steel Eurocode 3'!X$8*'Steel Eurocode 3'!E$10)*100*1000*Y176","v":0.53974151013259963},{"$f":"C$14*B176*(8^3-2*8*B176^2+B176^3)/24/('Steel Eurocode 3'!E$10*'Steel Eurocode 3'!X$8)*100*1000","v":4.16308055306013},null,139.96897075200005,155.32897075200006,1.6787817707725236E-6,6.4582677719400657E-6,1.356788007005254E-5,2.1749092752684522E-5]
[98,3.1040000000000023,-516.71673158400017,75.388991999999803,-20.175550434421158,-20.175550434421158,-6.7601038663015052,-7.6640625,18.741187499999906,15.328125,10.21875,{"$f":"'Graph Properties'!C$3*8/2-B177*C$3","v":38.764991999999893},37.523249999999976,71.146698000000043,47.578500000000034,31.719000000000023,{"$f":"C$3*8/2*'Graph Properties'!B177-'Graph Properties'!C$3*B177^2/2","v":328.74928358400007},1.376711684763573,2.362811573507686,{"$f":"D$17*$E$6/(6*8*'Steel Eurocode 3'!$X$8*'Steel Eurocode 3'!$E$10)*100*1000*X177","v":2.1101185369026783},{"$f":"D$18*E$7/(6*8*'Steel Eurocode 3'!X$8*'Steel Eurocode 3'!E$10)*100*1000*Y177","v":1.5617925319545223},{"$f":"D$14*B177*(8^3-2*8*B177^2+B177^3)/24/('Steel Eurocode 3'!E$10*'Steel Eurocode 3'!X$8)*100*1000","v":12.764116107292699},null,140.81353113600005,156.33353113600006,4.8335973680260195E-6,1.8600714215661749E-5,3.9100324773580196E-5,6.2728440508657058E-5,null,0.47885623817863393,0.82184750382876104,{"$f":"C$17*$E$6/(6*8*'Steel Eurocode 3'!$X$8*'Steel Eurocode 3'!$E$10)*100*1000*AK177","v":0.73395427370527933},{"$f":"C$18*E$7/(6*8*'Steel Eurocode 3'!X$8*'Steel Eurocode 3'!E$10)*100*1000*Y177","v":0.5432321850276598},{"$f":"C$14*B177*(8^3-2*8*B177^2+B177^3)/24/('Steel Eurocode 3'!E$10*'Steel Eurocode 3'!X$8)*100*1000","v":4.1822136655611715},null,140.81353113600005,156.33353113600006,1.6812512584438327E-6,6.4698136402301717E-6,1.3600112964723544E-5,2.1818588003011153E-5]
[99,3.1360000000000023,-519.08609990400021,72.696527999999788,-20.266849240846614,-20.266849240846614,-6.7907219878660134,-7.6640625,17.433187499999903,15.328125,10.21875,{"$f":"'Graph Properties'!C$3*8/2-B178*C$3","v":37.380527999999885},37.277999999999977,71.725488000000041,48.069000000000038,32.046000000000021,{"$f":"C$3*8/2*'Graph Properties'!B178-'Graph Properties'!C$3*B178^2/2","v":329.96761190400014},1.3790957591526982,2.3730971759628621,{"$f":"D$17*$E$6/(6*8*'Steel Eurocode 3'!$X$8*'Steel Eurocode 3'!$E$10)*100*1000*X178","v":2.1224886584938716},{"$f":"D$18*E$7/(6*8*'Steel Eurocode 3'!X$8*'Steel Eurocode 3'!E$10)*100*1000*Y178","v":1.5716377007199853},{"$f":"D$14*B178*(8^3-2*8*B178^2+B178^3)/24/('Steel Eurocode 3'!E$10*'Steel Eurocode 3'!X$8)*100*1000","v":12.820529946517198},null,141.63902054400006,157.31902054400007,4.8399458616184368E-6,1.8630903453145418E-5,3.9186232794595952E-5,6.2917204554224573E-5,null,0.47968548144441653,0.82542510468273522,{"$f":"C$17*$E$6/(6*8*'Steel Eurocode 3'!$X$8*'Steel Eurocode 3'!$E$10)*100*1000*AK178","v":0.73825692469352056},{"$f":"C$18*E$7/(6*8*'Steel Eurocode 3'!X$8*'Steel Eurocode 3'!E$10)*100*1000*Y178","v":0.54665659155477742},{"$f":"C$14*B178*(8^3-2*8*B178^2+B178^3)/24/('Steel Eurocode 3'!E$10*'Steel Eurocode 3'!X$8)*100*1000","v":4.2006978854905634},null,141.63902054400006,157.31902054400007,1.6834594301281515E-6,6.4803142445723173E-6,1.3629994015511633E-5,2.1884245062338985E-5]
[100,3.1680000000000024,-521.36930937600016,70.004063999999801,-20.355024360222345,-20.355024360222345,-6.8202937068508085,-7.6640625,16.125187499999903,15.328125,10.21875,{"$f":"'Graph Properties'!C$3*8/2-B179*C$3","v":35.996063999999905},37.032749999999979,72.262422000000029,48.559500000000035,32.373000000000026,{"$f":"C$3*8/2*'Graph Properties'!B179-'Graph Properties'!C$3*B179^2/2","v":331.14163737600006},1.3812559216078726,2.3829519770948231,{"$f":"D$17*$E$6/(6*8*'Steel Eurocode 3'!$X$8*'Steel Eurocode 3'!$E$10)*100*1000*X179","v":2.1345700515386548},{"$f":"D$18*E$7/(6*8*'Steel Eurocode 3'!X$8*'Steel Eurocode 3'!E$10)*100*1000*Y179","v":1.5812903837878418},{"$f":"D$14*B179*(8^3-2*8*B179^2+B179^3)/24/('Steel Eurocode 3'!E$10*'Steel Eurocode 3'!X$8)*100*1000","v":12.874956026193152},null,142.44524236800004,158.28524236800007,4.8455479820976843E-6,1.8658107198176412E-5,3.92654234575932E-5,6.3094943228541431E-5,null,0.48043684229839045,0.82885286159819949,{"$f":"C$17*$E$6/(6*8*'Steel Eurocode 3'!$X$8*'Steel Eurocode 3'!$E$10)*100*1000*AK179","v":0.74245914836127125},{"$f":"C$18*E$7/(6*8*'Steel Eurocode 3'!X$8*'Steel Eurocode 3'!E$10)*100*1000*Y179","v":0.55001404653490138},{"$f":"C$14*B179*(8^3-2*8*B179^2+B179^3)/24/('Steel Eurocode 3'!E$10*'Steel Eurocode 3'!X$8)*100*1000","v":4.2185308080580457},null,142.44524236800004,158.28524236800007,1.6854079937731076E-6,6.4897764167570121E-6,1.3657538593945459E-5,2.1946067209927453E-5]
[101,3.2000000000000024,-523.56636000000015,67.3115999999998,-20.440062057654359,-20.440062057654359,-6.8488143885692061,-7.6640625,14.817187499999902,15.328125,10.21875,{"$f":"'Graph Properties'!C$3*8/2-B180*C$3","v":34.611599999999896},36.78749999999998,72.757500000000036,49.05000000000004,32.700000000000024,{"$f":"C$3*8/2*'Graph Properties'!B180-'Graph Properties'!C$3*B180^2/2","v":332.27136000000007},1.3831936452339255,2.3923727517860618,{"$f":"D$17*$E$6/(6*8*'Steel Eurocode 3'!$X$8*'Steel Eurocode 3'!$E$10)*100*1000*X180","v":2.1463597698273715},{"$f":"D$18*E$7/(6*8*'Steel Eurocode 3'!X$8*'Steel Eurocode 3'!E$10)*100*1000*Y180","v":1.59074861701832},{"$f":"D$14*B180*(8^3-2*8*B180^2+B180^3)/24/('Steel Eurocode 3'!E$10*'Steel Eurocode 3'!X$8)*100*1000","v":12.92738727378868},null,143.23200000000006,159.23200000000006,4.850408639813193E-6,1.8682345092152447E-5,3.9337940955716793E-5,6.3261668473577412E-5,null,0.48111083312484354,0.83212965279515216,{"$f":"C$17*$E$6/(6*8*'Steel Eurocode 3'!$X$8*'Steel Eurocode 3'!$E$10)*100*1000*AK180","v":0.7465599199399553},{"$f":"C$18*E$7/(6*8*'Steel Eurocode 3'!X$8*'Steel Eurocode 3'!E$10)*100*1000*Y180","v":0.5533038667889808},{"$f":"C$14*B180*(8^3-2*8*B180^2+B180^3)/24/('Steel Eurocode 3'!E$10*'Steel Eurocode 3'!X$8)*100*1000","v":4.2357101159202744},null,143.23200000000006,159.23200000000006,1.6870986573263279E-6,6.4982069885747638E-6,1.3682762071553665E-5,2.2004058599505187E-5]
[102,3.2320000000000024,-525.67725177600016,64.619135999999784,-20.521949116546566,-20.521949116546566,-6.8762795732283664,-7.6640625,13.5091874999999,15.328125,10.21875,{"$f":"'Graph Properties'!C$3*8/2-B181*C$3","v":33.227135999999888},36.542249999999981,73.210722000000032,49.540500000000037,33.027000000000022,{"$f":"C$3*8/2*'Graph Properties'!B181-'Graph Properties'!C$3*B181^2/2","v":333.35677977600005},1.3849104031356851,2.4013565263289696,{"$f":"D$17*$E$6/(6*8*'Steel Eurocode 3'!$X$8*'Steel Eurocode 3'!$E$10)*100*1000*X181","v":2.1578548671503639},{"$f":"D$18*E$7/(6*8*'Steel Eurocode 3'!X$8*'Steel Eurocode 3'!E$10)*100*1000*Y181","v":1.6000104362716492},{"$f":"D$14*B181*(8^3-2*8*B181^2+B181^3)/24/('Steel Eurocode 3'!E$10*'Steel Eurocode 3'!X$8)*100*1000","v":12.977816883659896},null,143.99909683200005,160.15909683200007,4.8545327451143913E-6,1.8703636776471244E-5,3.9403829482111594E-5,6.341739474540129E-5,null,0.48170796630806434,0.83525444394051096,{"$f":"C$17*$E$6/(6*8*'Steel Eurocode 3'!$X$8*'Steel Eurocode 3'!$E$10)*100*1000*AK181","v":0.75055821466099604},{"$f":"C$18*E$7/(6*8*'Steel Eurocode 3'!X$8*'Steel Eurocode 3'!E$10)*100*1000*Y181","v":0.5565253691379648},{"$f":"C$14*B181*(8^3-2*8*B181^2+B181^3)/24/('Steel Eurocode 3'!E$10*'Steel Eurocode 3'!X$8)*100*1000","v":4.2522335791808308},null,143.99909683200005,160.15909683200007,1.6885331287354403E-6,6.5056127918160836E-6,1.37056798198649E-5,2.205822425927001E-5]
[103,3.2640000000000025,-527.7019847040001,61.926671999999783,-20.600672838600754,-20.600672838600754,-6.9026849759292821,-7.6640625,12.2011874999999,15.328125,10.21875,{"$f":"'Graph Properties'!C$3*8/2-B182*C$3","v":31.84267199999988},36.296999999999976,73.622088000000019,50.031000000000034,33.354000000000028,{"$f":"C$3*8/2*'Graph Properties'!B182-'Graph Properties'!C$3*B182^2/2","v":334.39789670400012},1.3864076684179802,2.4099005784258209,{"$f":"D$17*$E$6/(6*8*'Steel Eurocode 3'!$X$8*'Steel Eurocode 3'!$E$10)*100*1000*X182","v":2.1690523972979747},{"$f":"D$18*E$7/(6*8*'Steel Eurocode 3'!X$8*'Steel Eurocode 3'!E$10)*100*1000*Y182","v":1.6090738774080569},{"$f":"D$14*B182*(8^3-2*8*B182^2+B182^3)/24/('Steel Eurocode 3'!E$10*'Steel Eurocode 3'!X$8)*100*1000","v":13.026238317050922},null,144.74633625600006,161.06633625600006,4.8579252083507077E-6,1.872200189253051E-5,3.9463133229922447E-5,6.3562139014180659E-5,null,0.48222875423234079,0.83822628814811173,{"$f":"C$17*$E$6/(6*8*'Steel Eurocode 3'!$X$8*'Steel Eurocode 3'!$E$10)*100*1000*AK182","v":0.75445300775581725},{"$f":"C$18*E$7/(6*8*'Steel Eurocode 3'!X$8*'Steel Eurocode 3'!E$10)*100*1000*Y182","v":0.55967787040280226},{"$f":"C$14*B182*(8^3-2*8*B182^2+B182^3)/24/('Steel Eurocode 3'!E$10*'Steel Eurocode 3'!X$8)*100*1000","v":4.2680990553902101},null,144.74633625600006,161.06633625600006,1.6897131159480718E-6,6.5120006582714801E-6,1.3726307210407804E-5,2.2108570091888921E-5]
[104,3.2960000000000025,-529.64055878400018,59.234207999999796,-20.6762210438166,-20.6762210438166,-6.9280264866667798,-7.6640625,10.893187499999899,15.328125,10.21875,{"$f":"'Graph Properties'!C$3*8/2-B183*C$3","v":30.4582079999999},36.051749999999977,73.991598000000025,50.521500000000039,33.681000000000026,{"$f":"C$3*8/2*'Graph Properties'!B183-'Graph Properties'!C$3*B183^2/2","v":335.39471078400004},1.3876869141856394,2.4180024371887803,{"$f":"D$17*$E$6/(6*8*'Steel Eurocode 3'!$X$8*'Steel Eurocode 3'!$E$10)*100*1000*X183","v":2.1799494140605464},{"$f":"D$18*E$7/(6*8*'Steel Eurocode 3'!X$8*'Steel Eurocode 3'!E$10)*100*1000*Y183","v":1.6179369762877724},{"$f":"D$14*B183*(8^3-2*8*B183^2+B183^3)/24/('Steel Eurocode 3'!E$10*'Steel Eurocode 3'!X$8)*100*1000","v":13.072645302093861},null,145.47352166400006,161.95352166400008,4.8605909398715706E-6,1.8737460081727965E-5,3.9515896392294224E-5,6.3695920764182028E-5,null,0.48267370928196141,0.84104432597870615,{"$f":"C$17*$E$6/(6*8*'Steel Eurocode 3'!$X$8*'Steel Eurocode 3'!$E$10)*100*1000*AK183","v":0.75824327445584228},{"$f":"C$18*E$7/(6*8*'Steel Eurocode 3'!X$8*'Steel Eurocode 3'!E$10)*100*1000*Y183","v":0.56276068740444252},{"$f":"C$14*B183*(8^3-2*8*B183^2+B183^3)/24/('Steel Eurocode 3'!E$10*'Steel Eurocode 3'!X$8)*100*1000","v":4.2833044895458272},null,145.47352166400006,161.95352166400008,1.6906403269118504E-6,6.5173774197314646E-6,1.3744659614711033E-5,2.2155102874498095E-5]
[105,3.3280000000000025,-531.49297401600006,56.541743999999788,-20.748582070491675,-20.748582070491675,-6.9523001703295266,-7.6640625,9.5851874999998969,15.328125,10.21875,{"$f":"'Graph Properties'!C$3*8/2-B184*C$3","v":29.073743999999891},35.806499999999978,74.31925200000002,51.012000000000036,34.008000000000024,{"$f":"C$3*8/2*'Graph Properties'!B184-'Graph Properties'!C$3*B184^2/2","v":336.34722201600005},1.3887496135434911,2.4256598831399114,{"$f":"D$17*$E$6/(6*8*'Steel Eurocode 3'!$X$8*'Steel Eurocode 3'!$E$10)*100*1000*X184","v":2.1905429712284219},{"$f":"D$18*E$7/(6*8*'Steel Eurocode 3'!X$8*'Steel Eurocode 3'!E$10)*100*1000*Y184","v":1.6265977687710234},{"$f":"D$14*B184*(8^3-2*8*B184^2+B184^3)/24/('Steel Eurocode 3'!E$10*'Steel Eurocode 3'!X$8)*100*1000","v":13.117031833808827},null,146.18045644800003,162.82045644800004,4.8625348500264084E-6,1.875003098546132E-5,3.9562163162371789E-5,6.3818761993770902E-5,null,0.48304334384121417,0.84370778543996905,{"$f":"C$17*$E$6/(6*8*'Steel Eurocode 3'!$X$8*'Steel Eurocode 3'!$E$10)*100*1000*AK184","v":0.76192798999249456},{"$f":"C$18*E$7/(6*8*'Steel Eurocode 3'!X$8*'Steel Eurocode 3'!E$10)*100*1000*Y184","v":0.56577313696383413},{"$f":"C$14*B184*(8^3-2*8*B184^2+B184^3)/24/('Steel Eurocode 3'!E$10*'Steel Eurocode 3'!X$8)*100*1000","v":4.2978479140920145},null,146.18045644800003,162.82045644800004,1.6913164695744028E-6,6.5217499079865448E-6,1.3760752404303228E-5,2.2197830258702919E-5]
[106,3.3600000000000025,-533.25923040000009,53.84927999999978,-20.817744775221424,-20.817744775221424,-6.9755022667000262,-7.6640625,8.2771874999998953,15.328125,10.21875,{"$f":"'Graph Properties'!C$3*8/2-B185*C$3","v":27.689279999999883},35.56124999999998,74.60505000000002,51.50250000000004,34.335000000000029,{"$f":"C$3*8/2*'Graph Properties'!B185-'Graph Properties'!C$3*B185^2/2","v":337.25543040000002},1.3895972395963641,2.4328709482111592,{"$f":"D$17*$E$6/(6*8*'Steel Eurocode 3'!$X$8*'Steel Eurocode 3'!$E$10)*100*1000*X185","v":2.2008301225919449},{"$f":"D$18*E$7/(6*8*'Steel Eurocode 3'!X$8*'Steel Eurocode 3'!E$10)*100*1000*Y185","v":1.6350542907180394},{"$f":"D$14*B185*(8^3-2*8*B185^2+B185^3)/24/('Steel Eurocode 3'!E$10*'Steel Eurocode 3'!X$8)*100*1000","v":13.159392174103916},null,146.86694400000005,163.66694400000006,4.8637618491646513E-6,1.8759734245128291E-5,3.9601977733299985E-5,6.3930687215411577E-5,null,0.48333817029438741,0.84621598198648984,{"$f":"C$17*$E$6/(6*8*'Steel Eurocode 3'!$X$8*'Steel Eurocode 3'!$E$10)*100*1000*AK185","v":0.76550612959719821},{"$f":"C$18*E$7/(6*8*'Steel Eurocode 3'!X$8*'Steel Eurocode 3'!E$10)*100*1000*Y185","v":0.56871453590192667},{"$f":"C$14*B185*(8^3-2*8*B185^2+B185^3)/24/('Steel Eurocode 3'!E$10*'Steel Eurocode 3'!X$8)*100*1000","v":4.3117274489200241},null,146.86694400000005,163.66694400000006,1.6917432518833568E-6,6.5251249548272311E-6,1.3774600950713036E-5,2.2236760770577935E-5]
[107,3.3920000000000026,-534.93932793600015,51.156815999999765,-20.883698532899174,-20.883698532899174,-6.9976291904546208,-7.6640625,6.9691874999998937,15.328125,10.21875,{"$f":"'Graph Properties'!C$3*8/2-B186*C$3","v":26.304815999999875},35.315999999999974,74.848992000000024,51.993000000000038,34.662000000000027,{"$f":"C$3*8/2*'Graph Properties'!B186-'Graph Properties'!C$3*B186^2/2","v":338.11933593600008},1.3902312654490867,2.4396339157443636,{"$f":"D$17*$E$6/(6*8*'Steel Eurocode 3'!$X$8*'Steel Eurocode 3'!$E$10)*100*1000*X186","v":2.2108079219414569},{"$f":"D$18*E$7/(6*8*'Steel Eurocode 3'!X$8*'Steel Eurocode 3'!E$10)*100*1000*Y186","v":1.6433045779890483},{"$f":"D$14*B186*(8^3-2*8*B186^2+B186^3)/24/('Steel Eurocode 3'!E$10*'Steel Eurocode 3'!X$8)*100*1000","v":13.199720851775218},null,147.53278771200004,164.49278771200008,4.8642768476357267E-6,1.8766589502126594E-5,3.9635384298223671E-5,6.4031723455667305E-5,null,0.48355870102576926,0.84856831851977854,{"$f":"C$17*$E$6/(6*8*'Steel Eurocode 3'!$X$8*'Steel Eurocode 3'!$E$10)*100*1000*AK186","v":0.76897666850137636},{"$f":"C$18*E$7/(6*8*'Steel Eurocode 3'!X$8*'Steel Eurocode 3'!E$10)*100*1000*Y186","v":0.57158420103966889},{"$f":"C$14*B186*(8^3-2*8*B186^2+B186^3)/24/('Steel Eurocode 3'!E$10*'Steel Eurocode 3'!X$8)*100*1000","v":4.3249413013680273},null,147.53278771200004,164.49278771200008,1.6919223817863395E-6,6.5275093920440321E-6,1.3786220625469101E-5,2.2271903810666886E-5]
[108,3.4240000000000026,-536.53326662400013,48.464351999999792,-20.946433236716157,-20.946433236716157,-7.0186775311634859,-7.6640625,5.6611874999998939,15.328125,10.21875,{"$f":"'Graph Properties'!C$3*8/2-B187*C$3","v":24.920351999999895},35.070749999999975,75.051078000000018,52.483500000000042,34.989000000000026,{"$f":"C$3*8/2*'Graph Properties'!B187-'Graph Properties'!C$3*B187^2/2","v":338.938938624},1.3906531642064881,2.445947320491257,{"$f":"D$17*$E$6/(6*8*'Steel Eurocode 3'!$X$8*'Steel Eurocode 3'!$E$10)*100*1000*X187","v":2.2204734230673018},{"$f":"D$18*E$7/(6*8*'Steel Eurocode 3'!X$8*'Steel Eurocode 3'!E$10)*100*1000*Y187","v":1.6513466664442786},{"$f":"D$14*B187*(8^3-2*8*B187^2+B187^3)/24/('Steel Eurocode 3'!E$10*'Steel Eurocode 3'!X$8)*100*1000","v":13.238012662506831},null,148.17779097600007,165.29779097600007,4.8640847557890633E-6,1.8770616397853943E-5,3.9662427050287711E-5,6.412190025520028E-5,null,0.48370544841964802,0.85076428538826376,{"$f":"C$17*$E$6/(6*8*'Steel Eurocode 3'!$X$8*'Steel Eurocode 3'!$E$10)*100*1000*AK187","v":0.77233858193645277},{"$f":"C$18*E$7/(6*8*'Steel Eurocode 3'!X$8*'Steel Eurocode 3'!E$10)*100*1000*Y187","v":0.57438144919800982},{"$f":"C$14*B187*(8^3-2*8*B187^2+B187^3)/24/('Steel Eurocode 3'!E$10*'Steel Eurocode 3'!X$8)*100*1000","v":4.3374877662211118},null,148.17779097600007,165.29779097600007,1.6918555672309784E-6,6.5289100514274582E-6,1.3795626800100071E-5,2.2303269653982709E-5]
[109,3.4560000000000026,-538.04104646400015,45.771887999999777,-21.005939298161476,-21.005939298161476,-7.0386440532906356,-7.6640625,4.3531874999998941,15.328125,10.21875,{"$f":"'Graph Properties'!C$3*8/2-B188*C$3","v":23.535887999999886},34.825499999999977,75.211308000000002,52.974000000000039,35.316000000000024,{"$f":"C$3*8/2*'Graph Properties'!B188-'Graph Properties'!C$3*B188^2/2","v":339.71423846400006},1.3908644089733966,2.4518099486134615,{"$f":"D$17*$E$6/(6*8*'Steel Eurocode 3'!$X$8*'Steel Eurocode 3'!$E$10)*100*1000*X188","v":2.2298236797598205},{"$f":"D$18*E$7/(6*8*'Steel Eurocode 3'!X$8*'Steel Eurocode 3'!E$10)*100*1000*Y188","v":1.6591785919439588},{"$f":"D$14*B188*(8^3-2*8*B188^2+B188^3)/24/('Steel Eurocode 3'!E$10*'Steel Eurocode 3'!X$8)*100*1000","v":13.27426266887084},null,148.80175718400002,166.08175718400005,4.8631904839740919E-6,1.8771834573708058E-5,3.9683150182636983E-5,6.4201249668771596E-5,null,0.48377892486031193,0.85280346038729038,{"$f":"C$17*$E$6/(6*8*'Steel Eurocode 3'!$X$8*'Steel Eurocode 3'!$E$10)*100*1000*AK188","v":0.77559084513385057},{"$f":"C$18*E$7/(6*8*'Steel Eurocode 3'!X$8*'Steel Eurocode 3'!E$10)*100*1000*Y188","v":0.57710559719789856},{"$f":"C$14*B188*(8^3-2*8*B188^2+B188^3)/24/('Steel Eurocode 3'!E$10*'Steel Eurocode 3'!X$8)*100*1000","v":4.349365225711284},null,148.80175718400002,166.08175718400005,1.6915445161649014E-6,6.5293337647680204E-6,1.3802834846134602E-5,2.2330869450007505E-5]
[110,3.4880000000000027,-539.46266745600019,43.079423999999769,-21.062207647022127,-21.062207647022127,-7.0575256961939248,-7.6640625,3.0451874999998907,15.328125,10.21875,{"$f":"'Graph Properties'!C$3*8/2-B189*C$3","v":22.151423999999878},34.580249999999978,75.32968200000002,53.464500000000044,35.643000000000029,{"$f":"C$3*8/2*'Graph Properties'!B189-'Graph Properties'!C$3*B189^2/2","v":340.44523545600009},1.3908664728546409,2.4572208376824838,{"$f":"D$17*$E$6/(6*8*'Steel Eurocode 3'!$X$8*'Steel Eurocode 3'!$E$10)*100*1000*X189","v":2.2388557458093579},{"$f":"D$18*E$7/(6*8*'Steel Eurocode 3'!X$8*'Steel Eurocode 3'!E$10)*100*1000*Y189","v":1.6667983903483177},{"$f":"D$14*B189*(8^3-2*8*B189^2+B189^3)/24/('Steel Eurocode 3'!E$10*'Steel Eurocode 3'!X$8)*100*1000","v":13.308466200327327},null,149.40448972800004,166.84448972800007,4.8615989425402384E-6,1.8770263671086648E-5,3.9697597888416317E-5,6.4269806265241153E-5,null,0.4837796427320491,0.85468550875912475,{"$f":"C$17*$E$6/(6*8*'Steel Eurocode 3'!$X$8*'Steel Eurocode 3'!$E$10)*100*1000*AK189","v":0.77873243332499409},{"$f":"C$18*E$7/(6*8*'Steel Eurocode 3'!X$8*'Steel Eurocode 3'!E$10)*100*1000*Y189","v":0.57975596186028433},{"$f":"C$14*B189*(8^3-2*8*B189^2+B189^3)/24/('Steel Eurocode 3'!E$10*'Steel Eurocode 3'!X$8)*100*1000","v":4.3605721495174725},null,149.40448972800004,166.84448972800007,1.6909909365357349E-6,6.528787363856225E-6,1.3807860135101326E-5,2.2354715222692574E-5]
[111,3.5200000000000027,-540.79812960000015,40.38695999999976,-21.115229731382982,-21.115229731382982,-7.0753195741250385,-7.6640625,1.7371874999998909,15.328125,10.21875,{"$f":"'Graph Properties'!C$3*8/2-B190*C$3","v":20.76695999999987},34.33499999999998,75.406199999999998,53.955000000000041,35.970000000000027,{"$f":"C$3*8/2*'Graph Properties'!B190-'Graph Properties'!C$3*B190^2/2","v":341.13192960000009},1.3906608289550493,2.4621792766797324,{"$f":"D$17*$E$6/(6*8*'Steel Eurocode 3'!$X$8*'Steel Eurocode 3'!$E$10)*100*1000*X190","v":2.2475666750062553},{"$f":"D$18*E$7/(6*8*'Steel Eurocode 3'!X$8*'Steel Eurocode 3'!E$10)*100*1000*Y190","v":1.6742040975175834},{"$f":"D$14*B190*(8^3-2*8*B190^2+B190^3)/24/('Steel Eurocode 3'!E$10*'Steel Eurocode 3'!X$8)*100*1000","v":13.340618853224361},null,149.98579200000003,167.58579200000005,4.859315041836933E-6,1.8765923331387426E-5,3.9705814360770577E-5,6.4327607127567902E-5,null,0.48370811441914763,0.85641018319295059,{"$f":"C$17*$E$6/(6*8*'Steel Eurocode 3'!$X$8*'Steel Eurocode 3'!$E$10)*100*1000*AK190","v":0.78176232174130622},{"$f":"C$18*E$7/(6*8*'Steel Eurocode 3'!X$8*'Steel Eurocode 3'!E$10)*100*1000*Y190","v":0.58233186000611581},{"$f":"C$14*B190*(8^3-2*8*B190^2+B190^3)/24/('Steel Eurocode 3'!E$10*'Steel Eurocode 3'!X$8)*100*1000","v":4.3711070947655184},null,149.98579200000003,167.58579200000005,1.6901965362911069E-6,6.5272776804825831E-6,1.3810718038528893E-5,2.2374819870458399E-5]
[112,3.5520000000000027,-542.04743289600003,37.694495999999774,-21.164997517626819,-21.164997517626819,-7.0920229762295062,-7.6640625,0.42918749999988748,15.328125,10.21875,{"$f":"'Graph Properties'!C$3*8/2-B191*C$3","v":19.38249599999989},34.089749999999974,75.440861999999996,54.445500000000038,36.297000000000025,{"$f":"C$3*8/2*'Graph Properties'!B191-'Graph Properties'!C$3*B191^2/2","v":341.77432089600001},1.3902489503794511,2.4666848059964983,{"$f":"D$17*$E$6/(6*8*'Steel Eurocode 3'!$X$8*'Steel Eurocode 3'!$E$10)*100*1000*X191","v":2.2559535211408566},{"$f":"D$18*E$7/(6*8*'Steel Eurocode 3'!X$8*'Steel Eurocode 3'!E$10)*100*1000*Y191","v":1.6813937493119848},{"$f":"D$14*B191*(8^3-2*8*B191^2+B191^3)/24/('Steel Eurocode 3'!E$10*'Steel Eurocode 3'!X$8)*100*1000","v":13.37071649079803},null,150.54546739200003,168.30546739200005,4.856343692213604E-6,1.8758833196008114E-5,3.9707843792844628E-5,6.4374691852809611E-5,null,0.48356485230589602,0.85797732382486902,{"$f":"C$17*$E$6/(6*8*'Steel Eurocode 3'!$X$8*'Steel Eurocode 3'!$E$10)*100*1000*AK191","v":0.78467948561421086},{"$f":"C$18*E$7/(6*8*'Steel Eurocode 3'!X$8*'Steel Eurocode 3'!E$10)*100*1000*Y191","v":0.58483260845634244},{"$f":"C$14*B191*(8^3-2*8*B191^2+B191^3)/24/('Steel Eurocode 3'!E$10*'Steel Eurocode 3'!X$8)*100*1000","v":4.3809687060281881},null,150.54546739200003,168.30546739200005,1.6891630233786448E-6,6.5248115464376051E-6,1.3811423927945955E-5,2.2391197166194646E-5]
[113,3.5840000000000027,-543.21057734400006,35.002031999999772,-21.211503490434286,-21.211503490434286,-7.1076333665466889,-7.6640625,-0.87881250000011235,15.328125,10.21875,{"$f":"'Graph Properties'!C$3*8/2-B192*C$3","v":17.998031999999881},33.844499999999975,75.433667999999997,54.936000000000043,36.624000000000031,{"$f":"C$3*8/2*'Graph Properties'!B192-'Graph Properties'!C$3*B192^2/2","v":342.37240934400006},1.3896323102326742,2.4707372174339644,{"$f":"D$17*$E$6/(6*8*'Steel Eurocode 3'!$X$8*'Steel Eurocode 3'!$E$10)*100*1000*X192","v":2.2640133380035037},{"$f":"D$18*E$7/(6*8*'Steel Eurocode 3'!X$8*'Steel Eurocode 3'!E$10)*100*1000*Y192","v":1.6883653815917501},{"$f":"D$14*B192*(8^3-2*8*B192^2+B192^3)/24/('Steel Eurocode 3'!E$10*'Steel Eurocode 3'!X$8)*100*1000","v":13.398755243172392},null,151.08331929600004,169.00331929600006,4.8526898040196808E-6,1.8749012906346422E-5,3.9703730377783335E-5,6.441110255212298E-5,null,0.48335036877658238,0.85938685823790073,{"$f":"C$17*$E$6/(6*8*'Steel Eurocode 3'!$X$8*'Steel Eurocode 3'!$E$10)*100*1000*AK192","v":0.78748290017513167},{"$f":"C$18*E$7/(6*8*'Steel Eurocode 3'!X$8*'Steel Eurocode 3'!E$10)*100*1000*Y192","v":0.587257524031913},{"$f":"C$14*B192*(8^3-2*8*B192^2+B192^3)/24/('Steel Eurocode 3'!E$10*'Steel Eurocode 3'!X$8)*100*1000","v":4.3901557153251609},null,151.08331929600004,169.00331929600006,1.6878921057459758E-6,6.5213957935117996E-6,1.3809993174881157E-5,2.2403861757260164E-5]
[114,3.6160000000000028,-544.287562944,32.309567999999757,-21.254740652783916,-21.254740652783916,-7.1221483840097868,-7.6640625,-2.1868125000001122,15.328125,10.21875,{"$f":"'Graph Properties'!C$3*8/2-B193*C$3","v":16.613567999999873},33.599249999999977,75.384617999999989,55.42650000000004,36.951000000000029,{"$f":"C$3*8/2*'Graph Properties'!B193-'Graph Properties'!C$3*B193^2/2","v":342.92619494400003},1.3888123816195479,2.4743365542032087,{"$f":"D$17*$E$6/(6*8*'Steel Eurocode 3'!$X$8*'Steel Eurocode 3'!$E$10)*100*1000*X193","v":2.2717431793845395},{"$f":"D$18*E$7/(6*8*'Steel Eurocode 3'!X$8*'Steel Eurocode 3'!E$10)*100*1000*Y193","v":1.6951170302171081},{"$f":"D$14*B193*(8^3-2*8*B193^2+B193^3)/24/('Steel Eurocode 3'!E$10*'Steel Eurocode 3'!X$8)*100*1000","v":13.42473150735951},null,151.59915110400004,169.67915110400006,4.848358287604591E-6,1.8736482103800069E-5,3.9693518308731547E-5,6.4436883850763633E-5,null,0.48306517621549477,0.8606388014619859,{"$f":"C$17*$E$6/(6*8*'Steel Eurocode 3'!$X$8*'Steel Eurocode 3'!$E$10)*100*1000*AK193","v":0.79017154065549189},{"$f":"C$18*E$7/(6*8*'Steel Eurocode 3'!X$8*'Steel Eurocode 3'!E$10)*100*1000*Y193","v":0.58960592355377661},{"$f":"C$14*B193*(8^3-2*8*B193^2+B193^3)/24/('Steel Eurocode 3'!E$10*'Steel Eurocode 3'!X$8)*100*1000","v":4.3986669421230369},null,151.59915110400004,169.67915110400006,1.6863854913407273E-6,6.5170372534956752E-6,1.3806441150863145E-5,2.2412829165483003E-5]
[115,3.6480000000000028,-545.27838969600009,29.617103999999749,-21.294702525952133,-21.294702525952133,-7.1355658424458355,-7.6640625,-3.4948125000001156,15.328125,10.21875,{"$f":"'Graph Properties'!C$3*8/2-B194*C$3","v":15.229103999999865},33.353999999999978,75.293711999999985,55.917000000000044,37.278000000000027,{"$f":"C$3*8/2*'Graph Properties'!B194-'Graph Properties'!C$3*B194^2/2","v":343.43567769600008},1.3877906376449003,2.477483110925196,{"$f":"D$17*$E$6/(6*8*'Steel Eurocode 3'!$X$8*'Steel Eurocode 3'!$E$10)*100*1000*X194","v":2.2791400990743065},{"$f":"D$18*E$7/(6*8*'Steel Eurocode 3'!X$8*'Steel Eurocode 3'!E$10)*100*1000*Y194","v":1.7016467310482868},{"$f":"D$14*B194*(8^3-2*8*B194^2+B194^3)/24/('Steel Eurocode 3'!E$10*'Steel Eurocode 3'!X$8)*100*1000","v":13.448641947259441},null,152.09276620800003,170.33276620800004,4.8433540533177654E-6,1.8721260429766767E-5,3.9677251778834123E-5,6.4452082888086083E-5,null,0.4827097870069218,0.8617332559739812,{"$f":"C$17*$E$6/(6*8*'Steel Eurocode 3'!$X$8*'Steel Eurocode 3'!$E$10)*100*1000*AK194","v":0.79274438228671529},{"$f":"C$18*E$7/(6*8*'Steel Eurocode 3'!X$8*'Steel Eurocode 3'!E$10)*100*1000*Y194","v":0.59187712384288227},{"$f":"C$14*B194*(8^3-2*8*B194^2+B194^3)/24/('Steel Eurocode 3'!E$10*'Steel Eurocode 3'!X$8)*100*1000","v":4.4065012933353342},null,152.09276620800003,170.33276620800004,1.6846448881105269E-6,6.5117427581797448E-6,1.3800783227420562E-5,2.2418115787160375E-5]
[116,3.6800000000000028,-546.18305759999998,26.924639999999769,-21.33138314951325,-21.33138314951325,-7.1478837305757112,-7.6640625,-4.8028125000001154,15.328125,10.21875,{"$f":"'Graph Properties'!C$3*8/2-B195*C$3","v":13.844639999999885},33.108749999999972,75.160949999999985,56.407500000000041,37.605000000000032,{"$f":"C$3*8/2*'Graph Properties'!B195-'Graph Properties'!C$3*B195^2/2","v":343.90085759999999},1.3865685514135599,2.4801774336307805,{"$f":"D$17*$E$6/(6*8*'Steel Eurocode 3'!$X$8*'Steel Eurocode 3'!$E$10)*100*1000*X195","v":2.2862011508631483},{"$f":"D$18*E$7/(6*8*'Steel Eurocode 3'!X$8*'Steel Eurocode 3'!E$10)*100*1000*Y195","v":1.7079525199455154},{"$f":"D$14*B195*(8^3-2*8*B195^2+B195^3)/24/('Steel Eurocode 3'!E$10*'Steel Eurocode 3'!X$8)*100*1000","v":13.470483493660247},null,152.56396800000005,170.96396800000005,4.8376820115086309E-6,1.870336752564423E-5,3.9654974981235913E-5,6.4456749317543717E-5,null,0.48228471353515129,0.86267041169766268,{"$f":"C$17*$E$6/(6*8*'Steel Eurocode 3'!$X$8*'Steel Eurocode 3'!$E$10)*100*1000*AK195","v":0.79520040030022543},{"$f":"C$18*E$7/(6*8*'Steel Eurocode 3'!X$8*'Steel Eurocode 3'!E$10)*100*1000*Y195","v":0.5940704417201792},{"$f":"C$14*B195*(8^3-2*8*B195^2+B195^3)/24/('Steel Eurocode 3'!E$10*'Steel Eurocode 3'!X$8)*100*1000","v":4.4136577633224929},null,152.56396800000005,170.96396800000005,1.6826720040030018E-6,6.5055191393545145E-6,1.3793034776082057E-5,2.2419738893058683E-5]
[117,3.7120000000000029,-547.00156665600002,24.232175999999761,-21.364777081339462,-21.364777081339462,-7.1591002120141232,-7.6640625,-6.1108125000001152,15.328125,10.21875,{"$f":"'Graph Properties'!C$3*8/2-B196*C$3","v":12.460175999999876},32.863499999999974,74.986331999999976,56.898000000000046,37.932000000000031,{"$f":"C$3*8/2*'Graph Properties'!B196-'Graph Properties'!C$3*B196^2/2","v":344.32173465600005},1.3851475960303559,2.4824203197607106,{"$f":"D$17*$E$6/(6*8*'Steel Eurocode 3'!$X$8*'Steel Eurocode 3'!$E$10)*100*1000*X196","v":2.2929233885414066},{"$f":"D$18*E$7/(6*8*'Steel Eurocode 3'!X$8*'Steel Eurocode 3'!E$10)*100*1000*Y196","v":1.714032432769022},{"$f":"D$14*B196*(8^3-2*8*B196^2+B196^3)/24/('Steel Eurocode 3'!E$10*'Steel Eurocode 3'!X$8)*100*1000","v":13.490253344237969},null,153.01255987200003,171.57255987200006,4.8313470725266168E-6,1.8682823032830177E-5,3.962673210908181E-5,6.4450935306688918E-5,null,0.48179046818447163,0.86345054600372551,{"$f":"C$17*$E$6/(6*8*'Steel Eurocode 3'!$X$8*'Steel Eurocode 3'!$E$10)*100*1000*AK196","v":0.79753856992744576},{"$f":"C$18*E$7/(6*8*'Steel Eurocode 3'!X$8*'Steel Eurocode 3'!E$10)*100*1000*Y196","v":0.59618519400661629},{"$f":"C$14*B196*(8^3-2*8*B196^2+B196^3)/24/('Steel Eurocode 3'!E$10*'Steel Eurocode 3'!X$8)*100*1000","v":4.4201354338918639},null,153.01255987200003,171.57255987200006,1.6804685469657796E-6,6.4983732288104964E-6,1.3783211168376279E-5,2.2417716628413534E-5]
[118,3.7440000000000029,-547.73391686400009,21.539711999999749,-21.394879397600853,-21.394879397600853,-7.1692136252696192,-7.6640625,-7.4188125000001186,15.328125,10.21875,{"$f":"'Graph Properties'!C$3*8/2-B197*C$3","v":11.075711999999868},32.618249999999975,74.769857999999971,57.388500000000043,38.259000000000029,{"$f":"C$3*8/2*'Graph Properties'!B197-'Graph Properties'!C$3*B197^2/2","v":344.69830886400007},1.3835292446001164,2.4842128181656249,{"$f":"D$17*$E$6/(6*8*'Steel Eurocode 3'!$X$8*'Steel Eurocode 3'!$E$10)*100*1000*X197","v":2.2993038658994256},{"$f":"D$18*E$7/(6*8*'Steel Eurocode 3'!X$8*'Steel Eurocode 3'!E$10)*100*1000*Y197","v":1.719884505379035},{"$f":"D$14*B197*(8^3-2*8*B197^2+B197^3)/24/('Steel Eurocode 3'!E$10*'Steel Eurocode 3'!X$8)*100*1000","v":13.507948963556652},null,153.43834521600004,172.15834521600004,4.8243541467211505E-6,1.8659646592722315E-5,3.9592567355516636E-5,6.4434695537172887E-5,null,0.48122756333917094,0.86407402370978237,{"$f":"C$17*$E$6/(6*8*'Steel Eurocode 3'!$X$8*'Steel Eurocode 3'!$E$10)*100*1000*AK197","v":0.79975786639980018},{"$f":"C$18*E$7/(6*8*'Steel Eurocode 3'!X$8*'Steel Eurocode 3'!E$10)*100*1000*Y197","v":0.59822069752314244},{"$f":"C$14*B197*(8^3-2*8*B197^2+B197^3)/24/('Steel Eurocode 3'!E$10*'Steel Eurocode 3'!X$8)*100*1000","v":4.4259334742977234},null,153.43834521600004,172.15834521600004,1.6780362249464873E-6,6.4903118583381965E-6,1.3771327775831871E-5,2.2412068012929695E-5]
[119,3.7760000000000029,-548.38010822400008,18.847247999999741,-21.421685692765394,-21.421685692765394,-7.1782224837445865,-7.6640625,-8.7268125000001184,15.328125,10.21875,{"$f":"'Graph Properties'!C$3*8/2-B198*C$3","v":9.6912479999998595},32.372999999999976,74.511527999999984,57.879000000000048,38.586000000000027,{"$f":"C$3*8/2*'Graph Properties'!B198-'Graph Properties'!C$3*B198^2/2","v":345.03058022400006},1.3817149702276705,2.4855562291060513,{"$f":"D$17*$E$6/(6*8*'Steel Eurocode 3'!$X$8*'Steel Eurocode 3'!$E$10)*100*1000*X198","v":2.3053396367275467},{"$f":"D$18*E$7/(6*8*'Steel Eurocode 3'!X$8*'Steel Eurocode 3'!E$10)*100*1000*Y198","v":1.7255067736357832},{"$f":"D$14*B198*(8^3-2*8*B198^2+B198^3)/24/('Steel Eurocode 3'!E$10*'Steel Eurocode 3'!X$8)*100*1000","v":13.523568083068341},null,153.84112742400004,172.72112742400006,4.816708144441664E-6,1.863385784671837E-5,3.9552524913685255E-5,6.4408087204745768E-5,null,0.48059651138353765,0.86454129708036576,{"$f":"C$17*$E$6/(6*8*'Steel Eurocode 3'!$X$8*'Steel Eurocode 3'!$E$10)*100*1000*AK198","v":0.80185726494871179},{"$f":"C$18*E$7/(6*8*'Steel Eurocode 3'!X$8*'Steel Eurocode 3'!E$10)*100*1000*Y198","v":0.60017626909070709},{"$f":"C$14*B198*(8^3-2*8*B198^2+B198^3)/24/('Steel Eurocode 3'!E$10*'Steel Eurocode 3'!X$8)*100*1000","v":4.4310511412412641},null,153.84112742400004,172.72112742400006,1.6753767458927525E-6,6.4813418597281286E-6,1.3757399969977481E-5,2.2402812940781139E-5]
[120,3.8080000000000029,-548.94014073599999,16.154783999999758,-21.445192079598932,-21.445192079598932,-7.1861254757352464,-7.6640625,-10.034812500000122,15.328125,10.21875,{"$f":"'Graph Properties'!C$3*8/2-B199*C$3","v":8.3067839999998796},32.127749999999978,74.211341999999973,58.369500000000045,38.913000000000032,{"$f":"C$3*8/2*'Graph Properties'!B199-'Graph Properties'!C$3*B199^2/2","v":345.31854873599997},1.3797062460178464,2.4864521042524119,{"$f":"D$17*$E$6/(6*8*'Steel Eurocode 3'!$X$8*'Steel Eurocode 3'!$E$10)*100*1000*X199","v":2.3110277548161129},{"$f":"D$18*E$7/(6*8*'Steel Eurocode 3'!X$8*'Steel Eurocode 3'!E$10)*100*1000*Y199","v":1.730897273399495},{"$f":"D$14*B199*(8^3-2*8*B199^2+B199^3)/24/('Steel Eurocode 3'!E$10*'Steel Eurocode 3'!X$8)*100*1000","v":13.537108701113066},null,154.22070988800004,173.26070988800006,4.8084139760375831E-6,1.8605476436216046E-5,3.950664897673254E-5,6.437117001925666E-5,null,0.47989782470185965,0.86485290582692576,{"$f":"C$17*$E$6/(6*8*'Steel Eurocode 3'!$X$8*'Steel Eurocode 3'!$E$10)*100*1000*AK199","v":0.80383574080560449},{"$f":"C$18*E$7/(6*8*'Steel Eurocode 3'!X$8*'Steel Eurocode 3'!E$10)*100*1000*Y199","v":0.60205122553025903},{"$f":"C$14*B199*(8^3-2*8*B199^2+B199^3)/24/('Steel Eurocode 3'!E$10*'Steel Eurocode 3'!X$8)*100*1000","v":4.4354877788705975},null,154.22070988800004,173.26070988800006,1.6724918177522027E-6,6.4714700647707988E-6,1.3741443122341752E-5,2.238997218061101E-5]
[121,3.840000000000003,-549.41401440000004,13.46231999999975,-21.465395189165211,-21.465395189165211,-7.1929214644316568,-7.6640625,-11.342812500000122,15.328125,10.21875,{"$f":"'Graph Properties'!C$3*8/2-B200*C$3","v":6.9223199999998712},31.882499999999975,73.869299999999967,58.860000000000042,39.24000000000003,{"$f":"C$3*8/2*'Graph Properties'!B200-'Graph Properties'!C$3*B200^2/2","v":345.56221440000002},1.377504545075473,2.4869022466850152,{"$f":"D$17*$E$6/(6*8*'Steel Eurocode 3'!$X$8*'Steel Eurocode 3'!$E$10)*100*1000*X200","v":2.3163652739554674},{"$f":"D$18*E$7/(6*8*'Steel Eurocode 3'!X$8*'Steel Eurocode 3'!E$10)*100*1000*Y200","v":1.7360540405303986},{"$f":"D$14*B200*(8^3-2*8*B200^2+B200^3)/24/('Steel Eurocode 3'!E$10*'Steel Eurocode 3'!X$8)*100*1000","v":13.548569082918856},null,154.57689600000003,173.77689600000005,4.7994765518583363E-6,1.8574522002613066E-5,3.945498373780334E-5,6.4324006204653493E-5,null,0.47913201567842539,0.86500947710783094,{"$f":"C$17*$E$6/(6*8*'Steel Eurocode 3'!$X$8*'Steel Eurocode 3'!$E$10)*100*1000*AK200","v":0.80569226920190162},{"$f":"C$18*E$7/(6*8*'Steel Eurocode 3'!X$8*'Steel Eurocode 3'!E$10)*100*1000*Y200","v":0.60384488366274724},{"$f":"C$14*B200*(8^3-2*8*B200^2+B200^3)/24/('Steel Eurocode 3'!E$10*'Steel Eurocode 3'!X$8)*100*1000","v":4.4392428187807518},null,154.57689600000003,173.77689600000005,1.6693831484724649E-6,6.460703305256719E-6,1.3723472604453336E-5,2.2373567375531646E-5]
[122,3.872000000000003,-549.80172921600001,10.769855999999741,-21.482292170825858,-21.482292170825858,-7.1986094879177163,-7.6640625,-12.650812500000121,15.328125,10.21875,{"$f":"'Graph Properties'!C$3*8/2-B201*C$3","v":5.5378559999998629},31.637249999999973,73.485401999999965,59.350500000000046,39.567000000000029,{"$f":"C$3*8/2*'Graph Properties'!B201-'Graph Properties'!C$3*B201^2/2","v":345.76157721600003},1.3751113405053788,2.4869087108940588,{"$f":"D$17*$E$6/(6*8*'Steel Eurocode 3'!$X$8*'Steel Eurocode 3'!$E$10)*100*1000*X201","v":2.3213492479359528},{"$f":"D$18*E$7/(6*8*'Steel Eurocode 3'!X$8*'Steel Eurocode 3'!E$10)*100*1000*Y201","v":1.7409751108887226},{"$f":"D$14*B201*(8^3-2*8*B201^2+B201^3)/24/('Steel Eurocode 3'!E$10*'Steel Eurocode 3'!X$8)*100*1000","v":13.557947760601744},null,154.90948915200002,174.26948915200003,4.7899007822533553E-6,1.8541014187307143E-5,3.9397573390042528E-5,6.4266660498983114E-5,null,0.47829959669752292,0.86501172552836869,{"$f":"C$17*$E$6/(6*8*'Steel Eurocode 3'!$X$8*'Steel Eurocode 3'!$E$10)*100*1000*AK201","v":0.80742582536902696},{"$f":"C$18*E$7/(6*8*'Steel Eurocode 3'!X$8*'Steel Eurocode 3'!E$10)*100*1000*Y201","v":0.60555656030912086},{"$f":"C$14*B201*(8^3-2*8*B201^2+B201^3)/24/('Steel Eurocode 3'!E$10*'Steel Eurocode 3'!X$8)*100*1000","v":4.4423157800136766},null,154.90948915200002,174.26948915200003,1.6660524460011669E-6,6.4490484129763963E-6,1.3703503787840877E-5,2.2353621043124565E-5]
[123,3.904000000000003,-550.10328518400001,8.0773919999997617,-21.49588069224038,-21.49588069224038,-7.2031887591711561,-7.6640625,-13.958812500000121,15.328125,10.21875,{"$f":"'Graph Properties'!C$3*8/2-B202*C$3","v":4.153391999999883},31.391999999999975,73.059647999999953,59.841000000000044,39.894000000000034,{"$f":"C$3*8/2*'Graph Properties'!B202-'Graph Properties'!C$3*B202^2/2","v":345.91663718399997},1.3725281054123921,2.4864738027796398,{"$f":"D$17*$E$6/(6*8*'Steel Eurocode 3'!$X$8*'Steel Eurocode 3'!$E$10)*100*1000*X202","v":2.3259767305479118},{"$f":"D$18*E$7/(6*8*'Steel Eurocode 3'!X$8*'Steel Eurocode 3'!E$10)*100*1000*Y202","v":1.7456585203346962},{"$f":"D$14*B202*(8^3-2*8*B202^2+B202^3)/24/('Steel Eurocode 3'!E$10*'Steel Eurocode 3'!X$8)*100*1000","v":13.56524353316574},null,155.21829273600002,174.73829273600003,4.779691577572067E-6,1.8504972631695989E-5,3.9334462126594939E-5,6.4199200154391338E-5,null,0.47740108014344079,0.86486045314074433,{"$f":"C$17*$E$6/(6*8*'Steel Eurocode 3'!$X$8*'Steel Eurocode 3'!$E$10)*100*1000*AK202","v":0.80903538453840396},{"$f":"C$18*E$7/(6*8*'Steel Eurocode 3'!X$8*'Steel Eurocode 3'!E$10)*100*1000*Y202","v":0.60718557229032899},{"$f":"C$14*B202*(8^3-2*8*B202^2+B202^3)/24/('Steel Eurocode 3'!E$10*'Steel Eurocode 3'!X$8)*100*1000","v":4.444706269058238},null,155.21829273600002,174.73829273600003,1.6625014182859359E-6,6.4365122197203436E-6,1.3681552044033021E-5,2.2330156575440464E-5]
[124,3.9360000000000031,-550.31868230399994,5.3849279999997464,-21.506158939366191,-21.506158939366191,-7.2066586660635465,-7.6640625,-15.266812500000128,15.328125,10.21875,{"$f":"'Graph Properties'!C$3*8/2-B203*C$3","v":2.7689279999998746},31.146749999999972,72.592037999999945,60.331500000000048,40.221000000000032,{"$f":"C$3*8/2*'Graph Properties'!B203-'Graph Properties'!C$3*B203^2/2","v":346.02739430399998},1.3697563129013424,2.4856000796517401,{"$f":"D$17*$E$6/(6*8*'Steel Eurocode 3'!$X$8*'Steel Eurocode 3'!$E$10)*100*1000*X203","v":2.3302447755816873},{"$f":"D$18*E$7/(6*8*'Steel Eurocode 3'!X$8*'Steel Eurocode 3'!E$10)*100*1000*Y203","v":1.7501023047285471},{"$f":"D$14*B203*(8^3-2*8*B203^2+B203^3)/24/('Steel Eurocode 3'!E$10*'Steel Eurocode 3'!X$8)*100*1000","v":13.570455466502873},null,155.50311014400003,175.18311014400004,4.7688538481638997E-6,1.8466416977177324E-5,3.9265694140605439E-5,6.412169493712284E-5,null,0.47643697840046684,0.86455654944408333,{"$f":"C$17*$E$6/(6*8*'Steel Eurocode 3'!$X$8*'Steel Eurocode 3'!$E$10)*100*1000*AK203","v":0.81051992194145628},{"$f":"C$18*E$7/(6*8*'Steel Eurocode 3'!X$8*'Steel Eurocode 3'!E$10)*100*1000*Y203","v":0.60873123642732063},{"$f":"C$14*B203*(8^3-2*8*B203^2+B203^3)/24/('Steel Eurocode 3'!E$10*'Steel Eurocode 3'!X$8)*100*1000","v":4.4464139798502202},null,155.50311014400003,175.18311014400004,1.6587317732743996E-6,6.4231015572790677E-6,1.3657632744558412E-5,2.2303198238999245E-5]
[125,3.9680000000000031,-550.447920576,2.6924639999997382,-21.513125616458559,-21.513125616458559,-7.2090187713602996,-7.6640625,-16.574812500000128,15.328125,10.21875,{"$f":"'Graph Properties'!C$3*8/2-B204*C$3","v":1.3844639999998662},30.901499999999974,72.082571999999956,60.822000000000045,40.54800000000003,{"$f":"C$3*8/2*'Graph Properties'!B204-'Graph Properties'!C$3*B204^2/2","v":346.09384857600003},1.3667974360770574,2.4842903502302276,{"$f":"D$17*$E$6/(6*8*'Steel Eurocode 3'!$X$8*'Steel Eurocode 3'!$E$10)*100*1000*X204","v":2.3341504368276218},{"$f":"D$18*E$7/(6*8*'Steel Eurocode 3'!X$8*'Steel Eurocode 3'!E$10)*100*1000*Y204","v":1.7543044999305042},{"$f":"D$14*B204*(8^3-2*8*B204^2+B204^3)/24/('Steel Eurocode 3'!E$10*'Steel Eurocode 3'!X$8)*100*1000","v":13.573582893393148},null,155.76374476800004,175.60374476800004,4.7573925043782827E-6,1.8425366865148856E-5,3.9191313625218906E-5,6.403421712752118E-5,null,0.47540780385288955,0.86410099138442731,{"$f":"C$17*$E$6/(6*8*'Steel Eurocode 3'!$X$8*'Steel Eurocode 3'!$E$10)*100*1000*AK204","v":0.81187841280960749},{"$f":"C$18*E$7/(6*8*'Steel Eurocode 3'!X$8*'Steel Eurocode 3'!E$10)*100*1000*Y204","v":0.61019286954104479},{"$f":"C$14*B204*(8^3-2*8*B204^2+B204^3)/24/('Steel Eurocode 3'!E$10*'Steel Eurocode 3'!X$8)*100*1000","v":4.4474386937723303},null,155.76374476800004,175.60374476800004,1.654745218914185E-6,6.4088232574430799E-6,1.3631761260945705E-5,2.2272771174789977E-5]
[126,4.0000000000000027,-550.49099999999999,0,-21.516779946070663,-21.516779946070663,-7.2102688127206509,-7.6640625,-17.8828125,15.328125,10.21875,{"$f":"'Graph Properties'!C$3*8/2-B205*C$3","v":0},30.656249999999979,71.531249999999957,61.312500000000043,40.875000000000028,{"$f":"C$3*8/2*'Graph Properties'!B205-'Graph Properties'!C$3*B205^2/2","v":346.11599999999999},1.3636529480443664,2.4825476746448722,{"$f":"D$17*$E$6/(6*8*'Steel Eurocode 3'!$X$8*'Steel Eurocode 3'!$E$10)*100*1000*X205","v":2.3376907680760577},{"$f":"D$18*E$7/(6*8*'Steel Eurocode 3'!X$8*'Steel Eurocode 3'!E$10)*100*1000*Y205","v":1.7582631418007957},{"$f":"D$14*B205*(8^3-2*8*B205^2+B205^3)/24/('Steel Eurocode 3'!E$10*'Steel Eurocode 3'!X$8)*100*1000","v":13.574625413504572},null,156.00000000000003,176.00000000000003,4.7453124565646453E-6,1.838184193700831E-5,3.9111364773580182E-5,6.3936841520028905E-5,null,0.47431406888499689,0.86349484335473803,{"$f":"C$17*$E$6/(6*8*'Steel Eurocode 3'!$X$8*'Steel Eurocode 3'!$E$10)*100*1000*AK205","v":0.81310983237428092},{"$f":"C$18*E$7/(6*8*'Steel Eurocode 3'!X$8*'Steel Eurocode 3'!E$10)*100*1000*Y205","v":0.61156978845245047},{"$f":"C$14*B205*(8^3-2*8*B205^2+B205^3)/24/('Steel Eurocode 3'!E$10*'Steel Eurocode 3'!X$8)*100*1000","v":4.447780279654185},null,156.00000000000003,176.00000000000003,1.6505434631529199E-6,6.3936841520028896E-6,1.3603952964723541E-5,2.2238901398270922E-5]
[127,4.0320000000000027,-550.46884857599991,-1.384464000000122,-21.517121658578148,-21.517121658578148,-7.210408699054069,-7.6640625,-17.8828125,15.328125,10.21875,{"$f":"'Graph Properties'!C$3*8/2-B206*C$3","v":-1.384464000000122},30.41099999999998,70.958999999999946,61.80300000000004,41.202000000000027,{"$f":"C$3*8/2*'Graph Properties'!B206-'Graph Properties'!C$3*B206^2/2","v":346.09384857599997},1.3603243219080974,2.4803753539599143,{"$f":"D$17*$E$6/(6*8*'Steel Eurocode 3'!$X$8*'Steel Eurocode 3'!$E$10)*100*1000*X206","v":2.3408628231173387},{"$f":"D$18*E$7/(6*8*'Steel Eurocode 3'!X$8*'Steel Eurocode 3'!E$10)*100*1000*Y206","v":1.7619762661996501},{"$f":"D$14*B206*(8^3-2*8*B206^2+B206^3)/24/('Steel Eurocode 3'!E$10*'Steel Eurocode 3'!X$8)*100*1000","v":13.573582893393148},null,156.21167923200002,176.37167923200002,4.7326186150724142E-6,1.833586183415339E-5,3.9025891778834114E-5,6.3829645318433254E-5,null,0.47315628588107722,0.86273925355127434,{"$f":"C$17*$E$6/(6*8*'Steel Eurocode 3'!$X$8*'Steel Eurocode 3'!$E$10)*100*1000*AK206","v":0.81421315586690035},{"$f":"C$18*E$7/(6*8*'Steel Eurocode 3'!X$8*'Steel Eurocode 3'!E$10)*100*1000*Y206","v":0.61286130998248689},{"$f":"C$14*B206*(8^3-2*8*B206^2+B206^3)/24/('Steel Eurocode 3'!E$10*'Steel Eurocode 3'!X$8)*100*1000","v":4.4474386937723303},null,156.21167923200002,176.37167923200002,1.6461282139382308E-6,6.3776910727490039E-6,1.3574223227420561E-5,2.2201615762933304E-5]
[128,4.0640000000000027,-550.40239430400004,-2.7689280000001304,-21.5141508769496,-21.5141508769496,-7.2094384704403858,-7.6640625,-17.8828125,15.328125,10.21875,{"$f":"'Graph Properties'!C$3*8/2-B207*C$3","v":-2.7689280000001304},30.165749999999978,70.38674999999995,62.293500000000044,41.529000000000025,{"$f":"C$3*8/2*'Graph Properties'!B207-'Graph Properties'!C$3*B207^2/2","v":346.02739430400004},1.3568130307730797,2.4777768149445425,{"$f":"D$17*$E$6/(6*8*'Steel Eurocode 3'!$X$8*'Steel Eurocode 3'!$E$10)*100*1000*X207","v":2.3436636557418074},{"$f":"D$18*E$7/(6*8*'Steel Eurocode 3'!X$8*'Steel Eurocode 3'!E$10)*100*1000*Y207","v":1.7654419089872966},{"$f":"D$14*B207*(8^3-2*8*B207^2+B207^3)/24/('Steel Eurocode 3'!E$10*'Steel Eurocode 3'!X$8)*100*1000","v":13.570455466502873},null,156.39858585600004,176.71858585600003,4.7193158902510213E-6,1.8287446197981818E-5,3.8934938834125591E-5,6.3712706983571013E-5,null,0.47193496722541894,0.86183541389375351,{"$f":"C$17*$E$6/(6*8*'Steel Eurocode 3'!$X$8*'Steel Eurocode 3'!$E$10)*100*1000*AK207","v":0.81518735851888946},{"$f":"C$18*E$7/(6*8*'Steel Eurocode 3'!X$8*'Steel Eurocode 3'!E$10)*100*1000*Y207","v":0.61406675095210306},{"$f":"C$14*B207*(8^3-2*8*B207^2+B207^3)/24/('Steel Eurocode 3'!E$10*'Steel Eurocode 3'!X$8)*100*1000","v":4.4464139798502202},null,156.39858585600004,176.71858585600003,1.6415011792177461E-6,6.3608508514719355E-6,1.3542587420565422E-5,2.2160941559502957E-5]
[129,4.0960000000000027,-550.29163718399991,-4.1533920000001103,-21.507868001517004,-21.507868001517004,-7.2073582580499806,-7.6640625,-17.8828125,15.328125,10.21875,{"$f":"'Graph Properties'!C$3*8/2-B208*C$3","v":-4.1533920000001103},{"$f":"IF(B208>D$4, IF(B208<(D$4+E$4),G$4*B208-C$4/2*(B208-D$4)^2,-(8-B208)*H$4),G$4*B208)","v":29.920499999999979},{"$f":"IF(B208>D$5, IF(B208<(D$5+E$5),G$5*B208-C$5/2*(B208-D$5)^2,-(8-B208)*H$5),G$5*B208)","v":69.814499999999953},62.784000000000042,41.85600000000003,{"$f":"C$3*8/2*'Graph Properties'!B208-'Graph Properties'!C$3*B208^2/2","v":345.91663718399991},1.353120547744141,2.4747554948433543,{"$f":"D$17*$E$6/(6*8*'Steel Eurocode 3'!$X$8*'Steel Eurocode 3'!$E$10)*100*1000*X208","v":2.3460903197398055},{"$f":"D$18*E$7/(6*8*'Steel Eurocode 3'!X$8*'Steel Eurocode 3'!E$10)*100*1000*Y208","v":1.768658106023963},{"$f":"D$14*B208*(8^3-2*8*B208^2+B208^3)/24/('Steel Eurocode 3'!E$10*'Steel Eurocode 3'!X$8)*100*1000","v":13.56524353316574},null,{"$f":"IF(B208<D$6,B208*(8^2-B208^2-E$6^2),8/E$6*(B208-D$6)^3+(8^2-E$6^2)*B208-B208^3)","v":156.56052326400001},{"$f":"IF(B208<D$7,B208*(8^2-B208^2-E$7^2),8/E$7*(B208-D$7)^3+(8^2-E$7^2)*B208-B208^3)","v":177.04052326400003},{"$f":"IF(B208<D$4,B208*D$15/(24*K$2*K$3)*((D$4^2)*(2*K$2-D$4)^2-2*(D$4*B208^2)*(2*K$2-D$4)+K$2*B208^3),D$15/(24*K$2*K$3)*(D$4^2*(K$2-B208))*(4*B208*K$2-2*B208^2-D$4^2))","v":4.7054091924498916E-6},{"$f":"IF(B208<I$4,B208*D$15/(24*K$2*K$3)*((I$4^2)*(2*K$2-I$4)^2-2*(I$4*B208^2)*(2*K$2-I$4)+K$2*B208^3),D$15/(24*K$2*K$3)*(I$4^2*(K$2-B208))*(4*B208*K$2-2*B208^2-I$4^2))","v":1.8236614669891303E-5},{"$f":"IF(B208<D$5,B208*D$16/(24*K$2*K$3)*((D$5^2)*(2*K$2-D$5)^2-2*(D$5*B208^2)*(2*K$2-D$5)+K$2*B208^3),D$16/(24*K$2*K$3)*(D$5^2*(K$2-B208))*(4*B208*K$2-2*B208^2-D$5^2))","v":3.8838550132599438E-5},{"$f":"IF(B208<I$5,B208*D$16/(24*K$2*K$3)*((I$5^2)*(2*K$2-I$5)^2-2*(I$5*B208^2)*(2*K$2-I$5)+K$2*B208^3),D$16/(24*K$2*K$3)*(I$5^2*(K$2-B208))*(4*B208*K$2-2*B208^2-I$5^2))","v":6.3586105081032984E-5},null,0.47065062530230989,0.86078451994551408,{"$f":"C$17*$E$6/(6*8*'Steel Eurocode 3'!$X$8*'Steel Eurocode 3'!$E$10)*100*1000*AK208","v":0.81603141556167136},{"$f":"C$18*E$7/(6*8*'Steel Eurocode 3'!X$8*'Steel Eurocode 3'!E$10)*100*1000*Y208","v":0.61518542818224786},{"$f":"C$14*B208*(8^3-2*8*B208^2+B208^3)/24/('Steel Eurocode 3'!E$10*'Steel Eurocode 3'!X$8)*100*1000","v":4.444706269058238},null,{"$f":"IF(B208<D$6,B208*(8^2-B208^2-E$6^2),8/E$6*(B208-D$6)^3+(8^2-E$6^2)*B208-B208^3)","v":156.56052326400001},{"$f":"IF(B208<D$7,B208*(8^2-B208^2-E$7^2),8/E$7*(B208-D$7)^3+(8^2-E$7^2)*B208-B208^3)","v":177.04052326400003},{"$f":"IF(B208<D$4,B208*C$15/(24*K$2*K$3)*((D$4^2)*(2*K$2-D$4)^2-2*(D$4*B208^2)*(2*K$2-D$4)+K$2*B208^3),C$15/(24*K$2*K$3)*(D$4^2*(K$2-B208))*(4*B208*K$2-2*B208^2-D$4^2))","v":1.6366640669390925E-6},{"$f":"IF(B208<I$4,B208*C$15/(24*K$2*K$3)*((I$4^2)*(2*K$2-I$4)^2-2*(I$4*B208^2)*(2*K$2-I$4)+K$2*B208^3),C$15/(24*K$2*K$3)*(I$4^2*(K$2-B208))*(4*B208*K$2-2*B208^2-I$4^2))","v":6.3431703199621914E-6},{"$f":"IF(B208<D$5,B208*C$16/(24*K$2*K$3)*((D$5^2)*(2*K$2-D$5)^2-2*(D$5*B208^2)*(2*K$2-D$5)+K$2*B208^3),C$16/(24*K$2*K$3)*(D$5^2*(K$2-B208))*(4*B208*K$2-2*B208^2-D$5^2))","v":1.3509060915686761E-5},{"$f":"IF(B208<I$5,B208*C$16/(24*K$2*K$3)*((I$5^2)*(2*K$2-I$5)^2-2*(I$5*B208^2)*(2*K$2-I$5)+K$2*B208^3),C$16/(24*K$2*K$3)*(I$5^2*(K$2-B208))*(4*B208*K$2-2*B208^2-I$5^2))","v":2.2116906115141903E-5}]
[130,{"$f":"B208+8/250","v":4.1280000000000028},-550.13657721599998,-5.5378560000001187,-21.498273699500359,-21.498273699500359,-7.2041682805001512,-7.6640625,-17.8828125,15.328125,10.21875,{"$f":"'Graph Properties'!C$3*8/2-B209*C$3","v":-5.5378560000001187},29.675249999999977,69.242249999999956,63.274500000000046,42.183000000000028,{"$f":"C$3*8/2*'Graph Properties'!B209-'Graph Properties'!C$3*B209^2/2","v":345.76157721599992},1.3492483459261109,2.4713148309009525,{"$f":"D$17*$E$6/(6*8*'Steel Eurocode 3'!$X$8*'Steel Eurocode 3'!$E$10)*100*1000*X209","v":2.3481398689016766},{"$f":"D$18*E$7/(6*8*'Steel Eurocode 3'!X$8*'Steel Eurocode 3'!E$10)*100*1000*Y209","v":1.7716228931698779},{"$f":"D$14*B209*(8^3-2*8*B209^2+B209^3)/24/('Steel Eurocode 3'!E$10*'Steel Eurocode 3'!X$8)*100*1000","v":13.55794776060174},null,156.69729484800001,177.33729484800003,4.6909034320184569E-6,1.8183386891279564E-5,3.8736769867400546E-5,6.3449918176410074E-5,null,0.4693037724960385,0.85958776726989627,{"$f":"C$17*$E$6/(6*8*'Steel Eurocode 3'!$X$8*'Steel Eurocode 3'!$E$10)*100*1000*AK209","v":0.81674430222667016},{"$f":"C$18*E$7/(6*8*'Steel Eurocode 3'!X$8*'Steel Eurocode 3'!E$10)*100*1000*Y209","v":0.61621665849387042},{"$f":"C$14*B209*(8^3-2*8*B209^2+B209^3)/24/('Steel Eurocode 3'!E$10*'Steel Eurocode 3'!X$8)*100*1000","v":4.4423157800136757},null,156.69729484800001,177.33729484800003,1.6316185850498978E-6,6.3246563100102829E-6,1.3473659084313232E-5,2.2069536757012194E-5]
[131,4.1600000000000028,{"$f":"-SUM(M210:Q210)","v":-549.93721440000002},{"$f":"H210+I210+J210+K210+L210","v":-6.922320000000127},{"$f":"IF(E$10=2,G210,F210)","v":-21.485368905007647},{"$f":"-SUM(R210:V210)","v":-21.485368905007647},{"$f":"-SUM(AE210:AI210)","v":-7.1998688438551124},{"$f":"IF(B210>D$4, IF(B210<(D$4+E$4),G$4-C$4*(B210-D$4),H$4),G$4)","v":-7.6640625},{"$f":"IF(B210>D$5, IF(B210<(D$5+E$5),G$5-C$5*(B210-D$5),H$5),G$5)","v":-17.8828125},{"$f":"IF(B210>D$6,-H$6,G$6)","v":15.328125},{"$f":"IF(B210>D$7,-H$7,G$7)","v":10.21875},{"$f":"'Graph Properties'!C$3*8/2-B210*C$3","v":-6.922320000000127},29.429999999999978,68.669999999999945,{"$f":"IF(B210<D$6,G$6*B210,G$6*B210-C$6*(B210-D$6))","v":63.765000000000043},{"$f":"IF(B210<D$7,G$7*B210,G$7*B210-C$7*(B210-D$7))","v":42.510000000000026},{"$f":"C$3*8/2*'Graph Properties'!B210-'Graph Properties'!C$3*B210^2/2","v":345.56221440000002},{"$f":"(AA210-Z210)*1000*100","v":1.3451978984238175},{"$f":"(AC210-AB210)*1000*100","v":2.4674582603619379},{"$f":"D$17*$E$6/(6*8*'Steel Eurocode 3'!$X$8*'Steel Eurocode 3'!$E$10)*100*1000*X210","v":2.3498093570177638},{"$f":"D$18*E$7/(6*8*'Steel Eurocode 3'!X$8*'Steel Eurocode 3'!E$10)*100*1000*Y210","v":1.7743343062852699},{"$f":"D$14*B210*(8^3-2*8*B210^2+B210^3)/24/('Steel Eurocode 3'!E$10*'Steel Eurocode 3'!X$8)*100*1000","v":13.548569082918856},null,156.80870400000001,177.60870400000002,4.6758035193061447E-6,1.812778250354432E-5,3.8629642231673745E-5,6.3304224835293127E-5,null,{"$f":"(AN210-AM210)*1000*100","v":0.46789492119089288},{"$f":"(AP210-AO210)*1000*100","v":0.85824635143023886},{"$f":"C$17*$E$6/(6*8*'Steel Eurocode 3'!$X$8*'Steel Eurocode 3'!$E$10)*100*1000*AK210","v":0.81732499374530909},{"$f":"C$18*E$7/(6*8*'Steel Eurocode 3'!X$8*'Steel Eurocode 3'!E$10)*100*1000*Y210","v":0.61715975870791984},{"$f":"C$14*B210*(8^3-2*8*B210^2+B210^3)/24/('Steel Eurocode 3'!E$10*'Steel Eurocode 3'!X$8)*100*1000","v":4.4392428187807518},null,156.80870400000001,177.60870400000002,1.6263664414977893E-6,6.3053156534067185E-6,1.3436397297973476E-5,2.2018860812275866E-5]
[132,4.1920000000000028,-549.69354873600003,-8.3067840000001354,-21.469154819034834,-21.469154819034834,-7.1944603416259962,-7.6640625,-17.8828125,15.328125,10.21875,{"$f":"'Graph Properties'!C$3*8/2-B211*C$3","v":-8.3067840000001354},29.18474999999998,68.097749999999948,64.25550000000004,42.837000000000032,{"$f":"C$3*8/2*'Graph Properties'!B211-'Graph Properties'!C$3*B211^2/2","v":345.31854873600003},1.3409706783420894,2.463189220470908,{"$f":"D$17*$E$6/(6*8*'Steel Eurocode 3'!$X$8*'Steel Eurocode 3'!$E$10)*100*1000*X211","v":2.3510958378784093},{"$f":"D$18*E$7/(6*8*'Steel Eurocode 3'!X$8*'Steel Eurocode 3'!E$10)*100*1000*Y211","v":1.7767903812303676},{"$f":"D$14*B211*(8^3-2*8*B211^2+B211^3)/24/('Steel Eurocode 3'!E$10*'Steel Eurocode 3'!X$8)*100*1000","v":13.537108701113061},null,156.89455411200001,177.85455411200002,4.6601143646623845E-6,1.8069821148083279E-5,3.8517211418563914E-5,6.3149103623272995E-5,null,0.46642458377116153,0.85676146798988084,{"$f":"C$17*$E$6/(6*8*'Steel Eurocode 3'!$X$8*'Steel Eurocode 3'!$E$10)*100*1000*AK211","v":0.81777246534901182},{"$f":"C$18*E$7/(6*8*'Steel Eurocode 3'!X$8*'Steel Eurocode 3'!E$10)*100*1000*Y211","v":0.61801404564534512},{"$f":"C$14*B211*(8^3-2*8*B211^2+B211^3)/24/('Steel Eurocode 3'!E$10*'Steel Eurocode 3'!X$8)*100*1000","v":4.4354877788705966},null,156.89455411200001,177.85455411200002,1.6209093442303943E-6,6.2851551819420094E-6,1.3397290928196143E-5,2.1964905608094952E-5]
[133,4.2240000000000029,-549.405580224,-9.6912480000001153,-21.449632909465919,-21.449632909465919,-7.1879432547708557,-7.6640625,-17.8828125,15.328125,10.21875,{"$f":"'Graph Properties'!C$3*8/2-B212*C$3","v":-9.6912480000001153},28.939499999999978,67.525499999999951,64.746000000000038,43.16400000000003,{"$f":"C$3*8/2*'Graph Properties'!B212-'Graph Properties'!C$3*B212^2/2","v":345.03058022399995},1.3365681587857559,2.458511148472466,{"$f":"D$17*$E$6/(6*8*'Steel Eurocode 3'!$X$8*'Steel Eurocode 3'!$E$10)*100*1000*X212","v":2.3519963652739562},{"$f":"D$18*E$7/(6*8*'Steel Eurocode 3'!X$8*'Steel Eurocode 3'!E$10)*100*1000*Y212","v":1.7789891538653995},{"$f":"D$14*B212*(8^3-2*8*B212^2+B212^3)/24/('Steel Eurocode 3'!E$10*'Steel Eurocode 3'!X$8)*100*1000","v":13.523568083068341},null,156.95464857600001,178.07464857600002,4.6438408784366046E-6,1.8009522466294163E-5,3.8399521621215903E-5,6.2984633105940562E-5,null,0.46489327262113228,0.85513431251216154,{"$f":"C$17*$E$6/(6*8*'Steel Eurocode 3'!$X$8*'Steel Eurocode 3'!$E$10)*100*1000*AK212","v":0.81808569226920202},{"$f":"C$18*E$7/(6*8*'Steel Eurocode 3'!X$8*'Steel Eurocode 3'!E$10)*100*1000*Y212","v":0.61877883612709539},{"$f":"C$14*B212*(8^3-2*8*B212^2+B212^3)/24/('Steel Eurocode 3'!E$10*'Steel Eurocode 3'!X$8)*100*1000","v":4.4310511412412641},null,156.95464857600001,178.07464857600002,1.6152490011953404E-6,6.2641817274066635E-6,1.3356355346509878E-5,2.1907698471631494E-5]
[134,4.2560000000000029,-549.07330886399996,-11.075712000000124,-21.426804911072843,-21.426804911072843,-7.1803181516946593,-7.6640625,-17.8828125,15.328125,10.21875,{"$f":"'Graph Properties'!C$3*8/2-B213*C$3","v":-11.075712000000124},28.694249999999979,66.953249999999954,65.236500000000049,43.491000000000028,{"$f":"C$3*8/2*'Graph Properties'!B213-'Graph Properties'!C$3*B213^2/2","v":344.69830886399996},1.3319918128596442,2.4534274816112078,{"$f":"D$17*$E$6/(6*8*'Steel Eurocode 3'!$X$8*'Steel Eurocode 3'!$E$10)*100*1000*X213","v":2.3525079929947466},{"$f":"D$18*E$7/(6*8*'Steel Eurocode 3'!X$8*'Steel Eurocode 3'!E$10)*100*1000*Y213","v":1.7809286600505938},{"$f":"D$14*B213*(8^3-2*8*B213^2+B213^3)/24/('Steel Eurocode 3'!E$10*'Steel Eurocode 3'!X$8)*100*1000","v":13.50794896355665},null,156.988790784,178.268790784,4.6269879709782325E-6,1.7946906099574675E-5,3.8276617032774576E-5,6.2810891848886656E-5,null,0.46330150012509358,0.85336608056041963,{"$f":"C$17*$E$6/(6*8*'Steel Eurocode 3'!$X$8*'Steel Eurocode 3'!$E$10)*100*1000*AK213","v":0.81826364973730303},{"$f":"C$18*E$7/(6*8*'Steel Eurocode 3'!X$8*'Steel Eurocode 3'!E$10)*100*1000*Y213","v":0.61945344697411941},{"$f":"C$14*B213*(8^3-2*8*B213^2+B213^3)/24/('Steel Eurocode 3'!E$10*'Steel Eurocode 3'!X$8)*100*1000","v":4.4259334742977234},null,156.988790784,178.268790784,1.6093871203402545E-6,6.242402121591191E-6,1.331360592444333E-5,2.1847266730047526E-5]
[135,4.2880000000000029,-548.69673465599999,-12.460176000000132,-21.400672825515592,-21.400672825515592,-7.1715856882492979,-7.6640625,-17.8828125,15.328125,10.21875,{"$f":"'Graph Properties'!C$3*8/2-B214*C$3","v":-12.460176000000132},28.448999999999977,66.380999999999943,65.727000000000046,43.818000000000033,{"$f":"C$3*8/2*'Graph Properties'!B214-'Graph Properties'!C$3*B214^2/2","v":344.32173465599999},1.3272431136685843,2.4479416571317367,{"$f":"D$17*$E$6/(6*8*'Steel Eurocode 3'!$X$8*'Steel Eurocode 3'!$E$10)*100*1000*X214","v":2.3526277748311233},{"$f":"D$18*E$7/(6*8*'Steel Eurocode 3'!X$8*'Steel Eurocode 3'!E$10)*100*1000*Y214","v":1.7826069356461793},{"$f":"D$14*B214*(8^3-2*8*B214^2+B214^3)/24/('Steel Eurocode 3'!E$10*'Steel Eurocode 3'!X$8)*100*1000","v":13.490253344237969},null,156.99678412799997,178.436784128,4.6095605526366977E-6,1.7881991689322539E-5,3.8148541846384779E-5,6.2627958417702144E-5,null,0.46164977866733364,0.85145796769799542,{"$f":"C$17*$E$6/(6*8*'Steel Eurocode 3'!$X$8*'Steel Eurocode 3'!$E$10)*100*1000*AK214","v":0.81830531298473852},{"$f":"C$18*E$7/(6*8*'Steel Eurocode 3'!X$8*'Steel Eurocode 3'!E$10)*100*1000*Y214","v":0.62003719500736665},{"$f":"C$14*B214*(8^3-2*8*B214^2+B214^3)/24/('Steel Eurocode 3'!E$10*'Steel Eurocode 3'!X$8)*100*1000","v":4.420135433891863},null,156.99678412799997,178.436784128,1.6033254096127643E-6,6.2198231962861006E-6,1.3269058033525137E-5,2.1783637710505091E-5]
[136,4.3200000000000029,-548.27585759999999,-13.84464000000014,-21.371238921342119,-21.371238921342119,-7.1617466077335772,-7.6640625,-17.8828125,15.328125,10.21875,{"$f":"'Graph Properties'!C$3*8/2-B215*C$3","v":-13.84464000000014},28.203749999999978,65.808749999999947,66.217500000000044,44.145000000000032,{"$f":"C$3*8/2*'Graph Properties'!B215-'Graph Properties'!C$3*B215^2/2","v":343.90085759999999},1.3223235343174045,2.4420571122786523,{"$f":"D$17*$E$6/(6*8*'Steel Eurocode 3'!$X$8*'Steel Eurocode 3'!$E$10)*100*1000*X215","v":2.3523527645734306},{"$f":"D$18*E$7/(6*8*'Steel Eurocode 3'!X$8*'Steel Eurocode 3'!E$10)*100*1000*Y215","v":1.7840220165123848},{"$f":"D$14*B215*(8^3-2*8*B215^2+B215^3)/24/('Steel Eurocode 3'!E$10*'Steel Eurocode 3'!X$8)*100*1000","v":13.470483493660245},null,156.978432,178.57843200000002,4.5915635337614309E-6,1.7814798876935476E-5,3.8015340255191387E-5,6.2435911377977909E-5,null,0.45993862063214058,0.84941116948822704,{"$f":"C$17*$E$6/(6*8*'Steel Eurocode 3'!$X$8*'Steel Eurocode 3'!$E$10)*100*1000*AK215","v":0.81820965724293226},{"$f":"C$18*E$7/(6*8*'Steel Eurocode 3'!X$8*'Steel Eurocode 3'!E$10)*100*1000*Y215","v":0.62052939704778587},{"$f":"C$14*B215*(8^3-2*8*B215^2+B215^3)/24/('Steel Eurocode 3'!E$10*'Steel Eurocode 3'!X$8)*100*1000","v":4.4136577633224912},null,156.978432,178.57843200000002,1.5970655769604974E-6,6.1964517832819027E-6,1.3222727045283959E-5,2.1716838740166228E-5]
[137,4.352000000000003,-547.81067769599986,-15.22910400000012,-21.338505733988374,-21.338505733988374,-7.1508017408932245,-7.6640625,-17.8828125,15.328125,10.21875,{"$f":"'Graph Properties'!C$3*8/2-B216*C$3","v":-15.22910400000012},27.958499999999976,65.23649999999995,66.708000000000041,44.47200000000003,{"$f":"C$3*8/2*'Graph Properties'!B216-'Graph Properties'!C$3*B216^2/2","v":343.43567769599991},1.3172345479109326,2.435777284296555,{"$f":"D$17*$E$6/(6*8*'Steel Eurocode 3'!$X$8*'Steel Eurocode 3'!$E$10)*100*1000*X216","v":2.351680016012009},{"$f":"D$18*E$7/(6*8*'Steel Eurocode 3'!X$8*'Steel Eurocode 3'!E$10)*100*1000*Y216","v":1.785171938509438},{"$f":"D$14*B216*(8^3-2*8*B216^2+B216^3)/24/('Steel Eurocode 3'!E$10*'Steel Eurocode 3'!X$8)*100*1000","v":13.448641947259439},null,156.93353779199998,178.693537792,4.5730018247018582E-6,1.7745347303811185E-5,3.787705645233924E-5,6.2234829295304791E-5,null,0.45816853840380267,0.84722688149445402,{"$f":"C$17*$E$6/(6*8*'Steel Eurocode 3'!$X$8*'Steel Eurocode 3'!$E$10)*100*1000*AK216","v":0.81797565774330749},{"$f":"C$18*E$7/(6*8*'Steel Eurocode 3'!X$8*'Steel Eurocode 3'!E$10)*100*1000*Y216","v":0.62092936991632608},{"$f":"C$14*B216*(8^3-2*8*B216^2+B216^3)/24/('Steel Eurocode 3'!E$10*'Steel Eurocode 3'!X$8)*100*1000","v":4.4065012933353342},null,156.93353779199998,178.693537792,1.5906093303310809E-6,6.1722947143691076E-6,1.317462833124843E-5,2.164689714619297E-5]
[138,4.384000000000003,-547.30119494399992,-16.613568000000129,-21.302476065778322,-21.302476065778322,-7.1387520059208853,-7.6640625,-17.8828125,15.328125,10.21875,{"$f":"'Graph Properties'!C$3*8/2-B217*C$3","v":-16.613568000000129},27.713249999999977,64.664249999999953,67.198500000000053,44.799000000000028,{"$f":"C$3*8/2*'Graph Properties'!B217-'Graph Properties'!C$3*B217^2/2","v":342.92619494399992},1.3119776275539985,2.429105610430045,{"$f":"D$17*$E$6/(6*8*'Steel Eurocode 3'!$X$8*'Steel Eurocode 3'!$E$10)*100*1000*X217","v":2.3506065829372034},{"$f":"D$18*E$7/(6*8*'Steel Eurocode 3'!X$8*'Steel Eurocode 3'!E$10)*100*1000*Y217","v":1.7860547374975679},{"$f":"D$14*B217*(8^3-2*8*B217^2+B217^3)/24/('Steel Eurocode 3'!E$10*'Steel Eurocode 3'!X$8)*100*1000","v":13.424731507359505},null,156.861904896,178.78190489600001,4.5538803358074105E-6,1.7673656611347395E-5,3.7733734630973227E-5,6.2024790735273674E-5,null,0.45634004436660819,0.84490629928001526,{"$f":"C$17*$E$6/(6*8*'Steel Eurocode 3'!$X$8*'Steel Eurocode 3'!$E$10)*100*1000*AK217","v":0.81760228971728799},{"$f":"C$18*E$7/(6*8*'Steel Eurocode 3'!X$8*'Steel Eurocode 3'!E$10)*100*1000*Y217","v":0.62123643043393662},{"$f":"C$14*B217*(8^3-2*8*B217^2+B217^3)/24/('Steel Eurocode 3'!E$10*'Steel Eurocode 3'!X$8)*100*1000","v":4.3986669421230369},null,156.861904896,178.78190489600001,1.5839583776721423E-6,6.1473588213382239E-6,1.3124777262947208E-5,2.1573840255747361E-5]
[139,4.416000000000003,-546.74740934399995,-17.998032000000137,-21.263152985923895,-21.263152985923895,-7.1255984084561188,-7.6640625,-17.8828125,15.328125,10.21875,{"$f":"'Graph Properties'!C$3*8/2-B218*C$3","v":-17.998032000000137},27.467999999999975,64.091999999999942,67.68900000000005,45.126000000000033,{"$f":"C$3*8/2*'Graph Properties'!B218-'Graph Properties'!C$3*B218^2/2","v":342.37240934399995},1.3065542463514297,2.4220455279237205,{"$f":"D$17*$E$6/(6*8*'Steel Eurocode 3'!$X$8*'Steel Eurocode 3'!$E$10)*100*1000*X218","v":2.3491295191393546},{"$f":"D$18*E$7/(6*8*'Steel Eurocode 3'!X$8*'Steel Eurocode 3'!E$10)*100*1000*Y218","v":1.7866684493370029},{"$f":"D$14*B218*(8^3-2*8*B218^2+B218^3)/24/('Steel Eurocode 3'!E$10*'Steel Eurocode 3'!X$8)*100*1000","v":13.398755243172387},null,156.76333670399998,178.843336704,4.5342039774275137E-6,1.7599746440941811E-5,3.7585418984238167E-5,6.1805874263475371E-5,null,0.45445365090484513,0.84245061840825042,{"$f":"C$17*$E$6/(6*8*'Steel Eurocode 3'!$X$8*'Steel Eurocode 3'!$E$10)*100*1000*AK218","v":0.8170885283962972},{"$f":"C$18*E$7/(6*8*'Steel Eurocode 3'!X$8*'Steel Eurocode 3'!E$10)*100*1000*Y218","v":0.62144989542156615},{"$f":"C$14*B218*(8^3-2*8*B218^2+B218^3)/24/('Steel Eurocode 3'!E$10*'Steel Eurocode 3'!X$8)*100*1000","v":4.39015571532516},null,156.76333670399998,178.843336704,1.5771144269313088E-6,6.1216509359797594E-6,1.3073189211908924E-5,2.1497695395991429E-5]
[140,4.4480000000000031,-546.14932089600006,-19.382496000000145,-21.220539830525041,-21.220539830525041,-7.1113420415854103,-7.6640625,-17.8828125,15.328125,10.21875,{"$f":"'Graph Properties'!C$3*8/2-B219*C$3","v":-19.382496000000145},27.222749999999976,63.519749999999945,68.179500000000047,45.453000000000031,{"$f":"C$3*8/2*'Graph Properties'!B219-'Graph Properties'!C$3*B219^2/2","v":341.77432089600001},1.3009658774080557,2.4146004740221834,{"$f":"D$17*$E$6/(6*8*'Steel Eurocode 3'!$X$8*'Steel Eurocode 3'!$E$10)*100*1000*X219","v":2.3472458784088066},{"$f":"D$18*E$7/(6*8*'Steel Eurocode 3'!X$8*'Steel Eurocode 3'!E$10)*100*1000*Y219","v":1.787011109887972},{"$f":"D$14*B219*(8^3-2*8*B219^2+B219^3)/24/('Steel Eurocode 3'!E$10*'Steel Eurocode 3'!X$8)*100*1000","v":13.370716490798024},null,156.63763660799998,178.87763660800002,4.5139776599115987E-6,1.7523636433992155E-5,3.7432153705278943E-5,6.1578158445500778E-5,null,0.45250987040280188,0.8398610344424986,{"$f":"C$17*$E$6/(6*8*'Steel Eurocode 3'!$X$8*'Steel Eurocode 3'!$E$10)*100*1000*AK219","v":0.81643334901175879},{"$f":"C$18*E$7/(6*8*'Steel Eurocode 3'!X$8*'Steel Eurocode 3'!E$10)*100*1000*Y219","v":0.62156908170016401},{"$f":"C$14*B219*(8^3-2*8*B219^2+B219^3)/24/('Steel Eurocode 3'!E$10*'Steel Eurocode 3'!X$8)*100*1000","v":4.3809687060281872},null,156.63763660799998,178.87763660800002,1.5700791860562082E-6,6.095177890084227E-6,1.3019879549662239E-5,2.1418489894087225E-5]
[141,4.4800000000000031,-545.50692959999992,-20.766960000000125,-21.174640202569702,-21.174640202569702,-7.0959840858421579,-7.6640625,-17.8828125,15.328125,10.21875,{"$f":"'Graph Properties'!C$3*8/2-B220*C$3","v":-20.766960000000125},26.977499999999978,62.947499999999948,68.670000000000044,45.78000000000003,{"$f":"C$3*8/2*'Graph Properties'!B220-'Graph Properties'!C$3*B220^2/2","v":341.13192959999986},1.2952139938287046,2.4067738859700336,{"$f":"D$17*$E$6/(6*8*'Steel Eurocode 3'!$X$8*'Steel Eurocode 3'!$E$10)*100*1000*X220","v":2.3449527145359021},{"$f":"D$18*E$7/(6*8*'Steel Eurocode 3'!X$8*'Steel Eurocode 3'!E$10)*100*1000*Y220","v":1.7870807550107026},{"$f":"D$14*B220*(8^3-2*8*B220^2+B220^3)/24/('Steel Eurocode 3'!E$10*'Steel Eurocode 3'!X$8)*100*1000","v":13.340618853224358},null,156.48460799999998,178.88460799999999,4.4932062936090941E-6,1.744534623189614E-5,3.7273982987240414E-5,6.1341721846940749E-5,null,0.45050921524476667,0.83713874294609802,{"$f":"C$17*$E$6/(6*8*'Steel Eurocode 3'!$X$8*'Steel Eurocode 3'!$E$10)*100*1000*AK220","v":0.81563572679509633},{"$f":"C$18*E$7/(6*8*'Steel Eurocode 3'!X$8*'Steel Eurocode 3'!E$10)*100*1000*Y220","v":0.62159330609067909},{"$f":"C$14*B220*(8^3-2*8*B220^2+B220^3)/24/('Steel Eurocode 3'!E$10*'Steel Eurocode 3'!X$8)*100*1000","v":4.3711070947655175},null,156.48460799999998,178.88460799999999,1.5628543629944672E-6,6.0679465154421345E-6,1.2964863647735797E-5,2.1336251077196777E-5]
[142,4.5120000000000031,-544.82023545599986,-22.151424000000134,-21.125457971933802,-21.125457971933802,-7.0795258092066815,-7.6640625,-17.8828125,15.328125,10.21875,{"$f":"'Graph Properties'!C$3*8/2-B221*C$3","v":-22.151424000000134},26.732249999999976,62.375249999999944,69.160500000000042,46.107000000000035,{"$f":"C$3*8/2*'Graph Properties'!B221-'Graph Properties'!C$3*B221^2/2","v":340.44523545599992},1.2893000687182048,2.3985692010118704,{"$f":"D$17*$E$6/(6*8*'Steel Eurocode 3'!$X$8*'Steel Eurocode 3'!$E$10)*100*1000*X221","v":2.3422470813109837},{"$f":"D$18*E$7/(6*8*'Steel Eurocode 3'!X$8*'Steel Eurocode 3'!E$10)*100*1000*Y221","v":1.7868754205654243},{"$f":"D$14*B221*(8^3-2*8*B221^2+B221^3)/24/('Steel Eurocode 3'!E$10*'Steel Eurocode 3'!X$8)*100*1000","v":13.308466200327318},null,156.304054272,178.864054272,4.4718947888694281E-6,1.7364895476051476E-5,3.7110951023267436E-5,6.109664303338614E-5,null,0.44845219781502771,0.83428493948238946,{"$f":"C$17*$E$6/(6*8*'Steel Eurocode 3'!$X$8*'Steel Eurocode 3'!$E$10)*100*1000*AK221","v":0.81469463697773337},{"$f":"C$18*E$7/(6*8*'Steel Eurocode 3'!X$8*'Steel Eurocode 3'!E$10)*100*1000*Y221","v":0.6215218854140605},{"$f":"C$14*B221*(8^3-2*8*B221^2+B221^3)/24/('Steel Eurocode 3'!E$10*'Steel Eurocode 3'!X$8)*100*1000","v":4.3605721495174707},null,156.304054272,178.864054272,1.5554416656937141E-6,6.0399636438439914E-6,1.2908156877658239E-5,2.1251006272482134E-5]
[143,4.5440000000000031,-544.08923846399989,-23.535888000000142,-21.072997275381269,-21.072997275381269,-7.0619685671062156,-7.6640625,-17.8828125,15.328125,10.21875,{"$f":"'Graph Properties'!C$3*8/2-B222*C$3","v":-23.535888000000142},26.486999999999977,61.80299999999994,69.651000000000053,46.434000000000033,{"$f":"C$3*8/2*'Graph Properties'!B222-'Graph Properties'!C$3*B222^2/2","v":339.71423846399989},1.2832255751813852,2.389989856392293,{"$f":"D$17*$E$6/(6*8*'Steel Eurocode 3'!$X$8*'Steel Eurocode 3'!$E$10)*100*1000*X222","v":2.3391260325243932},{"$f":"D$18*E$7/(6*8*'Steel Eurocode 3'!X$8*'Steel Eurocode 3'!E$10)*100*1000*Y222","v":1.7863931424123649},{"$f":"D$14*B222*(8^3-2*8*B222^2+B222^3)/24/('Steel Eurocode 3'!E$10*'Steel Eurocode 3'!X$8)*100*1000","v":13.274262668870833},null,156.09577881599998,178.81577881599998,4.4500480560420294E-6,1.7282303807855882E-5,3.6943102006504862E-5,6.0843000570427793E-5,null,0.44633933049787317,0.83130081961471058,{"$f":"C$17*$E$6/(6*8*'Steel Eurocode 3'!$X$8*'Steel Eurocode 3'!$E$10)*100*1000*AK222","v":0.81360905479109324},{"$f":"C$18*E$7/(6*8*'Steel Eurocode 3'!X$8*'Steel Eurocode 3'!E$10)*100*1000*Y222","v":0.62135413649125726},{"$f":"C$14*B222*(8^3-2*8*B222^2+B222^3)/24/('Steel Eurocode 3'!E$10*'Steel Eurocode 3'!X$8)*100*1000","v":4.3493652257112814},null,156.09577881599998,178.81577881599998,1.5478428021015754E-6,6.0112361070803071E-6,1.2849774610958213E-5,2.1162782807105319E-5]
[144,4.5760000000000032,-543.313938624,-24.92035200000015,-21.017262516564035,-21.017262516564035,-7.0433138024149216,-7.6640625,-17.8828125,15.328125,10.21875,{"$f":"'Graph Properties'!C$3*8/2-B223*C$3","v":-24.92035200000015},26.241749999999975,61.230749999999944,70.14150000000005,46.761000000000031,{"$f":"C$3*8/2*'Graph Properties'!B223-'Graph Properties'!C$3*B223^2/2","v":338.93893862399995},1.2769919863230752,2.3810392893559054,{"$f":"D$17*$E$6/(6*8*'Steel Eurocode 3'!$X$8*'Steel Eurocode 3'!$E$10)*100*1000*X223","v":2.3355866219664749},{"$f":"D$18*E$7/(6*8*'Steel Eurocode 3'!X$8*'Steel Eurocode 3'!E$10)*100*1000*Y223","v":1.7856319564117533},{"$f":"D$14*B223*(8^3-2*8*B223^2+B223^3)/24/('Steel Eurocode 3'!E$10*'Steel Eurocode 3'!X$8)*100*1000","v":13.238012662506826},null,155.85958502399998,178.73958502399998,4.4276710054763279E-6,1.7197590868707079E-5,3.6770480130097554E-5,6.0580873023656608E-5,null,0.44417112567759132,0.82818757890640204,{"$f":"C$17*$E$6/(6*8*'Steel Eurocode 3'!$X$8*'Steel Eurocode 3'!$E$10)*100*1000*AK223","v":0.81237795546659997},{"$f":"C$18*E$7/(6*8*'Steel Eurocode 3'!X$8*'Steel Eurocode 3'!E$10)*100*1000*Y223","v":0.62108937614321846},{"$f":"C$14*B223*(8^3-2*8*B223^2+B223^3)/24/('Steel Eurocode 3'!E$10*'Steel Eurocode 3'!X$8)*100*1000","v":4.33748776622111},null,155.85958502399998,178.73958502399998,1.5400594801656791E-6,5.9817707369415921E-6,1.2789732219164366E-5,2.1071608008228385E-5]
[145,4.6080000000000032,-542.49433593599986,-26.30481600000013,-20.958258366022005,-20.958258366022005,-7.0235630454538649,-7.6640625,-17.8828125,15.328125,10.21875,{"$f":"'Graph Properties'!C$3*8/2-B224*C$3","v":-26.30481600000013},25.996499999999976,60.65849999999994,70.632000000000048,47.088000000000029,{"$f":"C$3*8/2*'Graph Properties'!B224-'Graph Properties'!C$3*B224^2/2","v":338.11933593599986},1.2706007752481021,2.3717209371473045,{"$f":"D$17*$E$6/(6*8*'Steel Eurocode 3'!$X$8*'Steel Eurocode 3'!$E$10)*100*1000*X224","v":2.3316259034275704},{"$f":"D$18*E$7/(6*8*'Steel Eurocode 3'!X$8*'Steel Eurocode 3'!E$10)*100*1000*Y224","v":1.7845898984238178},{"$f":"D$14*B224*(8^3-2*8*B224^2+B224^3)/24/('Steel Eurocode 3'!E$10*'Steel Eurocode 3'!X$8)*100*1000","v":13.19972085177521},null,155.59527628799995,178.63527628799997,4.4047685475217495E-6,1.711077630000277E-5,3.6593129587190371E-5,6.0310338958663414E-5,null,0.44194809573847027,0.82494641292080118,{"$f":"C$17*$E$6/(6*8*'Steel Eurocode 3'!$X$8*'Steel Eurocode 3'!$E$10)*100*1000*AK224","v":0.81100031423567653},{"$f":"C$18*E$7/(6*8*'Steel Eurocode 3'!X$8*'Steel Eurocode 3'!E$10)*100*1000*Y224","v":0.62072692119089301},{"$f":"C$14*B224*(8^3-2*8*B224^2+B224^3)/24/('Steel Eurocode 3'!E$10*'Steel Eurocode 3'!X$8)*100*1000","v":4.3249413013680238},null,155.59527628799995,178.63527628799997,1.5320934078336522E-6,5.9515743652183549E-6,1.2728045073805346E-5,2.0977509203013358E-5]
[146,4.6400000000000032,-541.63043039999991,-27.689280000000139,-20.895989761183106,-20.895989761183106,-7.0027179139910469,-7.6640625,-17.8828125,15.328125,10.21875,{"$f":"'Graph Properties'!C$3*8/2-B225*C$3","v":-27.689280000000139},25.751249999999974,60.086249999999943,71.122500000000045,47.415000000000035,{"$f":"C$3*8/2*'Graph Properties'!B225-'Graph Properties'!C$3*B225^2/2","v":337.25543039999991},1.2640534150612956,2.3620382370110917,{"$f":"D$17*$E$6/(6*8*'Steel Eurocode 3'!$X$8*'Steel Eurocode 3'!$E$10)*100*1000*X225","v":2.3272409306980233},{"$f":"D$18*E$7/(6*8*'Steel Eurocode 3'!X$8*'Steel Eurocode 3'!E$10)*100*1000*Y225","v":1.7832650043087872},{"$f":"D$14*B225*(8^3-2*8*B225^2+B225^3)/24/('Steel Eurocode 3'!E$10*'Steel Eurocode 3'!X$8)*100*1000","v":13.159392174103907},null,155.30265599999996,178.50265599999997,4.381345592527727E-6,1.7021879743140683E-5,3.6411094570928177E-5,6.0031476941039094E-5,null,0.43967075306479836,0.82157851722124919,{"$f":"C$17*$E$6/(6*8*'Steel Eurocode 3'!$X$8*'Steel Eurocode 3'!$E$10)*100*1000*AK225","v":0.80947510632974717},{"$f":"C$18*E$7/(6*8*'Steel Eurocode 3'!X$8*'Steel Eurocode 3'!E$10)*100*1000*Y225","v":0.62026608845523024},{"$f":"C$14*B225*(8^3-2*8*B225^2+B225^3)/24/('Steel Eurocode 3'!E$10*'Steel Eurocode 3'!X$8)*100*1000","v":4.3117274489200224},null,155.30265599999996,178.50265599999997,1.5239462930531223E-6,5.9206538237011059E-6,1.26647285464098E-5,2.0880513718622292E-5]
[147,4.6720000000000033,-540.72222201599993,-29.073744000000147,-20.83046190636324,-20.83046190636324,-6.9807801132413738,-7.6640625,-17.8828125,15.328125,10.21875,{"$f":"'Graph Properties'!C$3*8/2-B226*C$3","v":-29.073744000000147},25.505999999999975,59.513999999999939,71.613000000000056,47.742000000000033,{"$f":"C$3*8/2*'Graph Properties'!B226-'Graph Properties'!C$3*B226^2/2","v":336.34722201599993},1.2573513788674833,2.3519946261918658,{"$f":"D$17*$E$6/(6*8*'Steel Eurocode 3'!$X$8*'Steel Eurocode 3'!$E$10)*100*1000*X226","v":2.3224287575681757},{"$f":"D$18*E$7/(6*8*'Steel Eurocode 3'!X$8*'Steel Eurocode 3'!E$10)*100*1000*Y226","v":1.7816553099268897},{"$f":"D$14*B226*(8^3-2*8*B226^2+B226^3)/24/('Steel Eurocode 3'!E$10*'Steel Eurocode 3'!X$8)*100*1000","v":13.117031833808824},null,154.98152755199996,178.34152755199997,4.3574070508436863E-6,1.693092083951852E-5,3.6224419274455823E-5,5.974436553637448E-5,null,0.43733961004086369,0.81808508737108332,{"$f":"C$17*$E$6/(6*8*'Steel Eurocode 3'!$X$8*'Steel Eurocode 3'!$E$10)*100*1000*AK226","v":0.807801306980235},{"$f":"C$18*E$7/(6*8*'Steel Eurocode 3'!X$8*'Steel Eurocode 3'!E$10)*100*1000*Y226","v":0.61970619475717892},{"$f":"C$14*B226*(8^3-2*8*B226^2+B226^3)/24/('Steel Eurocode 3'!E$10*'Steel Eurocode 3'!X$8)*100*1000","v":4.2978479140920127},null,154.98152755199996,178.34152755199997,1.5156198437717167E-6,5.8890159441803537E-6,1.2599798008506373E-5,2.0780648882217205E-5]
[148,4.7040000000000033,-539.76971078399981,-30.458208000000127,-20.761680272766299,-20.761680272766299,-6.9577514358666743,-7.6640625,-17.8828125,15.328125,10.21875,{"$f":"'Graph Properties'!C$3*8/2-B227*C$3","v":-30.458208000000127},25.260749999999973,58.941749999999942,72.103500000000054,48.069000000000031,{"$f":"C$3*8/2*'Graph Properties'!B227-'Graph Properties'!C$3*B227^2/2","v":335.39471078399981},1.2504961397714944,2.3415935419342278,{"$f":"D$17*$E$6/(6*8*'Steel Eurocode 3'!$X$8*'Steel Eurocode 3'!$E$10)*100*1000*X227","v":2.3171864378283709},{"$f":"D$18*E$7/(6*8*'Steel Eurocode 3'!X$8*'Steel Eurocode 3'!E$10)*100*1000*Y227","v":1.7797588511383537},{"$f":"D$14*B227*(8^3-2*8*B227^2+B227^3)/24/('Steel Eurocode 3'!E$10*'Steel Eurocode 3'!X$8)*100*1000","v":13.072645302093854},null,154.63169433599995,178.15169433599996,4.3329578328190565E-6,1.6837919230534002E-5,3.6033147890918166E-5,5.9449083310260444E-5,null,0.4349551790509546,0.81446731893364399,{"$f":"C$17*$E$6/(6*8*'Steel Eurocode 3'!$X$8*'Steel Eurocode 3'!$E$10)*100*1000*AK227","v":0.80597789141856369},{"$f":"C$18*E$7/(6*8*'Steel Eurocode 3'!X$8*'Steel Eurocode 3'!E$10)*100*1000*Y227","v":0.61904655691768806},{"$f":"C$14*B227*(8^3-2*8*B227^2+B227^3)/24/('Steel Eurocode 3'!E$10*'Steel Eurocode 3'!X$8)*100*1000","v":4.2833044895458245},null,154.63169433599995,178.15169433599996,1.5071157679370629E-6,5.8566675584466087E-6,1.253326883162371E-5,2.0677942020960151E-5]
[149,4.7360000000000033,-538.77289670399978,-31.842672000000135,-20.68965059848421,-20.68965059848421,-6.9336337619757016,-7.6640625,-17.8828125,15.328125,10.21875,{"$f":"'Graph Properties'!C$3*8/2-B228*C$3","v":-31.842672000000135},25.015499999999975,58.369499999999938,72.594000000000051,48.396000000000036,{"$f":"C$3*8/2*'Graph Properties'!B228-'Graph Properties'!C$3*B228^2/2","v":334.39789670399983},1.2434891708781581,2.3308384214827784,{"$f":"D$17*$E$6/(6*8*'Steel Eurocode 3'!$X$8*'Steel Eurocode 3'!$E$10)*100*1000*X228","v":2.3115110252689512},{"$f":"D$18*E$7/(6*8*'Steel Eurocode 3'!X$8*'Steel Eurocode 3'!E$10)*100*1000*Y228","v":1.7775736638034079},{"$f":"D$14*B228*(8^3-2*8*B228^2+B228^3)/24/('Steel Eurocode 3'!E$10*'Steel Eurocode 3'!X$8)*100*1000","v":13.026238317050913},null,154.25295974399995,177.93295974399996,4.308002848803267E-6,1.6742894557584847E-5,3.583732461346007E-5,5.9145708828287851E-5,null,0.43251797247935925,0.81072640747227054,{"$f":"C$17*$E$6/(6*8*'Steel Eurocode 3'!$X$8*'Steel Eurocode 3'!$E$10)*100*1000*AK228","v":0.8040038348761569},{"$f":"C$18*E$7/(6*8*'Steel Eurocode 3'!X$8*'Steel Eurocode 3'!E$10)*100*1000*Y228","v":0.618286491757707},{"$f":"C$14*B228*(8^3-2*8*B228^2+B228^3)/24/('Steel Eurocode 3'!E$10*'Steel Eurocode 3'!X$8)*100*1000","v":4.2680990553902083},null,154.25295974399995,177.93295974399996,1.4984357734967882E-6,5.8236154982903804E-6,1.2465156387290459E-5,2.0572420462013163E-5]
[150,4.7680000000000033,-537.73177977599994,-33.227136000000144,-20.614378888496848,-20.614378888496848,-6.908429059124118,-7.6640625,-17.8828125,15.328125,10.21875,{"$f":"'Graph Properties'!C$3*8/2-B229*C$3","v":-33.227136000000144},24.770249999999976,57.797249999999941,73.084500000000048,48.723000000000035,{"$f":"C$3*8/2*'Graph Properties'!B229-'Graph Properties'!C$3*B229^2/2","v":333.35677977599988},1.2363319452923018,2.3197327020821166,{"$f":"D$17*$E$6/(6*8*'Steel Eurocode 3'!$X$8*'Steel Eurocode 3'!$E$10)*100*1000*X229","v":2.3053995736802602},{"$f":"D$18*E$7/(6*8*'Steel Eurocode 3'!X$8*'Steel Eurocode 3'!E$10)*100*1000*Y229","v":1.7750977837822814},{"$f":"D$14*B229*(8^3-2*8*B229^2+B229^3)/24/('Steel Eurocode 3'!E$10*'Steel Eurocode 3'!X$8)*100*1000","v":12.977816883659887},null,153.84512716799998,177.68512716800001,4.2825470091457462E-6,1.6645866462068765E-5,3.5636993635226401E-5,5.8834320656047565E-5,null,0.43002850271036586,0.80686354855030118,{"$f":"C$17*$E$6/(6*8*'Steel Eurocode 3'!$X$8*'Steel Eurocode 3'!$E$10)*100*1000*AK229","v":0.80187811258443831},{"$f":"C$18*E$7/(6*8*'Steel Eurocode 3'!X$8*'Steel Eurocode 3'!E$10)*100*1000*Y229","v":0.61742531609818474},{"$f":"C$14*B229*(8^3-2*8*B229^2+B229^3)/24/('Steel Eurocode 3'!E$10*'Steel Eurocode 3'!X$8)*100*1000","v":4.2522335791808281},null,153.84512716799998,177.68512716800001,1.4895815683985203E-6,5.789866595502179E-6,1.2395476047035268E-5,2.046411153253828E-5]
[151,4.8000000000000034,-536.64635999999996,-34.611600000000152,-20.535871414672105,-20.535871414672105,-6.8821393823145094,-7.6640625,-17.8828125,15.328125,10.21875,{"$f":"'Graph Properties'!C$3*8/2-B230*C$3","v":-34.611600000000152},24.524999999999974,57.224999999999937,73.575000000000045,49.050000000000033,{"$f":"C$3*8/2*'Graph Properties'!B230-'Graph Properties'!C$3*B230^2/2","v":332.2713599999999},1.2290259361187548,2.3082798209768418,{"$f":"D$17*$E$6/(6*8*'Steel Eurocode 3'!$X$8*'Steel Eurocode 3'!$E$10)*100*1000*X230","v":2.2988491368526387},{"$f":"D$18*E$7/(6*8*'Steel Eurocode 3'!X$8*'Steel Eurocode 3'!E$10)*100*1000*Y230","v":1.7723292469352012},{"$f":"D$14*B230*(8^3-2*8*B230^2+B230^3)/24/('Steel Eurocode 3'!E$10*'Steel Eurocode 3'!X$8)*100*1000","v":12.927387273788669},null,153.40799999999993,177.40799999999996,4.2565952241959218E-6,1.654685458538347E-5,3.5432199149362002E-5,5.8514997359130419E-5,null,0.42748728212826259,0.80287993773107558,{"$f":"C$17*$E$6/(6*8*'Steel Eurocode 3'!$X$8*'Steel Eurocode 3'!$E$10)*100*1000*AK230","v":0.79959969977483081},{"$f":"C$18*E$7/(6*8*'Steel Eurocode 3'!X$8*'Steel Eurocode 3'!E$10)*100*1000*Y230","v":0.61646234676006983},{"$f":"C$14*B230*(8^3-2*8*B230^2+B230^3)/24/('Steel Eurocode 3'!E$10*'Steel Eurocode 3'!X$8)*100*1000","v":4.2357101159202708},null,153.40799999999993,177.40799999999996,1.4805548605898858E-6,5.7554276818725116E-6,1.232424318238678E-5,2.0353042559697536E-5]
[152,4.8320000000000034,-535.51663737599984,-35.996064000000132,-20.454134715765875,-20.454134715765875,-6.8547668739963843,-7.6640625,-17.8828125,15.328125,10.21875,{"$f":"'Graph Properties'!C$3*8/2-B231*C$3","v":-35.996064000000132},24.279749999999975,56.652749999999941,74.065500000000057,49.377000000000038,{"$f":"C$3*8/2*'Graph Properties'!B231-'Graph Properties'!C$3*B231^2/2","v":331.14163737599978},1.2215726164623459,2.2964832154115573,{"$f":"D$17*$E$6/(6*8*'Steel Eurocode 3'!$X$8*'Steel Eurocode 3'!$E$10)*100*1000*X231","v":2.2918567685764324},{"$f":"D$18*E$7/(6*8*'Steel Eurocode 3'!X$8*'Steel Eurocode 3'!E$10)*100*1000*Y231","v":1.7692660891223972},{"$f":"D$14*B231*(8^3-2*8*B231^2+B231^3)/24/('Steel Eurocode 3'!E$10*'Steel Eurocode 3'!X$8)*100*1000","v":12.874956026193143},null,152.94138163199997,177.10138163199997,4.2301524043032254E-6,1.6445878568926685E-5,3.5222985349011744E-5,5.8187817503127317E-5,null,0.42489482311733778,0.79877677057793306,{"$f":"C$17*$E$6/(6*8*'Steel Eurocode 3'!$X$8*'Steel Eurocode 3'!$E$10)*100*1000*AK231","v":0.79716757167875896},{"$f":"C$18*E$7/(6*8*'Steel Eurocode 3'!X$8*'Steel Eurocode 3'!E$10)*100*1000*Y231","v":0.61539690056431195},{"$f":"C$14*B231*(8^3-2*8*B231^2+B231^3)/24/('Steel Eurocode 3'!E$10*'Steel Eurocode 3'!X$8)*100*1000","v":4.2185308080580421},null,152.94138163199997,177.10138163199997,1.4713573580185129E-6,5.7203055891918902E-6,1.2251473164873646E-5,2.0239240870652976E-5]
[153,4.8640000000000034,-534.3426119039998,-37.38052800000014,-20.369175597422032,-20.369175597422032,-6.8263137640661578,-7.6640625,-17.8828125,15.328125,10.21875,{"$f":"'Graph Properties'!C$3*8/2-B232*C$3","v":-37.38052800000014},24.034499999999973,56.080499999999937,74.556000000000054,49.704000000000036,{"$f":"C$3*8/2*'Graph Properties'!B232-'Graph Properties'!C$3*B232^2/2","v":329.9676119039998},1.2139734594279032,2.28434632263086,{"$f":"D$17*$E$6/(6*8*'Steel Eurocode 3'!$X$8*'Steel Eurocode 3'!$E$10)*100*1000*X232","v":2.2844195226419806},{"$f":"D$18*E$7/(6*8*'Steel Eurocode 3'!X$8*'Steel Eurocode 3'!E$10)*100*1000*Y232","v":1.7659063462040974},{"$f":"D$14*B232*(8^3-2*8*B232^2+B232^3)/24/('Steel Eurocode 3'!E$10*'Steel Eurocode 3'!X$8)*100*1000","v":12.82052994651719},null,152.44507545599993,176.76507545599995,4.2032234598170822E-6,1.6342958054096116E-5,3.5009396427320471E-5,5.7852859653629072E-5,null,0.42225163806187943,0.79455524265421229,{"$f":"C$17*$E$6/(6*8*'Steel Eurocode 3'!$X$8*'Steel Eurocode 3'!$E$10)*100*1000*AK232","v":0.79458070352764543},{"$f":"C$18*E$7/(6*8*'Steel Eurocode 3'!X$8*'Steel Eurocode 3'!E$10)*100*1000*Y232","v":0.61422829433185977},{"$f":"C$14*B232*(8^3-2*8*B232^2+B232^3)/24/('Steel Eurocode 3'!E$10*'Steel Eurocode 3'!X$8)*100*1000","v":4.2006978854905608},null,152.44507545599993,176.76507545599995,1.4619907686320284E-6,5.6845071492508225E-6,1.2177181366024509E-5,2.0122733792566631E-5]
[154,4.8960000000000035,-533.12428358399984,-38.764992000000149,-20.281001132172452,-20.281001132172452,-6.7967823698671745,-7.6640625,-17.8828125,15.328125,10.21875,{"$f":"'Graph Properties'!C$3*8/2-B233*C$3","v":-38.764992000000149},23.789249999999974,55.50824999999994,75.046500000000052,50.031000000000034,{"$f":"C$3*8/2*'Graph Properties'!B233-'Graph Properties'!C$3*B233^2/2","v":328.74928358399984},1.2062299381202561,2.2718725798793522,{"$f":"D$17*$E$6/(6*8*'Steel Eurocode 3'!$X$8*'Steel Eurocode 3'!$E$10)*100*1000*X233","v":2.2765344528396292},{"$f":"D$18*E$7/(6*8*'Steel Eurocode 3'!X$8*'Steel Eurocode 3'!E$10)*100*1000*Y233","v":1.7622480540405303},{"$f":"D$14*B233*(8^3-2*8*B233^2+B233^3)/24/('Steel Eurocode 3'!E$10*'Steel Eurocode 3'!X$8)*100*1000","v":12.764116107292685},null,151.91888486399995,176.39888486399997,4.175813301086924E-6,1.6238112682289487E-5,3.4791476577433055E-5,5.7510202376226579E-5,null,0.41955823934617598,0.79021654952325282,{"$f":"C$17*$E$6/(6*8*'Steel Eurocode 3'!$X$8*'Steel Eurocode 3'!$E$10)*100*1000*AK233","v":0.79183807055291444},{"$f":"C$18*E$7/(6*8*'Steel Eurocode 3'!X$8*'Steel Eurocode 3'!E$10)*100*1000*Y233","v":0.61295584488366261},{"$f":"C$14*B233*(8^3-2*8*B233^2+B233^3)/24/('Steel Eurocode 3'!E$10*'Steel Eurocode 3'!X$8)*100*1000","v":4.1822136655611688},null,151.91888486399995,176.39888486399997,1.4524568003780603E-6,5.6480391938398198E-6,1.2101383157368018E-5,2.0003548652600546E-5]
[155,4.9280000000000035,-531.86165241599986,-40.149456000000157,-20.189618659437016,-20.189618659437016,-6.7661750961896949,-7.6640625,-17.8828125,15.328125,10.21875,{"$f":"'Graph Properties'!C$3*8/2-B234*C$3","v":-40.149456000000157},23.543999999999972,54.935999999999936,75.537000000000049,50.358000000000033,{"$f":"C$3*8/2*'Graph Properties'!B234-'Graph Properties'!C$3*B234^2/2","v":327.48665241599986},1.1983435256442323,2.2590654244016335,{"$f":"D$17*$E$6/(6*8*'Steel Eurocode 3'!$X$8*'Steel Eurocode 3'!$E$10)*100*1000*X234","v":2.2681986129597198},{"$f":"D$18*E$7/(6*8*'Steel Eurocode 3'!X$8*'Steel Eurocode 3'!E$10)*100*1000*Y234","v":1.7582892484919246},{"$f":"D$14*B234*(8^3-2*8*B234^2+B234^3)/24/('Steel Eurocode 3'!E$10*'Steel Eurocode 3'!X$8)*100*1000","v":12.705721847939506},null,151.36261324799997,176.00261324799999,4.1479268384621775E-6,1.6131362094904501E-5,3.4569269992494352E-5,5.7159924236510688E-5,null,0.41681513935451558,0.78576188674839409,{"$f":"C$17*$E$6/(6*8*'Steel Eurocode 3'!$X$8*'Steel Eurocode 3'!$E$10)*100*1000*AK234","v":0.78893864798598945},{"$f":"C$18*E$7/(6*8*'Steel Eurocode 3'!X$8*'Steel Eurocode 3'!E$10)*100*1000*Y234","v":0.61157886904066927},{"$f":"C$14*B234*(8^3-2*8*B234^2+B234^3)/24/('Steel Eurocode 3'!E$10*'Steel Eurocode 3'!X$8)*100*1000","v":4.1630805530601265},null,151.36261324799997,176.00261324799999,1.4427571612042356E-6,5.6109085547493915E-6,1.2024093910432818E-5,1.9881712777916759E-5]
[156,4.9600000000000035,-530.55471839999984,-41.533920000000137,-20.095035785523578,-20.095035785523578,-6.7344944352708946,-7.6640625,-17.8828125,15.328125,10.21875,{"$f":"'Graph Properties'!C$3*8/2-B235*C$3","v":-41.533920000000137},23.298749999999973,54.363749999999939,76.02750000000006,50.685000000000038,{"$f":"C$3*8/2*'Graph Properties'!B235-'Graph Properties'!C$3*B235^2/2","v":326.17971839999984},1.1903156951046612,2.2459282934423026,{"$f":"D$17*$E$6/(6*8*'Steel Eurocode 3'!$X$8*'Steel Eurocode 3'!$E$10)*100*1000*X235","v":2.259409056792594},{"$f":"D$18*E$7/(6*8*'Steel Eurocode 3'!X$8*'Steel Eurocode 3'!E$10)*100*1000*Y235","v":1.7540279654185083},{"$f":"D$14*B235*(8^3-2*8*B235^2+B235^3)/24/('Steel Eurocode 3'!E$10*'Steel Eurocode 3'!X$8)*100*1000","v":12.64535477476551},null,150.77606399999993,175.57606399999997,4.1195689822922719E-6,1.6022725933338883E-5,3.4342820865649214E-5,5.6802103800072239E-5,null,0.41402285047118642,0.78119244989297476,{"$f":"C$17*$E$6/(6*8*'Steel Eurocode 3'!$X$8*'Steel Eurocode 3'!$E$10)*100*1000*AK235","v":0.78588141105829346},{"$f":"C$18*E$7/(6*8*'Steel Eurocode 3'!X$8*'Steel Eurocode 3'!E$10)*100*1000*Y235","v":0.61009668362382885},{"$f":"C$14*B235*(8^3-2*8*B235^2+B235^3)/24/('Steel Eurocode 3'!E$10*'Steel Eurocode 3'!X$8)*100*1000","v":4.1433010402246113},null,150.77606399999993,175.57606399999997,1.4328935590581815E-6,5.5731220637700454E-6,1.1945328996747553E-5,1.97572534956773E-5]
[157,4.9920000000000035,-529.2034815359998,-42.918384000000145,-19.997260383628003,-19.997260383628003,-6.7017429667948694,-7.6640625,-17.8828125,15.328125,10.21875,{"$f":"'Graph Properties'!C$3*8/2-B236*C$3","v":-42.918384000000145},23.053499999999971,53.791499999999935,76.518000000000058,51.012000000000036,{"$f":"C$3*8/2*'Graph Properties'!B236-'Graph Properties'!C$3*B236^2/2","v":324.8284815359998},1.1821479196063704,2.2324646242459609,{"$f":"D$17*$E$6/(6*8*'Steel Eurocode 3'!$X$8*'Steel Eurocode 3'!$E$10)*100*1000*X236","v":2.2501628381285954},{"$f":"D$18*E$7/(6*8*'Steel Eurocode 3'!X$8*'Steel Eurocode 3'!E$10)*100*1000*Y236","v":1.74946224068051},{"$f":"D$14*B236*(8^3-2*8*B236^2+B236^3)/24/('Steel Eurocode 3'!E$10*'Steel Eurocode 3'!X$8)*100*1000","v":12.583022760966568},null,150.1590405119999,175.11904051199994,4.0907446429266367E-6,1.5912223838990342E-5,3.4112173390042505E-5,5.6436819632502114E-5,null,0.41118188508047665,0.77650943452033427,{"$f":"C$17*$E$6/(6*8*'Steel Eurocode 3'!$X$8*'Steel Eurocode 3'!$E$10)*100*1000*AK236","v":0.78266533500125046},{"$f":"C$18*E$7/(6*8*'Steel Eurocode 3'!X$8*'Steel Eurocode 3'!E$10)*100*1000*Y236","v":0.60850860545409036},{"$f":"C$14*B236*(8^3-2*8*B236^2+B236^3)/24/('Steel Eurocode 3'!E$10*'Steel Eurocode 3'!X$8)*100*1000","v":4.1228777067387181},null,150.1590405119999,175.11904051199994,1.4228677018875256E-6,5.5346865526922919E-6,1.186510378784087E-5,1.9630198133044212E-5]
[158,5.0240000000000036,-526.82694182399973,-85.177848000000154,-19.896301146248469,-19.896301146248469,-6.667923550036746,-7.6640625,-17.8828125,-25.546875,10.21875,{"$f":"'Graph Properties'!C$3*8/2-B237*C$3","v":-44.302848000000154},22.808249999999973,53.219249999999938,76.027499999999904,51.339000000000034,{"$f":"C$3*8/2*'Graph Properties'!B237-'Graph Properties'!C$3*B237^2/2","v":323.43294182399984},1.17384167225419,2.2186778540572085,{"$f":"D$17*$E$6/(6*8*'Steel Eurocode 3'!$X$8*'Steel Eurocode 3'!$E$10)*100*1000*X237","v":2.2404575631723787},{"$f":"D$18*E$7/(6*8*'Steel Eurocode 3'!X$8*'Steel Eurocode 3'!E$10)*100*1000*Y237","v":1.7445901101381591},{"$f":"D$14*B237*(8^3-2*8*B237^2+B237^3)/24/('Steel Eurocode 3'!E$10*'Steel Eurocode 3'!X$8)*100*1000","v":12.518733946626531},null,149.51138303999994,174.63134617599997,4.0614587307147001E-6,1.5799875453256599E-5,3.387737175881909E-5,5.6064150299391175E-5,null,0.40829275556667471,0.77171403619381174,{"$f":"C$17*$E$6/(6*8*'Steel Eurocode 3'!$X$8*'Steel Eurocode 3'!$E$10)*100*1000*AK237","v":0.77928958719039254},{"$f":"C$18*E$7/(6*8*'Steel Eurocode 3'!X$8*'Steel Eurocode 3'!E$10)*100*1000*Y237","v":0.60681395135240301},{"$f":"C$14*B237*(8^3-2*8*B237^2+B237^3)/24/('Steel Eurocode 3'!E$10*'Steel Eurocode 3'!X$8)*100*1000","v":4.1018132197334642},null,149.51138303999994,174.63134617599997,1.4126812976398956E-6,5.4956088533066422E-6,1.1783433655241422E-5,1.9500574017179539E-5]
[159,5.0560000000000036,-524.07909926399975,-86.562312000000162,-19.792171840821613,-19.792171840821613,-6.633040804083949,-7.6640625,-17.8828125,-25.546875,10.21875,{"$f":"'Graph Properties'!C$3*8/2-B238*C$3","v":-45.687312000000162},22.562999999999974,52.646999999999935,75.209999999999908,51.666000000000039,{"$f":"C$3*8/2*'Graph Properties'!B238-'Graph Properties'!C$3*B238^2/2","v":321.99309926399985},1.1653984261529473,2.2045714201206437,{"$f":"D$17*$E$6/(6*8*'Steel Eurocode 3'!$X$8*'Steel Eurocode 3'!$E$10)*100*1000*X238","v":2.2302956461790782},{"$f":"D$18*E$7/(6*8*'Steel Eurocode 3'!X$8*'Steel Eurocode 3'!E$10)*100*1000*Y238","v":1.7394096096516829},{"$f":"D$14*B238*(8^3-2*8*B238^2+B238^3)/24/('Steel Eurocode 3'!E$10*'Steel Eurocode 3'!X$8)*100*1000","v":12.452496738717262},null,148.83325269333326,174.11278438399995,4.0317161560058899E-6,1.5685700417535362E-5,3.3638460165123819E-5,5.5684174366330257E-5,null,0.40535597431406861,0.76680745047674614,{"$f":"C$17*$E$6/(6*8*'Steel Eurocode 3'!$X$8*'Steel Eurocode 3'!$E$10)*100*1000*AK238","v":0.77575500736663583},{"$f":"C$18*E$7/(6*8*'Steel Eurocode 3'!X$8*'Steel Eurocode 3'!E$10)*100*1000*Y238","v":0.60501203813971571},{"$f":"C$14*B238*(8^3-2*8*B238^2+B238^3)/24/('Steel Eurocode 3'!E$10*'Steel Eurocode 3'!X$8)*100*1000","v":4.0801103337867826},null,148.83325269333326,174.11278438399995,1.4023360542629182E-6,5.455895797403604E-6,1.1700333970477848E-5,1.9368408475245309E-5]
[160,5.0880000000000036,-521.28695385599963,-87.946776000000142,-19.684888977306578,-19.684888977306578,-6.5971002965610825,-7.6640625,-17.8828125,-25.546875,10.21875,{"$f":"'Graph Properties'!C$3*8/2-B239*C$3","v":-47.071776000000142},22.317749999999972,52.074749999999938,74.392499999999899,51.993000000000038,{"$f":"C$3*8/2*'Graph Properties'!B239-'Graph Properties'!C$3*B239^2/2","v":320.50895385599972},1.1568196544074714,2.19014875968087,{"$f":"D$17*$E$6/(6*8*'Steel Eurocode 3'!$X$8*'Steel Eurocode 3'!$E$10)*100*1000*X239","v":2.2196819770383334},{"$f":"D$18*E$7/(6*8*'Steel Eurocode 3'!X$8*'Steel Eurocode 3'!E$10)*100*1000*Y239","v":1.7339187750813103},{"$f":"D$14*B239*(8^3-2*8*B239^2+B239^3)/24/('Steel Eurocode 3'!E$10*'Steel Eurocode 3'!X$8)*100*1000","v":12.384319811098592},null,148.1249757866666,173.56315852799992,4.0015218291496369E-6,1.556971837322435E-5,3.3395482802101549E-5,5.5296970398910248E-5,null,0.40237205370694651,0.76179087293247649,{"$f":"C$17*$E$6/(6*8*'Steel Eurocode 3'!$X$8*'Steel Eurocode 3'!$E$10)*100*1000*AK239","v":0.77206329636115945},{"$f":"C$18*E$7/(6*8*'Steel Eurocode 3'!X$8*'Steel Eurocode 3'!E$10)*100*1000*Y239","v":0.60310218263697746},{"$f":"C$14*B239*(8^3-2*8*B239^2+B239^3)/24/('Steel Eurocode 3'!E$10*'Steel Eurocode 3'!X$8)*100*1000","v":4.0577718909235232},null,148.1249757866666,173.56315852799992,1.3918336797042211E-6,5.4155542167736861E-6,1.1615820105078797E-5,1.9233728834403562E-5]
[161,5.1200000000000037,-518.45050559999959,-89.33124000000015,-19.574469353010301,-19.574469353010301,-6.5601076896561263,-7.6640625,-17.8828125,-25.546875,10.21875,{"$f":"'Graph Properties'!C$3*8/2-B240*C$3","v":-48.45624000000015},22.072499999999973,51.502499999999934,73.574999999999918,52.320000000000036,{"$f":"C$3*8/2*'Graph Properties'!B240-'Graph Properties'!C$3*B240^2/2","v":318.98050559999979},1.148106830122591,2.1754133099824844,{"$f":"D$17*$E$6/(6*8*'Steel Eurocode 3'!$X$8*'Steel Eurocode 3'!$E$10)*100*1000*X240","v":2.208621466099574},{"$f":"D$18*E$7/(6*8*'Steel Eurocode 3'!X$8*'Steel Eurocode 3'!E$10)*100*1000*Y240","v":1.7281156422872703},{"$f":"D$14*B240*(8^3-2*8*B240^2+B240^3)/24/('Steel Eurocode 3'!E$10*'Steel Eurocode 3'!X$8)*100*1000","v":12.314212104518383},null,147.38687999999993,172.98227199999991,3.9708806604953678E-6,1.5451948961721278E-5,3.3148483862897146E-5,5.490261696272199E-5,null,0.39934150612959685,0.75666549912434244,{"$f":"C$17*$E$6/(6*8*'Steel Eurocode 3'!$X$8*'Steel Eurocode 3'!$E$10)*100*1000*AK240","v":0.76821616212159094},{"$f":"C$18*E$7/(6*8*'Steel Eurocode 3'!X$8*'Steel Eurocode 3'!E$10)*100*1000*Y240","v":0.60108370166513736},{"$f":"C$14*B240*(8^3-2*8*B240^2+B240^3)/24/('Steel Eurocode 3'!E$10*'Steel Eurocode 3'!X$8)*100*1000","v":4.0348008206154589},null,147.38687999999993,172.98227199999991,1.3811758819114321E-6,5.3745909432074003E-6,1.1529907430572917E-5,1.9096562421816342E-5]
[162,5.1520000000000037,-515.56975449599963,-90.715704000000159,-19.460930032127703,-19.460930032127703,-6.5220687330039695,-7.6640625,-17.8828125,-25.546875,10.21875,{"$f":"'Graph Properties'!C$3*8/2-B241*C$3","v":-49.840704000000159},21.827249999999971,50.930249999999937,72.757499999999908,52.647000000000041,{"$f":"C$3*8/2*'Graph Properties'!B241-'Graph Properties'!C$3*B241^2/2","v":317.40775449599982},1.1392614264031349,2.1603685082700901,{"$f":"D$17*$E$6/(6*8*'Steel Eurocode 3'!$X$8*'Steel Eurocode 3'!$E$10)*100*1000*X241","v":2.1971190237122276},{"$f":"D$18*E$7/(6*8*'Steel Eurocode 3'!X$8*'Steel Eurocode 3'!E$10)*100*1000*Y241","v":1.7219982471297912},{"$f":"D$14*B241*(8^3-2*8*B241^2+B241^3)/24/('Steel Eurocode 3'!E$10*'Steel Eurocode 3'!X$8)*100*1000","v":12.242182826612458},null,146.61929301333325,172.36992819199992,3.9397975603925129E-6,1.5332411824423862E-5,3.2897507540655459E-5,5.4501192623356358E-5,null,0.39626484396630757,0.75143252461568333,{"$f":"C$17*$E$6/(6*8*'Steel Eurocode 3'!$X$8*'Steel Eurocode 3'!$E$10)*100*1000*AK241","v":0.76421531259555742},{"$f":"C$18*E$7/(6*8*'Steel Eurocode 3'!X$8*'Steel Eurocode 3'!E$10)*100*1000*Y241","v":0.59895591204514465},{"$f":"C$14*B241*(8^3-2*8*B241^2+B241^3)/24/('Steel Eurocode 3'!E$10*'Steel Eurocode 3'!X$8)*100*1000","v":4.0112001397812769},null,146.61929301333325,172.36992819199992,1.3703643688321783E-6,5.3330128084952545E-6,1.1442611318488855E-5,1.8956936564645688E-5]
[163,5.1840000000000037,-512.64470054399976,-92.100168000000167,-19.344288345741703,-19.344288345741703,-6.4829892636864273,-7.6640625,-17.8828125,-25.546875,10.21875,{"$f":"'Graph Properties'!C$3*8/2-B242*C$3","v":-51.225168000000167},21.581999999999972,50.357999999999933,71.939999999999898,52.974000000000039,{"$f":"C$3*8/2*'Graph Properties'!B242-'Graph Properties'!C$3*B242^2/2","v":315.79070054399983},1.130284916353931,2.145017791788284,{"$f":"D$17*$E$6/(6*8*'Steel Eurocode 3'!$X$8*'Steel Eurocode 3'!$E$10)*100*1000*X242","v":2.1851795602257242},{"$f":"D$18*E$7/(6*8*'Steel Eurocode 3'!X$8*'Steel Eurocode 3'!E$10)*100*1000*Y242","v":1.7155646254691015},{"$f":"D$14*B242*(8^3-2*8*B242^2+B242^3)/24/('Steel Eurocode 3'!E$10*'Steel Eurocode 3'!X$8)*100*1000","v":12.168241451904663},null,145.82254250666659,171.72593049599993,3.9082774391905006E-6,1.5211126602729811E-5,3.2642598028521361E-5,5.40927759464042E-5,null,0.39314257960136728,0.7460931449698377,{"$f":"C$17*$E$6/(6*8*'Steel Eurocode 3'!$X$8*'Steel Eurocode 3'!$E$10)*100*1000*AK242","v":0.76006245573068654},{"$f":"C$18*E$7/(6*8*'Steel Eurocode 3'!X$8*'Steel Eurocode 3'!E$10)*100*1000*Y242","v":0.5967181305979482},{"$f":"C$14*B242*(8^3-2*8*B242^2+B242^3)/24/('Steel Eurocode 3'!E$10*'Steel Eurocode 3'!X$8)*100*1000","v":3.9869729527865876},null,145.82254250666659,171.72593049599993,1.3594008484140868E-6,5.29082664442776E-6,1.1353947140355255E-5,1.8814878590053632E-5]
[164,5.2160000000000037,-509.67534374399963,-93.484632000000147,-19.224561891823221,-19.224561891823221,-6.442875206232225,-7.6640625,-17.8828125,-25.546875,10.21875,{"$f":"'Graph Properties'!C$3*8/2-B243*C$3","v":-52.609632000000147},21.33674999999997,49.785749999999936,71.122499999999903,53.301000000000037,{"$f":"C$3*8/2*'Graph Properties'!B243-'Graph Properties'!C$3*B243^2/2","v":314.12934374399981},1.1211787730798086,2.1293645977816675,{"$f":"D$17*$E$6/(6*8*'Steel Eurocode 3'!$X$8*'Steel Eurocode 3'!$E$10)*100*1000*X243","v":2.1728079859894915},{"$f":"D$18*E$7/(6*8*'Steel Eurocode 3'!X$8*'Steel Eurocode 3'!E$10)*100*1000*Y243","v":1.708812813165429},{"$f":"D$14*B243*(8^3-2*8*B243^2+B243^3)/24/('Steel Eurocode 3'!E$10*'Steel Eurocode 3'!X$8)*100*1000","v":12.092397721806824},null,144.99695615999994,171.05008230399991,3.8763252072387584E-6,1.5088112938036846E-5,3.2383799519639701E-5,5.3677445497456377E-5,null,0.38997522541906382,0.7406485557501451,{"$f":"C$17*$E$6/(6*8*'Steel Eurocode 3'!$X$8*'Steel Eurocode 3'!$E$10)*100*1000*AK243","v":0.75575929947460574},{"$f":"C$18*E$7/(6*8*'Steel Eurocode 3'!X$8*'Steel Eurocode 3'!E$10)*100*1000*Y243","v":0.59436967414449693},{"$f":"C$14*B243*(8^3-2*8*B243^2+B243^3)/24/('Steel Eurocode 3'!E$10*'Steel Eurocode 3'!X$8)*100*1000","v":3.9621224514439137},null,144.99695615999994,171.05008230399991,1.3482870286047856E-6,5.2480392827954245E-6,1.1263930267700764E-5,1.8670415825202216E-5]
[165,5.2480000000000038,-506.66168409599959,-94.869096000000155,-19.101768535231166,-19.101768535231166,-6.4017325726170142,-7.6640625,-17.8828125,-25.546875,10.21875,{"$f":"'Graph Properties'!C$3*8/2-B244*C$3","v":-53.994096000000155},21.091499999999971,49.213499999999932,70.304999999999907,53.628000000000036,{"$f":"C$3*8/2*'Graph Properties'!B244-'Graph Properties'!C$3*B244^2/2","v":312.42368409599976},1.1119444696855965,2.1134123634948421,{"$f":"D$17*$E$6/(6*8*'Steel Eurocode 3'!$X$8*'Steel Eurocode 3'!$E$10)*100*1000*X244","v":2.1600092113529583},{"$f":"D$18*E$7/(6*8*'Steel Eurocode 3'!X$8*'Steel Eurocode 3'!E$10)*100*1000*Y244","v":1.7017408460790031},{"$f":"D$14*B244*(8^3-2*8*B244^2+B244^3)/24/('Steel Eurocode 3'!E$10*'Steel Eurocode 3'!X$8)*100*1000","v":12.014661644618764},null,144.14286165333326,170.34218700799991,3.8439457748867173E-6,1.4963390471742683E-5,3.2121156207155337E-5,5.3255279842103758E-5,null,0.38676329380368568,0.73509995251994487,{"$f":"C$17*$E$6/(6*8*'Steel Eurocode 3'!$X$8*'Steel Eurocode 3'!$E$10)*100*1000*AK244","v":0.75130755177494202},{"$f":"C$18*E$7/(6*8*'Steel Eurocode 3'!X$8*'Steel Eurocode 3'!E$10)*100*1000*Y244","v":0.59190985950574004},{"$f":"C$14*B244*(8^3-2*8*B244^2+B244^3)/24/('Steel Eurocode 3'!E$10*'Steel Eurocode 3'!X$8)*100*1000","v":3.9366519150127011},null,144.14286165333326,170.34218700799991,1.3370246173519014E-6,5.2046575553887583E-6,1.1172576072054028E-5,1.8523575597253477E-5]
[166,5.2800000000000038,-503.60372159999963,-96.253560000000164,-18.975926407712432,-18.975926407712432,-6.3595674622633585,-7.6640625,-17.8828125,-25.546875,10.21875,{"$f":"'Graph Properties'!C$3*8/2-B245*C$3","v":-55.378560000000164},20.846249999999969,48.641249999999935,69.487499999999912,53.955000000000041,{"$f":"C$3*8/2*'Graph Properties'!B245-'Graph Properties'!C$3*B245^2/2","v":310.67372159999979},1.1025834792761227,2.097164526172405,{"$f":"D$17*$E$6/(6*8*'Steel Eurocode 3'!$X$8*'Steel Eurocode 3'!$E$10)*100*1000*X245","v":2.146788146665553},{"$f":"D$18*E$7/(6*8*'Steel Eurocode 3'!X$8*'Steel Eurocode 3'!E$10)*100*1000*Y245","v":1.6943467600700519},{"$f":"D$14*B245*(8^3-2*8*B245^2+B245^3)/24/('Steel Eurocode 3'!E$10*'Steel Eurocode 3'!X$8)*100*1000","v":11.935043495528301},null,143.26058666666654,169.60204799999991,3.8111440524838031E-6,1.483697884524503E-5,3.1854712284213128E-5,5.2826357545937178E-5,null,0.38350729713952086,0.72944853084257588,{"$f":"C$17*$E$6/(6*8*'Steel Eurocode 3'!$X$8*'Steel Eurocode 3'!$E$10)*100*1000*AK245","v":0.74670892057932281},{"$f":"C$18*E$7/(6*8*'Steel Eurocode 3'!X$8*'Steel Eurocode 3'!E$10)*100*1000*Y245","v":0.58933800350262666},{"$f":"C$14*B245*(8^3-2*8*B245^2+B245^3)/24/('Steel Eurocode 3'!E$10*'Steel Eurocode 3'!X$8)*100*1000","v":3.9105647101993126},null,143.26058666666654,169.60204799999991,1.325615322603062E-6,5.1606882939982709E-6,1.1079899924943694E-5,1.8374385233369453E-5]
[167,5.3120000000000038,-500.50145625599964,-97.638024000000172,-18.847053907901945,-18.847053907901945,-6.3163860620407482,-7.6640625,-17.8828125,-25.546875,10.21875,{"$f":"'Graph Properties'!C$3*8/2-B246*C$3","v":-56.763024000000172},20.600999999999971,48.068999999999932,68.669999999999902,54.282000000000039,{"$f":"C$3*8/2*'Graph Properties'!B246-'Graph Properties'!C$3*B246^2/2","v":308.8794562559998},1.093097274956216,2.0806245230589591,{"$f":"D$17*$E$6/(6*8*'Steel Eurocode 3'!$X$8*'Steel Eurocode 3'!$E$10)*100*1000*X246","v":2.1331497022767061},{"$f":"D$18*E$7/(6*8*'Steel Eurocode 3'!X$8*'Steel Eurocode 3'!E$10)*100*1000*Y246","v":1.6866285909988039},{"$f":"D$14*B246*(8^3-2*8*B246^2+B246^3)/24/('Steel Eurocode 3'!E$10*'Steel Eurocode 3'!X$8)*100*1000","v":11.85355381661126},null,142.35045887999988,168.8294686719999,3.777924950379447E-6,1.4708897699941608E-5,3.1584511943957937E-5,5.2390757174547526E-5,null,0.3802077478108577,0.72369548628137703,{"$f":"C$17*$E$6/(6*8*'Steel Eurocode 3'!$X$8*'Steel Eurocode 3'!$E$10)*100*1000*AK246","v":0.741965113835376},{"$f":"C$18*E$7/(6*8*'Steel Eurocode 3'!X$8*'Steel Eurocode 3'!E$10)*100*1000*Y246","v":0.58665342295610556},{"$f":"C$14*B246*(8^3-2*8*B246^2+B246^3)/24/('Steel Eurocode 3'!E$10*'Steel Eurocode 3'!X$8)*100*1000","v":3.8838642911570318},null,142.35045887999988,168.8294686719999,1.3140608523058946E-6,5.1161383304144718E-6,1.0985917197898412E-5,1.8222872060712182E-5]
[168,5.3440000000000039,-497.35488806399962,-99.022488000000152,-18.715169701322587,-18.715169701322587,-6.272194646265584,-7.6640625,-17.8828125,-25.546875,10.21875,{"$f":"'Graph Properties'!C$3*8/2-B247*C$3","v":-58.147488000000152},20.355749999999972,47.496749999999928,67.852499999999893,54.609000000000037,{"$f":"C$3*8/2*'Graph Properties'!B247-'Graph Properties'!C$3*B247^2/2","v":307.04088806399977},1.0834873298307053,2.0637957913991034,{"$f":"D$17*$E$6/(6*8*'Steel Eurocode 3'!$X$8*'Steel Eurocode 3'!$E$10)*100*1000*X247","v":2.1190987885358443},{"$f":"D$18*E$7/(6*8*'Steel Eurocode 3'!X$8*'Steel Eurocode 3'!E$10)*100*1000*Y247","v":1.6785843747254878},{"$f":"D$14*B247*(8^3-2*8*B247^2+B247^3)/24/('Steel Eurocode 3'!E$10*'Steel Eurocode 3'!X$8)*100*1000","v":11.770203416831444},null,141.41280597333318,168.02425241599991,3.7442933789230777E-6,1.4579166677230131E-5,3.1310599379534615E-5,5.1948557293525649E-5,null,0.37686515820198446,0.71784201439968787,{"$f":"C$17*$E$6/(6*8*'Steel Eurocode 3'!$X$8*'Steel Eurocode 3'!$E$10)*100*1000*AK247","v":0.73707783949072836},{"$f":"C$18*E$7/(6*8*'Steel Eurocode 3'!X$8*'Steel Eurocode 3'!E$10)*100*1000*Y247","v":0.58385543468712608},{"$f":"C$14*B247*(8^3-2*8*B247^2+B247^3)/24/('Steel Eurocode 3'!E$10*'Steel Eurocode 3'!X$8)*100*1000","v":3.856554199486057},null,141.41280597333318,168.02425241599991,1.3023629144080267E-6,5.0710144964278714E-6,1.0890643262446824E-5,1.8069063406443703E-5]
[169,5.3760000000000039,-494.16401702399958,-100.40695200000016,-18.580292720385245,-18.580292720385245,-6.2269995767011874,-7.6640625,-17.8828125,-25.546875,10.21875,{"$f":"'Graph Properties'!C$3*8/2-B248*C$3","v":-59.53195200000016},20.11049999999997,46.924499999999931,67.034999999999897,54.936000000000043,{"$f":"C$3*8/2*'Graph Properties'!B248-'Graph Properties'!C$3*B248^2/2","v":305.15801702399972},1.0737551170044188,2.0466817684374377,{"$f":"D$17*$E$6/(6*8*'Steel Eurocode 3'!$X$8*'Steel Eurocode 3'!$E$10)*100*1000*X248","v":2.1046403157923987},{"$f":"D$18*E$7/(6*8*'Steel Eurocode 3'!X$8*'Steel Eurocode 3'!E$10)*100*1000*Y248","v":1.6702121471103319},{"$f":"D$14*B248*(8^3-2*8*B248^2+B248^3)/24/('Steel Eurocode 3'!E$10*'Steel Eurocode 3'!X$8)*100*1000","v":11.685003372040658},null,140.44795562666658,167.18620262399989,3.7102542484641219E-6,1.4447805418508309E-5,3.1033018784088027E-5,5.1499836468462403E-5,null,0.37348004069718921,0.7118893107608476,{"$f":"C$17*$E$6/(6*8*'Steel Eurocode 3'!$X$8*'Steel Eurocode 3'!$E$10)*100*1000*AK248","v":0.73204880549300833},{"$f":"C$18*E$7/(6*8*'Steel Eurocode 3'!X$8*'Steel Eurocode 3'!E$10)*100*1000*Y248","v":0.58094335551663712},{"$f":"C$14*B248*(8^3-2*8*B248^2+B248^3)/24/('Steel Eurocode 3'!E$10*'Steel Eurocode 3'!X$8)*100*1000","v":3.8286380642335049},null,140.44795562666658,167.18620262399989,1.2905232168570859E-6,5.0253236238289774E-6,1.0794093490117576E-5,1.7912986597726053E-5]
[170,5.4080000000000039,-490.92884313599961,-101.79141600000017,-18.442442164388815,-18.442442164388815,-6.1808073025578016,-7.6640625,-17.8828125,-25.546875,10.21875,{"$f":"'Graph Properties'!C$3*8/2-B249*C$3","v":-60.916416000000169},19.865249999999971,46.352249999999927,66.217499999999902,55.263000000000041,{"$f":"C$3*8/2*'Graph Properties'!B249-'Graph Properties'!C$3*B249^2/2","v":303.23084313599975},1.0639021095821855,2.0292858914185619,{"$f":"D$17*$E$6/(6*8*'Steel Eurocode 3'!$X$8*'Steel Eurocode 3'!$E$10)*100*1000*X249","v":2.0897791943957951},{"$f":"D$18*E$7/(6*8*'Steel Eurocode 3'!X$8*'Steel Eurocode 3'!E$10)*100*1000*Y249","v":1.6615099440135646},{"$f":"D$14*B249*(8^3-2*8*B249^2+B249^3)/24/('Steel Eurocode 3'!E$10*'Steel Eurocode 3'!X$8)*100*1000","v":11.597965024978709},null,139.45623551999986,166.31512268799986,3.6758124693520098E-6,1.4314833565173865E-5,3.0751814350763036E-5,5.1044673264948656E-5,null,0.3700529076807601,0.70583857092819535,{"$f":"C$17*$E$6/(6*8*'Steel Eurocode 3'!$X$8*'Steel Eurocode 3'!$E$10)*100*1000*AK249","v":0.72687971978984178},{"$f":"C$18*E$7/(6*8*'Steel Eurocode 3'!X$8*'Steel Eurocode 3'!E$10)*100*1000*Y249","v":0.57791650226558755},{"$f":"C$14*B249*(8^3-2*8*B249^2+B249^3)/24/('Steel Eurocode 3'!E$10*'Steel Eurocode 3'!X$8)*100*1000","v":3.8001196018934169},null,139.45623551999986,166.31512268799986,1.278543467600699E-6,4.9790725444083002E-6,1.0696283252439316E-5,1.775466896172127E-5]
[171,5.4400000000000039,-487.64936639999968,-103.17588000000018,-18.301637499520183,-18.301637499520183,-6.1336243604925871,-7.6640625,-17.8828125,-25.546875,10.21875,{"$f":"'Graph Properties'!C$3*8/2-B250*C$3","v":-62.300880000000177},19.619999999999969,45.77999999999993,65.399999999999892,55.590000000000039,{"$f":"C$3*8/2*'Graph Properties'!B250-'Graph Properties'!C$3*B250^2/2","v":301.25936639999986},1.0539297806688339,2.011611597587077,{"$f":"D$17*$E$6/(6*8*'Steel Eurocode 3'!$X$8*'Steel Eurocode 3'!$E$10)*100*1000*X250","v":2.0745203346954653},{"$f":"D$18*E$7/(6*8*'Steel Eurocode 3'!X$8*'Steel Eurocode 3'!E$10)*100*1000*Y250","v":1.6524758012954155},{"$f":"D$14*B250*(8^3-2*8*B250^2+B250^3)/24/('Steel Eurocode 3'!E$10*'Steel Eurocode 3'!X$8)*100*1000","v":11.509099985273391},null,138.43797333333325,165.41081599999993,3.6409729519361707E-6,1.4180270758624509E-5,3.0467030272704497E-5,5.0583146248575269E-5,null,0.36658427153698564,0.69969099046507055,{"$f":"C$17*$E$6/(6*8*'Steel Eurocode 3'!$X$8*'Steel Eurocode 3'!$E$10)*100*1000*AK250","v":0.72157229032885739},{"$f":"C$18*E$7/(6*8*'Steel Eurocode 3'!X$8*'Steel Eurocode 3'!E$10)*100*1000*Y250","v":0.57477419175492706},{"$f":"C$14*B250*(8^3-2*8*B250^2+B250^3)/24/('Steel Eurocode 3'!E$10*'Steel Eurocode 3'!X$8)*100*1000","v":3.7710026164067463},null,138.43797333333325,165.41081599999993,1.2664253745864941E-6,4.932268089956351E-6,1.0597227920940693E-5,1.7594137825591399E-5]
[172,5.472000000000004,-484.32558681599954,-104.56034400000016,-18.157898458854213,-18.157898458854213,-6.0854573746096179,-7.6640625,-17.8828125,-25.546875,10.21875,{"$f":"'Graph Properties'!C$3*8/2-B251*C$3","v":-63.685344000000157},19.37474999999997,45.207749999999926,64.582499999999897,55.917000000000037,{"$f":"C$3*8/2*'Graph Properties'!B251-'Graph Properties'!C$3*B251^2/2","v":299.24358681599972},1.0438396033691921,1.9936623241875826,{"$f":"D$17*$E$6/(6*8*'Steel Eurocode 3'!$X$8*'Steel Eurocode 3'!$E$10)*100*1000*X251","v":2.0588686470408351},{"$f":"D$18*E$7/(6*8*'Steel Eurocode 3'!X$8*'Steel Eurocode 3'!E$10)*100*1000*Y251","v":1.643107754816111},{"$f":"D$14*B251*(8^3-2*8*B251^2+B251^3)/24/('Steel Eurocode 3'!E$10*'Steel Eurocode 3'!X$8)*100*1000","v":11.418420129440493},null,137.39349674666656,164.47308595199988,3.6057406065660308E-6,1.4044136640257953E-5,3.0178710743057258E-5,5.0115333984933084E-5,null,0.36307464465015382,0.69344776493481153,{"$f":"C$17*$E$6/(6*8*'Steel Eurocode 3'!$X$8*'Steel Eurocode 3'!$E$10)*100*1000*AK251","v":0.71612822505768159},{"$f":"C$18*E$7/(6*8*'Steel Eurocode 3'!X$8*'Steel Eurocode 3'!E$10)*100*1000*Y251","v":0.57151574080560374},{"$f":"C$14*B251*(8^3-2*8*B251^2+B251^3)/24/('Steel Eurocode 3'!E$10*'Steel Eurocode 3'!X$8)*100*1000","v":3.7412909991613672},null,137.39349674666656,164.47308595199988,1.2541706457620977E-6,4.8849170922636358E-6,1.0496942867150348E-5,1.7431420516498464E-5]
[173,5.504000000000004,-480.95750438399949,-105.94480800000017,-18.011245042353792,-18.011245042353792,-6.0363130564598944,-7.6640625,-17.8828125,-25.546875,10.21875,{"$f":"'Graph Properties'!C$3*8/2-B252*C$3","v":-65.069808000000165},19.129499999999968,44.635499999999929,63.764999999999894,56.244000000000042,{"$f":"C$3*8/2*'Graph Properties'!B252-'Graph Properties'!C$3*B252^2/2","v":297.18350438399966},1.03363305078809,1.9754415084646797,{"$f":"D$17*$E$6/(6*8*'Steel Eurocode 3'!$X$8*'Steel Eurocode 3'!$E$10)*100*1000*X252","v":2.0428290417813337},{"$f":"D$18*E$7/(6*8*'Steel Eurocode 3'!X$8*'Steel Eurocode 3'!E$10)*100*1000*Y252","v":1.6334038404358815},{"$f":"D$14*B252*(8^3-2*8*B252^2+B252^3)/24/('Steel Eurocode 3'!E$10*'Steel Eurocode 3'!X$8)*100*1000","v":11.325937600883808},null,136.32313343999982,163.50173593599987,3.5701203435910224E-6,1.3906450851471921E-5,2.9886899954966192E-5,4.964131503961299E-5,null,0.35952453940455298,0.68711008990075795,{"$f":"C$17*$E$6/(6*8*'Steel Eurocode 3'!$X$8*'Steel Eurocode 3'!$E$10)*100*1000*AK252","v":0.71054923192394204},{"$f":"C$18*E$7/(6*8*'Steel Eurocode 3'!X$8*'Steel Eurocode 3'!E$10)*100*1000*Y252","v":0.5681404662385674},{"$f":"C$14*B252*(8^3-2*8*B252^2+B252^3)/24/('Steel Eurocode 3'!E$10*'Steel Eurocode 3'!X$8)*100*1000","v":3.7109887289920733},null,136.32313343999982,163.50173593599987,1.241780989075138E-6,4.8370263831206676E-6,1.0395443462596934E-5,1.7266544361604513E-5]
[174,5.536000000000004,-477.54511910399964,-107.32927200000017,-17.861697516869786,-17.861697516869786,-5.9861982050413314,-7.6640625,-17.8828125,-25.546875,10.21875,{"$f":"'Graph Properties'!C$3*8/2-B253*C$3","v":-66.454272000000174},18.88424999999997,44.063249999999925,62.947499999999906,56.571000000000041,{"$f":"C$3*8/2*'Graph Properties'!B253-'Graph Properties'!C$3*B253^2/2","v":295.0791191039998},1.0233115960303549,1.9569525876629672,{"$f":"D$17*$E$6/(6*8*'Steel Eurocode 3'!$X$8*'Steel Eurocode 3'!$E$10)*100*1000*X253","v":2.0264064292663932},{"$f":"D$18*E$7/(6*8*'Steel Eurocode 3'!X$8*'Steel Eurocode 3'!E$10)*100*1000*Y253","v":1.6233620940149549},{"$f":"D$14*B253*(8^3-2*8*B253^2+B253^3)/24/('Steel Eurocode 3'!E$10*'Steel Eurocode 3'!X$8)*100*1000","v":11.231664809895117},null,135.22721109333324,162.49656934399991,3.5341170733605719E-6,1.3767233033664121E-5,2.9591642101576148E-5,4.9161167978205821E-5,null,0.35593446818447116,0.68067916092624947,{"$f":"C$17*$E$6/(6*8*'Steel Eurocode 3'!$X$8*'Steel Eurocode 3'!$E$10)*100*1000*AK253","v":0.70483701887526717},{"$f":"C$18*E$7/(6*8*'Steel Eurocode 3'!X$8*'Steel Eurocode 3'!E$10)*100*1000*Y253","v":0.5646476848747668},{"$f":"C$14*B253*(8^3-2*8*B253^2+B253^3)/24/('Steel Eurocode 3'!E$10*'Steel Eurocode 3'!X$8)*100*1000","v":3.6800998721805764},null,135.22721109333324,162.49656934399991,1.2292581124732423E-6,4.7886027943179541E-6,1.0292745078809094E-5,1.7099536688071588E-5]
[175,5.5680000000000041,-474.08843097599964,-108.71373600000018,-17.709276416141059,-17.709276416141059,-5.9351197067987602,-7.6640625,-17.8828125,-25.546875,10.21875,{"$f":"'Graph Properties'!C$3*8/2-B254*C$3","v":-67.838736000000182},18.638999999999967,43.490999999999929,62.129999999999896,56.898000000000039,{"$f":"C$3*8/2*'Graph Properties'!B254-'Graph Properties'!C$3*B254^2/2","v":292.9304309759998},1.0128767122008162,1.9381989990270461,{"$f":"D$17*$E$6/(6*8*'Steel Eurocode 3'!$X$8*'Steel Eurocode 3'!$E$10)*100*1000*X254","v":2.009605719845438},{"$f":"D$18*E$7/(6*8*'Steel Eurocode 3'!X$8*'Steel Eurocode 3'!E$10)*100*1000*Y254","v":1.6129805514135593},{"$f":"D$14*B254*(8^3-2*8*B254^2+B254^3)/24/('Steel Eurocode 3'!E$10*'Steel Eurocode 3'!X$8)*100*1000","v":11.135614433654197},null,134.10605738666655,161.45738956799988,3.4977357062241085E-6,1.3626502828232271E-5,2.929298137603199E-5,4.8674971366302452E-5,null,0.35230494337419682,0.67415617357462465,{"$f":"C$17*$E$6/(6*8*'Steel Eurocode 3'!$X$8*'Steel Eurocode 3'!$E$10)*100*1000*AK254","v":0.69899329385928277},{"$f":"C$18*E$7/(6*8*'Steel Eurocode 3'!X$8*'Steel Eurocode 3'!E$10)*100*1000*Y254","v":0.56103671353515094},{"$f":"C$14*B254*(8^3-2*8*B254^2+B254^3)/24/('Steel Eurocode 3'!E$10*'Steel Eurocode 3'!X$8)*100*1000","v":3.6486285824555047},null,134.10605738666655,161.45738956799988,1.2166037239040376E-6,4.7396531576460057E-6,1.0188863087315474E-5,1.693042482306172E-5]
[176,5.6000000000000041,-470.5874399999995,-110.09820000000016,-17.554002540794464,-17.554002540794464,-5.8830845356239339,-7.6640625,-17.8828125,-25.546875,10.21875,{"$f":"'Graph Properties'!C$3*8/2-B255*C$3","v":-69.223200000000162},18.393749999999969,42.918749999999925,61.312499999999901,57.225000000000044,{"$f":"C$3*8/2*'Graph Properties'!B255-'Graph Properties'!C$3*B255^2/2","v":290.73743999999965},1.0023298724043017,1.9191841798015159,{"$f":"D$17*$E$6/(6*8*'Steel Eurocode 3'!$X$8*'Steel Eurocode 3'!$E$10)*100*1000*X255","v":1.9924318238678993},{"$f":"D$18*E$7/(6*8*'Steel Eurocode 3'!X$8*'Steel Eurocode 3'!E$10)*100*1000*Y255","v":1.6022572484919235},{"$f":"D$14*B255*(8^3-2*8*B255^2+B255^3)/24/('Steel Eurocode 3'!E$10*'Steel Eurocode 3'!X$8)*100*1000","v":11.037799416228825},null,132.95999999999987,160.38399999999987,3.4609811525310607E-6,1.348427987657408E-5,2.8990961971478575E-5,4.8182803769493732E-5,null,0.34863647735801806,0.6675423234092227,{"$f":"C$17*$E$6/(6*8*'Steel Eurocode 3'!$X$8*'Steel Eurocode 3'!$E$10)*100*1000*AK255","v":0.69301976482361705},{"$f":"C$18*E$7/(6*8*'Steel Eurocode 3'!X$8*'Steel Eurocode 3'!E$10)*100*1000*Y255","v":0.55730686904066895},{"$f":"C$14*B255*(8^3-2*8*B255^2+B255^3)/24/('Steel Eurocode 3'!E$10*'Steel Eurocode 3'!X$8)*100*1000","v":3.6165791009924071},null,132.95999999999987,160.38399999999987,1.2038195313151513E-6,4.6901843048953319E-6,1.008381285964472E-5,1.6759236093736947E-5]
[177,5.6320000000000041,-467.04214617599951,-111.48266400000017,-17.395896958344867,-17.395896958344867,-5.8300997528555234,-7.6640625,-17.8828125,-25.546875,10.21875,{"$f":"'Graph Properties'!C$3*8/2-B256*C$3","v":-70.60766400000017},18.14849999999997,42.346499999999928,60.494999999999891,57.552000000000042,{"$f":"C$3*8/2*'Graph Properties'!B256-'Graph Properties'!C$3*B256^2/2","v":288.5001461759997},0.99167254974564123,1.8999115672309768,{"$f":"D$17*$E$6/(6*8*'Steel Eurocode 3'!$X$8*'Steel Eurocode 3'!$E$10)*100*1000*X256","v":1.9748896516832048},{"$f":"D$18*E$7/(6*8*'Steel Eurocode 3'!X$8*'Steel Eurocode 3'!E$10)*100*1000*Y256","v":1.591190221110276},{"$f":"D$14*B256*(8^3-2*8*B256^2+B256^3)/24/('Steel Eurocode 3'!E$10*'Steel Eurocode 3'!X$8)*100*1000","v":10.938232968574768},null,131.78936661333319,159.27620403199987,3.4238583226308576E-6,1.334058382008727E-5,2.8685628081060757E-5,4.7684743753370523E-5,null,0.34492958252022299,0.66083880599338318,{"$f":"C$17*$E$6/(6*8*'Steel Eurocode 3'!$X$8*'Steel Eurocode 3'!$E$10)*100*1000*AK256","v":0.68691813971589732},{"$f":"C$18*E$7/(6*8*'Steel Eurocode 3'!X$8*'Steel Eurocode 3'!E$10)*100*1000*Y256","v":0.55345746821226982},{"$f":"C$14*B256*(8^3-2*8*B256^2+B256^3)/24/('Steel Eurocode 3'!E$10*'Steel Eurocode 3'!X$8)*100*1000","v":3.5839557564137503},null,131.78936661333319,159.27620403199987,1.1909072426542111E-6,4.6402030678564412E-6,9.9776097673254787E-6,1.6585997827259311E-5]
[178,5.6640000000000041,-463.45254950399953,-112.86712800000018,-17.234981003195109,-17.234981003195109,-5.776172507279119,-7.6640625,-17.8828125,-25.546875,10.21875,{"$f":"'Graph Properties'!C$3*8/2-B257*C$3","v":-71.992128000000179},17.903249999999968,41.774249999999924,59.677499999999888,57.87900000000004,{"$f":"C$3*8/2*'Graph Properties'!B257-'Graph Properties'!C$3*B257^2/2","v":286.21854950399972},0.98090621732966254,1.8803845985600289,{"$f":"D$17*$E$6/(6*8*'Steel Eurocode 3'!$X$8*'Steel Eurocode 3'!$E$10)*100*1000*X257","v":1.9569841136407837},{"$f":"D$18*E$7/(6*8*'Steel Eurocode 3'!X$8*'Steel Eurocode 3'!E$10)*100*1000*Y257","v":1.5797775051288454},{"$f":"D$14*B257*(8^3-2*8*B257^2+B257^3)/24/('Steel Eurocode 3'!E$10*'Steel Eurocode 3'!X$8)*100*1000","v":10.836928568535789},null,130.59448490666648,158.13380505599986,3.3863721268729278E-6,1.3195434300169553E-5,2.8377023897923404E-5,4.7180869883523692E-5,null,0.34118477124509994,0.65404681689044486,{"$f":"C$17*$E$6/(6*8*'Steel Eurocode 3'!$X$8*'Steel Eurocode 3'!$E$10)*100*1000*AK257","v":0.68069012648375082},{"$f":"C$18*E$7/(6*8*'Steel Eurocode 3'!X$8*'Steel Eurocode 3'!E$10)*100*1000*Y257","v":0.54948782787090267},{"$f":"C$14*B257*(8^3-2*8*B257^2+B257^3)/24/('Steel Eurocode 3'!E$10*'Steel Eurocode 3'!X$8)*100*1000","v":3.550762964788921},null,130.59448490666648,158.13380505599986,1.1778685658688442E-6,4.5897162783198441E-6,9.8702691818863997E-6,1.6410737350790848E-5]
[179,5.6960000000000042,-459.81864998399953,-114.25159200000019,-17.071276276636041,-17.071276276636041,-5.7213100351272281,-7.6640625,-17.8828125,-25.546875,10.21875,{"$f":"'Graph Properties'!C$3*8/2-B258*C$3","v":-73.376592000000187},17.657999999999969,41.201999999999927,58.8599999999999,58.206000000000046,{"$f":"C$3*8/2*'Graph Properties'!B258-'Graph Properties'!C$3*B258^2/2","v":283.89264998399972},0.97003234826119455,1.8606067110332727,{"$f":"D$17*$E$6/(6*8*'Steel Eurocode 3'!$X$8*'Steel Eurocode 3'!$E$10)*100*1000*X258","v":1.9387201200900661},{"$f":"D$18*E$7/(6*8*'Steel Eurocode 3'!X$8*'Steel Eurocode 3'!E$10)*100*1000*Y258","v":1.5680171364078603},{"$f":"D$14*B258*(8^3-2*8*B258^2+B258^3)/24/('Steel Eurocode 3'!E$10*'Steel Eurocode 3'!X$8)*100*1000","v":10.733899960843646},null,129.37568255999989,156.95660646399986,3.3485274756067001E-6,1.3048850958218645E-5,2.8065193615211367E-5,4.6671260725544095E-5,null,0.33740255591693719,0.64716755166374706,{"$f":"C$17*$E$6/(6*8*'Steel Eurocode 3'!$X$8*'Steel Eurocode 3'!$E$10)*100*1000*AK258","v":0.67433743307480554},{"$f":"C$18*E$7/(6*8*'Steel Eurocode 3'!X$8*'Steel Eurocode 3'!E$10)*100*1000*Y258","v":0.54539726483751649},{"$f":"C$14*B258*(8^3-2*8*B258^2+B258^3)/24/('Steel Eurocode 3'!E$10*'Steel Eurocode 3'!X$8)*100*1000","v":3.517005229634222},null,129.37568255999989,156.95660646399986,1.1647052089066781E-6,4.5387307680760501E-6,9.7618064748561265E-6,1.6233481991493598E-5]
[180,5.7280000000000042,-456.14044761599939,-115.63605600000017,-16.90480464684649,-16.90480464684649,-5.6655196600792745,-7.6640625,-17.8828125,-25.546875,10.21875,{"$f":"'Graph Properties'!C$3*8/2-B259*C$3","v":-74.761056000000167},17.412749999999967,40.629749999999923,58.04249999999989,58.533000000000044,{"$f":"C$3*8/2*'Graph Properties'!B259-'Graph Properties'!C$3*B259^2/2","v":281.52244761599957},0.9590524156450656,1.8405813418953081,{"$f":"D$17*$E$6/(6*8*'Steel Eurocode 3'!$X$8*'Steel Eurocode 3'!$E$10)*100*1000*X259","v":1.9201025813804773},{"$f":"D$18*E$7/(6*8*'Steel Eurocode 3'!X$8*'Steel Eurocode 3'!E$10)*100*1000*Y259","v":1.5559071508075488},{"$f":"D$14*B259*(8^3-2*8*B259^2+B259^3)/24/('Steel Eurocode 3'!E$10*'Steel Eurocode 3'!X$8)*100*1000","v":10.629161157118091},null,128.13328725333315,155.74441164799984,3.3103292791816033E-6,1.290085343563226E-5,2.7750181426069511E-5,4.6155994845022593E-5,null,0.33358344892002284,0.64020220587662868,{"$f":"C$17*$E$6/(6*8*'Steel Eurocode 3'!$X$8*'Steel Eurocode 3'!$E$10)*100*1000*AK259","v":0.66786176743668768},{"$f":"C$18*E$7/(6*8*'Steel Eurocode 3'!X$8*'Steel Eurocode 3'!E$10)*100*1000*Y259","v":0.5411850959330603},{"$f":"C$14*B259*(8^3-2*8*B259^2+B259^3)/24/('Steel Eurocode 3'!E$10*'Steel Eurocode 3'!X$8)*100*1000","v":3.4826871419128747},null,128.13328725333315,155.74441164799984,1.1514188797153402E-6,4.4872533689155685E-6,9.6522370177633076E-6,1.6054259076529594E-5]
[181,5.7600000000000042,-452.41794239999945,-117.02052000000018,-16.735588248893318,-16.735588248893318,-5.6088087932616055,-7.6640625,-17.8828125,-25.546875,10.21875,{"$f":"'Graph Properties'!C$3*8/2-B260*C$3","v":-76.145520000000175},17.167499999999968,40.057499999999926,57.224999999999895,58.860000000000042,{"$f":"C$3*8/2*'Graph Properties'!B260-'Graph Properties'!C$3*B260^2/2","v":279.10794239999962},0.94796789258610492,1.8203119283907352,{"$f":"D$17*$E$6/(6*8*'Steel Eurocode 3'!$X$8*'Steel Eurocode 3'!$E$10)*100*1000*X260","v":1.9011364078614499},{"$f":"D$18*E$7/(6*8*'Steel Eurocode 3'!X$8*'Steel Eurocode 3'!E$10)*100*1000*Y260","v":1.5434455841881398},{"$f":"D$14*B260*(8^3-2*8*B260^2+B260^3)/24/('Steel Eurocode 3'!E$10*'Steel Eurocode 3'!X$8)*100*1000","v":10.522726435866888},null,126.86762666666652,154.49702399999984,3.2717824479470668E-6,1.2751461373808116E-5,2.7432031523642689E-5,4.5635150807550041E-5,null,0.32972796263864512,0.63315197509242926,{"$f":"C$17*$E$6/(6*8*'Steel Eurocode 3'!$X$8*'Steel Eurocode 3'!$E$10)*100*1000*AK260","v":0.66126483751702592},{"$f":"C$18*E$7/(6*8*'Steel Eurocode 3'!X$8*'Steel Eurocode 3'!E$10)*100*1000*Y260","v":0.53685063797848331},{"$f":"C$14*B260*(8^3-2*8*B260^2+B260^3)/24/('Steel Eurocode 3'!E$10*'Steel Eurocode 3'!X$8)*100*1000","v":3.4478133800350217},null,126.86762666666652,154.49702399999984,1.1380112862424579E-6,4.435290912628909E-6,9.5415761821365879E-6,1.5873095933060881E-5]
[182,5.7920000000000043,-448.65113433599959,-118.40498400000018,-16.563649484731336,-16.563649484731336,-5.5511849332474839,-7.6640625,-17.8828125,-25.546875,10.21875,{"$f":"'Graph Properties'!C$3*8/2-B261*C$3","v":-77.529984000000184},16.922249999999966,39.485249999999922,56.407499999999885,59.18700000000004,{"$f":"C$3*8/2*'Graph Properties'!B261-'Graph Properties'!C$3*B261^2/2","v":276.64913433599975},0.93678025218914052,1.7998019077641541,{"$f":"D$17*$E$6/(6*8*'Steel Eurocode 3'!$X$8*'Steel Eurocode 3'!$E$10)*100*1000*X261","v":1.8818265098824101},{"$f":"D$18*E$7/(6*8*'Steel Eurocode 3'!X$8*'Steel Eurocode 3'!E$10)*100*1000*Y261","v":1.5306304724098614},{"$f":"D$14*B261*(8^3-2*8*B261^2+B261^3)/24/('Steel Eurocode 3'!E$10*'Steel Eurocode 3'!X$8)*100*1000","v":10.414610342485769},null,125.57902847999986,153.21424691199982,3.2328918922525177E-6,1.2600694414143922E-5,2.7110788101075762E-5,4.5108807178717301E-5,null,0.32583660945709225,0.62601805487448825,{"$f":"C$17*$E$6/(6*8*'Steel Eurocode 3'!$X$8*'Steel Eurocode 3'!$E$10)*100*1000*AK261","v":0.6545483512634469},{"$f":"C$18*E$7/(6*8*'Steel Eurocode 3'!X$8*'Steel Eurocode 3'!E$10)*100*1000*Y261","v":0.53239320779473431},{"$f":"C$14*B261*(8^3-2*8*B261^2+B261^3)/24/('Steel Eurocode 3'!E$10*'Steel Eurocode 3'!X$8)*100*1000","v":3.4123887098577219},null,125.57902847999986,153.21424691199982,1.1244841364356583E-6,4.382850231006581E-6,9.4298393395046127E-6,1.5690019888249495E-5]
[183,5.8240000000000043,-444.84002342399947,-119.78944800000019,-16.389011023203373,-16.389011023203373,-5.4926556660570913,-7.6640625,-17.8828125,-25.546875,10.21875,{"$f":"'Graph Properties'!C$3*8/2-B262*C$3","v":-78.914448000000192},16.676999999999968,38.912999999999926,55.589999999999897,59.514000000000046,{"$f":"C$3*8/2*'Graph Properties'!B262-'Graph Properties'!C$3*B262^2/2","v":274.14602342399962},0.92549096755900118,1.7790547172601652,{"$f":"D$17*$E$6/(6*8*'Steel Eurocode 3'!$X$8*'Steel Eurocode 3'!$E$10)*100*1000*X262","v":1.862177797792786},{"$f":"D$18*E$7/(6*8*'Steel Eurocode 3'!X$8*'Steel Eurocode 3'!E$10)*100*1000*Y262","v":1.5174598513329425},{"$f":"D$14*B262*(8^3-2*8*B262^2+B262^3)/24/('Steel Eurocode 3'!E$10*'Steel Eurocode 3'!X$8)*100*1000","v":10.304827689258477},null,124.26782037333311,151.89588377599981,3.1936625224473861E-6,1.2448572198037397E-5,2.6786495351513589E-5,4.4577042524115241E-5,null,0.32190990175965251,0.6188016407861443,{"$f":"C$17*$E$6/(6*8*'Steel Eurocode 3'!$X$8*'Steel Eurocode 3'!$E$10)*100*1000*AK262","v":0.64771401662357764},{"$f":"C$18*E$7/(6*8*'Steel Eurocode 3'!X$8*'Steel Eurocode 3'!E$10)*100*1000*Y262","v":0.52781212220276252},{"$f":"C$14*B262*(8^3-2*8*B262^2+B262^3)/24/('Steel Eurocode 3'!E$10*'Steel Eurocode 3'!X$8)*100*1000","v":3.3764179846849545},null,124.26782037333311,151.89588377599981,1.110839138242569E-6,4.329938155839094E-6,9.3170418613960303E-6,1.5505058269257473E-5]
[184,5.8560000000000043,-440.98460966399955,-121.17391200000017,-16.21169580004026,-16.21169580004026,-5.433228665157527,-7.6640625,-17.8828125,-25.546875,10.21875,{"$f":"'Graph Properties'!C$3*8/2-B263*C$3","v":-80.298912000000172},16.431749999999965,38.340749999999922,54.772499999999894,59.841000000000044,{"$f":"C$3*8/2*'Graph Properties'!B263-'Graph Properties'!C$3*B263^2/2","v":271.5986096639997},0.91410151180051569,1.7580737941233677,{"$f":"D$17*$E$6/(6*8*'Steel Eurocode 3'!$X$8*'Steel Eurocode 3'!$E$10)*100*1000*X263","v":1.8421951819420093},{"$f":"D$18*E$7/(6*8*'Steel Eurocode 3'!X$8*'Steel Eurocode 3'!E$10)*100*1000*Y263","v":1.5039317568176118},{"$f":"D$14*B263*(8^3-2*8*B263^2+B263^3)/24/('Steel Eurocode 3'!E$10*'Steel Eurocode 3'!X$8)*100*1000","v":10.193393555356757},null,122.93433002666646,150.54173798399984,3.1540992488811004E-6,1.2295114366886257E-5,2.6459197468101033E-5,4.403993540933471E-5,null,0.3179483519306141,0.61150392839073664,{"$f":"C$17*$E$6/(6*8*'Steel Eurocode 3'!$X$8*'Steel Eurocode 3'!$E$10)*100*1000*AK263","v":0.64076354154504667},{"$f":"C$18*E$7/(6*8*'Steel Eurocode 3'!X$8*'Steel Eurocode 3'!E$10)*100*1000*Y263","v":0.52310669802351706},{"$f":"C$14*B263*(8^3-2*8*B263^2+B263^3)/24/('Steel Eurocode 3'!E$10*'Steel Eurocode 3'!X$8)*100*1000","v":3.3399061452676126},null,122.93433002666646,150.54173798399984,1.0970779996108174E-6,4.2765615189169583E-6,9.2031991193394892E-6,1.5318238403246856E-5]
[185,5.8880000000000043,-437.08489305599937,-122.55837600000018,-16.031727017860803,-16.031727017860803,-5.3729116914628108,-7.6640625,-17.8828125,-25.546875,10.21875,{"$f":"'Graph Properties'!C$3*8/2-B264*C$3","v":-81.68337600000018},16.186499999999967,37.768499999999925,53.954999999999892,60.168000000000042,{"$f":"C$3*8/2*'Graph Properties'!B264-'Graph Properties'!C$3*B264^2/2","v":269.00689305599951},0.90261335801851228,1.7368625755983631,{"$f":"D$17*$E$6/(6*8*'Steel Eurocode 3'!$X$8*'Steel Eurocode 3'!$E$10)*100*1000*X264","v":1.8218835726795073},{"$f":"D$18*E$7/(6*8*'Steel Eurocode 3'!X$8*'Steel Eurocode 3'!E$10)*100*1000*Y264","v":1.4900442247240968},{"$f":"D$14*B264*(8^3-2*8*B264^2+B264^3)/24/('Steel Eurocode 3'!E$10*'Steel Eurocode 3'!X$8)*100*1000","v":10.080323286840322},null,121.57888511999982,149.15161292799979,3.1142069819030887E-6,1.2140340562088212E-5,2.6128938643982938E-5,4.3497564399966569E-5,null,0.31395247235426521,0.60412611325160459,{"$f":"C$17*$E$6/(6*8*'Steel Eurocode 3'!$X$8*'Steel Eurocode 3'!$E$10)*100*1000*AK264","v":0.63369863397548076},{"$f":"C$18*E$7/(6*8*'Steel Eurocode 3'!X$8*'Steel Eurocode 3'!E$10)*100*1000*Y264","v":0.51827625207794659},{"$f":"C$14*B264*(8^3-2*8*B264^2+B264^3)/24/('Steel Eurocode 3'!E$10*'Steel Eurocode 3'!X$8)*100*1000","v":3.3028582198035132},null,121.57888511999982,149.15161292799979,1.0832024284880307E-6,4.2227271520306826E-6,9.0883264848636295E-6,1.5129587617379675E-5]
[186,5.9200000000000044,-433.14087359999922,-123.94284000000016,-15.849128146171825,-15.849128146171825,-5.3117125933338807,-7.6640625,-17.8828125,-25.546875,10.21875,{"$f":"'Graph Properties'!C$3*8/2-B265*C$3","v":-83.06784000000016},15.941249999999966,37.196249999999921,53.137499999999882,60.495000000000047,{"$f":"C$3*8/2*'Graph Properties'!B265-'Graph Properties'!C$3*B265^2/2","v":266.37087359999941},0.89102797931782007,1.7154244989297498,{"$f":"D$17*$E$6/(6*8*'Steel Eurocode 3'!$X$8*'Steel Eurocode 3'!$E$10)*100*1000*X265","v":1.8012478803547076},{"$f":"D$18*E$7/(6*8*'Steel Eurocode 3'!X$8*'Steel Eurocode 3'!E$10)*100*1000*Y265","v":1.4757952909126268},{"$f":"D$14*B265*(8^3-2*8*B265^2+B265^3)/24/('Steel Eurocode 3'!E$10*'Steel Eurocode 3'!X$8)*100*1000","v":9.9656324966569194},null,120.20181333333312,147.72531199999978,3.0739906318627803E-6,1.1984270425040982E-5,2.5795763072304183E-5,4.295000806160168E-5,null,0.30992277541489399,0.59666939093208693,{"$f":"C$17*$E$6/(6*8*'Steel Eurocode 3'!$X$8*'Steel Eurocode 3'!$E$10)*100*1000*AK265","v":0.62652100186250692},{"$f":"C$18*E$7/(6*8*'Steel Eurocode 3'!X$8*'Steel Eurocode 3'!E$10)*100*1000*Y265","v":0.51332010118700055},{"$f":"C$14*B265*(8^3-2*8*B265^2+B265^3)/24/('Steel Eurocode 3'!E$10*'Steel Eurocode 3'!X$8)*100*1000","v":3.2652793239373921},null,120.20181333333312,147.72531199999978,1.0692141328218366E-6,4.1684418869707763E-6,8.9724393294971064E-6,1.4939133238817976E-5]
[187,5.9520000000000044,-429.15255129599944,-125.3273040000002,-15.663922921368133,-15.663922921368133,-5.249639306578592,-7.6640625,-17.8828125,-25.546875,10.21875,{"$f":"'Graph Properties'!C$3*8/2-B266*C$3","v":-84.452304000000197},15.695999999999966,36.623999999999924,52.319999999999879,60.822000000000045,{"$f":"C$3*8/2*'Graph Properties'!B266-'Graph Properties'!C$3*B266^2/2","v":263.69055129599963},0.87934684880326752,1.6937630013621301,{"$f":"D$17*$E$6/(6*8*'Steel Eurocode 3'!$X$8*'Steel Eurocode 3'!$E$10)*100*1000*X266","v":1.7802930153170404},{"$f":"D$18*E$7/(6*8*'Steel Eurocode 3'!X$8*'Steel Eurocode 3'!E$10)*100*1000*Y266","v":1.4611829912434309},{"$f":"D$14*B266*(8^3-2*8*B266^2+B266^3)/24/('Steel Eurocode 3'!E$10*'Steel Eurocode 3'!X$8)*100*1000","v":9.8493370646422633},null,118.80344234666646,146.2626385919998,3.0334551091096043E-6,1.182692359714228E-5,2.545971494620961E-5,4.239734495983091E-5,null,0.30585977349678867,0.58913495699552332,{"$f":"C$17*$E$6/(6*8*'Steel Eurocode 3'!$X$8*'Steel Eurocode 3'!$E$10)*100*1000*AK266","v":0.61923235315375313},{"$f":"C$18*E$7/(6*8*'Steel Eurocode 3'!X$8*'Steel Eurocode 3'!E$10)*100*1000*Y266","v":0.50823756217162797},{"$f":"C$14*B266*(8^3-2*8*B266^2+B266^3)/24/('Steel Eurocode 3'!E$10*'Steel Eurocode 3'!X$8)*100*1000","v":3.2271746607608987},null,118.80344234666646,146.2626385919998,1.0551148205598624E-6,4.113712555527749E-6,8.8555530247685598E-6,1.4746902594723792E-5]
[188,5.9840000000000044,-425.11992614399941,-126.71176800000018,-15.476135346732526,-15.476135346732526,-5.18669985445172,-7.6640625,-17.8828125,-25.546875,10.21875,{"$f":"'Graph Properties'!C$3*8/2-B267*C$3","v":-85.836768000000177},15.450749999999966,36.05174999999992,51.502499999999891,61.149000000000044,{"$f":"C$3*8/2*'Graph Properties'!B267-'Graph Properties'!C$3*B267^2/2","v":260.96592614399958},0.86757143957968341,1.6718815201401018,{"$f":"D$17*$E$6/(6*8*'Steel Eurocode 3'!$X$8*'Steel Eurocode 3'!$E$10)*100*1000*X267","v":1.7590238879159343},{"$f":"D$18*E$7/(6*8*'Steel Eurocode 3'!X$8*'Steel Eurocode 3'!E$10)*100*1000*Y267","v":1.4462053615767365},{"$f":"D$14*B267*(8^3-2*8*B267^2+B267^3)/24/('Steel Eurocode 3'!E$10*'Steel Eurocode 3'!X$8)*100*1000","v":9.7314531375200701},null,117.38409983999981,144.76339609599981,2.9926053239929893E-6,1.1668319719789822E-5,2.5120838458844089E-5,4.183965366024511E-5,null,0.30176397898423757,0.58152400700525275,{"$f":"C$17*$E$6/(6*8*'Steel Eurocode 3'!$X$8*'Steel Eurocode 3'!$E$10)*100*1000*AK267","v":0.61183439579684662},{"$f":"C$18*E$7/(6*8*'Steel Eurocode 3'!X$8*'Steel Eurocode 3'!E$10)*100*1000*Y267","v":0.50302795185277782},{"$f":"C$14*B267*(8^3-2*8*B267^2+B267^3)/24/('Steel Eurocode 3'!E$10*'Steel Eurocode 3'!X$8)*100*1000","v":3.1885495208126051},null,117.38409983999981,144.76339609599981,1.0409061996497353E-6,4.0585459894921109E-6,8.7376829422066383E-6,1.4552923012259166E-5]
[189,6.0160000000000045,-420.3889981439994,-168.97123200000021,-15.285789856114118,-15.285789856114118,-5.1229024045865419,-7.6640625,-17.8828125,-25.546875,-30.65625,{"$f":"'Graph Properties'!C$3*8/2-B268*C$3","v":-87.221232000000214},15.205499999999965,35.479499999999923,50.684999999999889,60.821999999999868,{"$f":"C$3*8/2*'Graph Properties'!B268-'Graph Properties'!C$3*B268^2/2","v":258.19699814399974},0.85570322475189575,1.6497834925082677,{"$f":"D$17*$E$6/(6*8*'Steel Eurocode 3'!$X$8*'Steel Eurocode 3'!$E$10)*100*1000*X268","v":1.7374454085008177},{"$f":"D$18*E$7/(6*8*'Steel Eurocode 3'!X$8*'Steel Eurocode 3'!E$10)*100*1000*Y268","v":1.4308606014510865},{"$f":"D$14*B268*(8^3-2*8*B268^2+B268^3)/24/('Steel Eurocode 3'!E$10*'Steel Eurocode 3'!X$8)*100*1000","v":9.6119971289020487},null,115.94411349333316,143.2274042879998,2.9514461868623637E-6,1.1508478434381321E-5,2.477917780335247E-5,4.1277012728435146E-5,null,0.29763590426152892,0.57383773652461456,{"$f":"C$17*$E$6/(6*8*'Steel Eurocode 3'!$X$8*'Steel Eurocode 3'!$E$10)*100*1000*AK268","v":0.60432883773941481},{"$f":"C$18*E$7/(6*8*'Steel Eurocode 3'!X$8*'Steel Eurocode 3'!E$10)*100*1000*Y268","v":0.49769064398298651},{"$f":"C$14*B268*(8^3-2*8*B268^2+B268^3)/24/('Steel Eurocode 3'!E$10*'Steel Eurocode 3'!X$8)*100*1000","v":3.1494092820779978},null,115.94411349333316,143.2274042879998,1.0265899780390829E-6,4.0029490206543717E-6,8.6188444533399886E-6,1.4357221818586135E-5]
[190,6.0480000000000045,-414.95976729599926,-170.35569600000019,-15.092914914851244,-15.092914914851244,-5.0582565214897759,-7.6640625,-17.8828125,-25.546875,-30.65625,{"$f":"'Graph Properties'!C$3*8/2-B269*C$3","v":-88.605696000000194},14.960249999999967,34.90724999999992,49.867499999999886,59.840999999999866,{"$f":"C$3*8/2*'Graph Properties'!B269-'Graph Properties'!C$3*B269^2/2","v":255.38376729599963},0.84374367742473344,1.6274723557112247,{"$f":"D$17*$E$6/(6*8*'Steel Eurocode 3'!$X$8*'Steel Eurocode 3'!$E$10)*100*1000*X269","v":1.7155624874211195},{"$f":"D$18*E$7/(6*8*'Steel Eurocode 3'!X$8*'Steel Eurocode 3'!E$10)*100*1000*Y269","v":1.4151506750062528},{"$f":"D$14*B269*(8^3-2*8*B269^2+B269^3)/24/('Steel Eurocode 3'!E$10*'Steel Eurocode 3'!X$8)*100*1000","v":9.490985719287913},null,114.48381098666653,141.6548597759998,2.9099826080671558E-6,1.1347419382314492E-5,2.4434777172879613E-5,4.070950072999186E-5,null,0.29347606171295076,0.56607734111694774,{"$f":"C$17*$E$6/(6*8*'Steel Eurocode 3'!$X$8*'Steel Eurocode 3'!$E$10)*100*1000*AK269","v":0.59671738692908505},{"$f":"C$18*E$7/(6*8*'Steel Eurocode 3'!X$8*'Steel Eurocode 3'!E$10)*100*1000*Y269","v":0.49222632174130526},{"$f":"C$14*B269*(8^3-2*8*B269^2+B269^3)/24/('Steel Eurocode 3'!E$10*'Steel Eurocode 3'!X$8)*100*1000","v":3.1097594099894872},null,114.48381098666653,141.6548597759998,1.0121678636755323E-6,3.9469284808050398E-6,8.4990529296972558E-6,1.4159826340866733E-5]
[191,6.0800000000000045,-409.48623359999914,-171.74016000000017,-14.897543019771465,-14.897543019771465,-4.9927731665415624,-7.6640625,-17.8828125,-25.546875,-30.65625,{"$f":"'Graph Properties'!C$3*8/2-B270*C$3","v":-89.990160000000174},14.714999999999966,34.334999999999923,49.049999999999876,58.859999999999857,{"$f":"C$3*8/2*'Graph Properties'!B270-'Graph Properties'!C$3*B270^2/2","v":252.5262335999995},0.8316942707030256,1.6049515469935758,{"$f":"D$17*$E$6/(6*8*'Steel Eurocode 3'!$X$8*'Steel Eurocode 3'!$E$10)*100*1000*X270","v":1.6933800350262667},{"$f":"D$18*E$7/(6*8*'Steel Eurocode 3'!X$8*'Steel Eurocode 3'!E$10)*100*1000*Y270","v":1.3990813109832356},{"$f":"D$14*B270*(8^3-2*8*B270^2+B270^3)/24/('Steel Eurocode 3'!E$10*'Steel Eurocode 3'!X$8)*100*1000","v":9.3684358560653624},null,113.00351999999978,140.0463359999998,2.8682194979567951E-6,1.1185162204987051E-5,2.4087680760570377E-5,4.0137196230506134E-5,null,0.28928496372279144,0.5582440163455914,{"$f":"C$17*$E$6/(6*8*'Steel Eurocode 3'!$X$8*'Steel Eurocode 3'!$E$10)*100*1000*AK270","v":0.58900175131348398},{"$f":"C$18*E$7/(6*8*'Steel Eurocode 3'!X$8*'Steel Eurocode 3'!E$10)*100*1000*Y270","v":0.48663697773329923},{"$f":"C$14*B270*(8^3-2*8*B270^2+B270^3)/24/('Steel Eurocode 3'!E$10*'Steel Eurocode 3'!X$8)*100*1000","v":3.069605457426396},null,113.00351999999978,140.0463359999998,9.9764156450671119E-7,3.8904912017346258E-6,8.3783237428070867E-6,1.3960763906263001E-5]
[192,6.1120000000000045,-403.96839705599928,-173.12462400000021,-14.699707098268663,-14.699707098268663,-4.9264634455005609,-7.6640625,-17.8828125,-25.546875,-30.65625,{"$f":"'Graph Properties'!C$3*8/2-B271*C$3","v":-91.37462400000021},14.469749999999966,33.762749999999919,48.232499999999888,57.878999999999856,{"$f":"C$3*8/2*'Graph Properties'!B271-'Graph Properties'!C$3*B271^2/2","v":249.62439705599968},0.81955647769160023,1.5822245035999192,{"$f":"D$17*$E$6/(6*8*'Steel Eurocode 3'!$X$8*'Steel Eurocode 3'!$E$10)*100*1000*X271","v":1.6709029616656903},{"$f":"D$18*E$7/(6*8*'Steel Eurocode 3'!X$8*'Steel Eurocode 3'!E$10)*100*1000*Y271","v":1.3826584018013484},{"$f":"D$14*B271*(8^3-2*8*B271^2+B271^3)/24/('Steel Eurocode 3'!E$10*'Steel Eurocode 3'!X$8)*100*1000","v":9.244364753510105},null,111.5035682133331,138.40242278399973,2.8261617668807103E-6,1.1021726543796713E-5,2.3737932759569626E-5,3.9560177795568816E-5,null,0.28506312267533918,0.55033895777388475,{"$f":"C$17*$E$6/(6*8*'Steel Eurocode 3'!$X$8*'Steel Eurocode 3'!$E$10)*100*1000*AK271","v":0.58118363884024016},{"$f":"C$18*E$7/(6*8*'Steel Eurocode 3'!X$8*'Steel Eurocode 3'!E$10)*100*1000*Y271","v":0.48092466149612112},{"$f":"C$14*B271*(8^3-2*8*B271^2+B271^3)/24/('Steel Eurocode 3'!E$10*'Steel Eurocode 3'!X$8)*100*1000","v":3.0289530647149756},null,111.5035682133331,138.40242278399973,9.8301278848024689E-7,3.8336440152336389E-6,8.2566722641981314E-6,1.3760061841936979E-5]
[193,6.1440000000000046,-398.4062576639991,-174.50908800000019,-14.499440344624693,-14.499440344624693,-4.8593385515723355,-7.6640625,-17.8828125,-25.546875,-30.65625,{"$f":"'Graph Properties'!C$3*8/2-B272*C$3","v":-92.75908800000019},{"$f":"IF(B272>D$4, IF(B272<(D$4+E$4),G$4*B272-C$4/2*(B272-D$4)^2,-(8-B272)*H$4),G$4*B272)","v":14.224499999999965},{"$f":"IF(B272>D$5, IF(B272<(D$5+E$5),G$5*B272-C$5/2*(B272-D$5)^2,-(8-B272)*H$5),G$5*B272)","v":33.190499999999915},47.414999999999885,56.897999999999861,{"$f":"C$3*8/2*'Graph Properties'!B272-'Graph Properties'!C$3*B272^2/2","v":246.67825766399949},0.80733177149528623,1.5592946627748561,{"$f":"D$17*$E$6/(6*8*'Steel Eurocode 3'!$X$8*'Steel Eurocode 3'!$E$10)*100*1000*X272","v":1.6481361776888195},{"$f":"D$18*E$7/(6*8*'Steel Eurocode 3'!X$8*'Steel Eurocode 3'!E$10)*100*1000*Y272","v":1.3658878398799079},{"$f":"D$14*B272*(8^3-2*8*B272^2+B272^3)/24/('Steel Eurocode 3'!E$10*'Steel Eurocode 3'!X$8)*100*1000","v":9.1187898927858235},null,{"$f":"IF(B272<D$6,B272*(8^2-B272^2-E$6^2),8/E$6*(B272-D$6)^3+(8^2-E$6^2)*B272-B272^3)","v":109.98428330666647},{"$f":"IF(B272<D$7,B272*(8^2-B272^2-E$7^2),8/E$7*(B272-D$7)^3+(8^2-E$7^2)*B272-B272^3)","v":136.72370995199978},{"$f":"IF(B272<D$4,B272*D$15/(24*K$2*K$3)*((D$4^2)*(2*K$2-D$4)^2-2*(D$4*B272^2)*(2*K$2-D$4)+K$2*B272^3),D$15/(24*K$2*K$3)*(D$4^2*(K$2-B272))*(4*B272*K$2-2*B272^2-D$4^2))","v":2.7838143251883298E-6},{"$f":"IF(B272<I$4,B272*D$15/(24*K$2*K$3)*((I$4^2)*(2*K$2-I$4)^2-2*(I$4*B272^2)*(2*K$2-I$4)+K$2*B272^3),D$15/(24*K$2*K$3)*(I$4^2*(K$2-B272))*(4*B272*K$2-2*B272^2-I$4^2))","v":1.0857132040141194E-5},{"$f":"IF(B272<D$5,B272*D$16/(24*K$2*K$3)*((D$5^2)*(2*K$2-D$5)^2-2*(D$5*B272^2)*(2*K$2-D$5)+K$2*B272^3),D$16/(24*K$2*K$3)*(D$5^2*(K$2-B272))*(4*B272*K$2-2*B272^2-D$5^2))","v":2.3385577363022213E-5},{"$f":"IF(B272<I$5,B272*D$16/(24*K$2*K$3)*((I$5^2)*(2*K$2-I$5)^2-2*(I$5*B272^2)*(2*K$2-I$5)+K$2*B272^3),D$16/(24*K$2*K$3)*(I$5^2*(K$2-B272))*(4*B272*K$2-2*B272^2-I$5^2))","v":3.8978523990770775E-5},null,0.28081105095488218,0.54236336096516713,{"$f":"C$17*$E$6/(6*8*'Steel Eurocode 3'!$X$8*'Steel Eurocode 3'!$E$10)*100*1000*AK272","v":0.57326475745698069},{"$f":"C$18*E$7/(6*8*'Steel Eurocode 3'!X$8*'Steel Eurocode 3'!E$10)*100*1000*Y272","v":0.47509142256692438},{"$f":"C$14*B272*(8^3-2*8*B272^2+B272^3)/24/('Steel Eurocode 3'!E$10*'Steel Eurocode 3'!X$8)*100*1000","v":2.9878079596283813},null,{"$f":"IF(B272<D$6,B272*(8^2-B272^2-E$6^2),8/E$6*(B272-D$6)^3+(8^2-E$6^2)*B272-B272^3)","v":109.98428330666647},{"$f":"IF(B272<D$7,B272*(8^2-B272^2-E$7^2),8/E$7*(B272-D$7)^3+(8^2-E$7^2)*B272-B272^3)","v":136.72370995199978},{"$f":"IF(B272<D$4,B272*C$15/(24*K$2*K$3)*((D$4^2)*(2*K$2-D$4)^2-2*(D$4*B272^2)*(2*K$2-D$4)+K$2*B272^3),C$15/(24*K$2*K$3)*(D$4^2*(K$2-B272))*(4*B272*K$2-2*B272^2-D$4^2))","v":9.6828324354376677E-7},{"$f":"IF(B272<I$4,B272*C$15/(24*K$2*K$3)*((I$4^2)*(2*K$2-I$4)^2-2*(I$4*B272^2)*(2*K$2-I$4)+K$2*B272^3),C$15/(24*K$2*K$3)*(I$4^2*(K$2-B272))*(4*B272*K$2-2*B272^2-I$4^2))","v":3.7763937530925888E-6},{"$f":"IF(B272<D$5,B272*C$16/(24*K$2*K$3)*((D$5^2)*(2*K$2-D$5)^2-2*(D$5*B272^2)*(2*K$2-D$5)+K$2*B272^3),C$16/(24*K$2*K$3)*(D$5^2*(K$2-B272))*(4*B272*K$2-2*B272^2-D$5^2))","v":8.1341138653990317E-6},{"$f":"IF(B272<I$5,B272*C$16/(24*K$2*K$3)*((I$5^2)*(2*K$2-I$5)^2-2*(I$5*B272^2)*(2*K$2-I$5)+K$2*B272^3),C$16/(24*K$2*K$3)*(I$5^2*(K$2-B272))*(4*B272*K$2-2*B272^2-I$5^2))","v":1.3557747475050703E-5}]
[194,{"$f":"B272+8/250","v":6.1760000000000046},-392.79981542399912,-175.89355200000017,-14.29677622000942,-14.29677622000942,-4.7914097654093819,-7.6640625,-17.8828125,-25.546875,-30.65625,{"$f":"'Graph Properties'!C$3*8/2-B273*C$3","v":-94.14355200000017},13.979249999999965,32.618249999999918,46.597499999999883,55.916999999999859,{"$f":"C$3*8/2*'Graph Properties'!B273-'Graph Properties'!C$3*B273^2/2","v":243.6878154239995},0.79502162521891251,1.5361654617629856,{"$f":"D$17*$E$6/(6*8*'Steel Eurocode 3'!$X$8*'Steel Eurocode 3'!$E$10)*100*1000*X273","v":1.6250845934450813},{"$f":"D$18*E$7/(6*8*'Steel Eurocode 3'!X$8*'Steel Eurocode 3'!E$10)*100*1000*Y273","v":1.3487755176382268},{"$f":"D$14*B273*(8^3-2*8*B273^2+B273^3)/24/('Steel Eurocode 3'!E$10*'Steel Eurocode 3'!X$8)*100*1000","v":8.991729021944213},null,108.44599295999981,135.01078732799979,2.7411820832290822E-6,1.0691398335418207E-5,2.3030658764073004E-5,3.8392313381702859E-5,null,0.27652926094570868,0.53431842148277775,{"$f":"C$17*$E$6/(6*8*'Steel Eurocode 3'!$X$8*'Steel Eurocode 3'!$E$10)*100*1000*AK273","v":0.56524681511133257},{"$f":"C$18*E$7/(6*8*'Steel Eurocode 3'!X$8*'Steel Eurocode 3'!E$10)*100*1000*Y273","v":0.46913931048286139},{"$f":"C$14*B273*(8^3-2*8*B273^2+B273^3)/24/('Steel Eurocode 3'!E$10*'Steel Eurocode 3'!X$8)*100*1000","v":2.9461759573867012},null,108.44599295999981,135.01078732799979,9.5345463764489821E-7,3.7187472471019849E-6,8.0106639179384359E-6,1.3353848132766213E-5]
[195,6.2080000000000046,{"$f":"-SUM(M274:Q274)","v":-387.14907033599923},{"$f":"H274+I274+J274+K274+L274","v":-177.27801600000021},{"$f":"IF(E$10=2,G274,F274)","v":-14.09174845248069},{"$f":"-SUM(R274:V274)","v":-14.09174845248069},{"$f":"-SUM(AE274:AI274)","v":-4.7226884551111006},{"$f":"IF(B274>D$4, IF(B274<(D$4+E$4),G$4-C$4*(B274-D$4),H$4),G$4)","v":-7.6640625},{"$f":"IF(B274>D$5, IF(B274<(D$5+E$5),G$5-C$5*(B274-D$5),H$5),G$5)","v":-17.8828125},{"$f":"IF(B274>D$6,-H$6,G$6)","v":-25.546875},{"$f":"IF(B274>D$7,-H$7,G$7)","v":-30.65625},{"$f":"'Graph Properties'!C$3*8/2-B274*C$3","v":-95.528016000000207},13.733999999999964,32.045999999999914,{"$f":"IF(B274<D$6,G$6*B274,G$6*B274-C$6*(B274-D$6))","v":45.77999999999988},{"$f":"IF(B274<D$7,G$7*B274,G$7*B274-C$7*(B274-D$7))","v":54.935999999999858},{"$f":"C$3*8/2*'Graph Properties'!B274-'Graph Properties'!C$3*B274^2/2","v":240.65307033599959},{"$f":"(AA274-Z274)*1000*100","v":0.78262751196730684},{"$f":"(AC274-AB274)*1000*100","v":1.5128403378089088},{"$f":"D$17*$E$6/(6*8*'Steel Eurocode 3'!$X$8*'Steel Eurocode 3'!$E$10)*100*1000*X274","v":1.6017531192839045},{"$f":"D$18*E$7/(6*8*'Steel Eurocode 3'!X$8*'Steel Eurocode 3'!E$10)*100*1000*Y274","v":1.3313273274956192},{"$f":"D$14*B274*(8^3-2*8*B274^2+B274^3)/24/('Steel Eurocode 3'!E$10*'Steel Eurocode 3'!X$8)*100*1000","v":8.863200155924952},null,106.88902485333313,133.26424473599974,2.6982699513523971E-6,1.0524545071025466E-5,2.2673221155866848E-5,3.7801624533955936E-5,null,{"$f":"(AN274-AM274)*1000*100","v":0.27221826503210678},{"$f":"(AP274-AO274)*1000*100","v":0.52620533489005539},{"$f":"C$17*$E$6/(6*8*'Steel Eurocode 3'!$X$8*'Steel Eurocode 3'!$E$10)*100*1000*AK274","v":0.55713151975092323},{"$f":"C$18*E$7/(6*8*'Steel Eurocode 3'!X$8*'Steel Eurocode 3'!E$10)*100*1000*Y274","v":0.46307037478108487},{"$f":"C$14*B274*(8^3-2*8*B274^2+B274^3)/24/('Steel Eurocode 3'!E$10*'Steel Eurocode 3'!X$8)*100*1000","v":2.9040629606569306},null,106.88902485333313,133.26424473599974,9.3852867873126847E-7,3.6607113290523363E-6,7.8863377933449893E-6,1.3148391142245543E-5]
[196,6.2400000000000047,-381.45402239999902,-178.66248000000019,-13.884391036984372,-13.884391036984372,-4.6531860762238244,-7.6640625,-17.8828125,-25.546875,-30.65625,{"$f":"'Graph Properties'!C$3*8/2-B275*C$3","v":-96.912480000000187},13.488749999999964,31.473749999999917,44.962499999999878,53.954999999999856,{"$f":"C$3*8/2*'Graph Properties'!B275-'Graph Properties'!C$3*B275^2/2","v":237.57402239999942},0.77015090484529891,1.4893227281572261,{"$f":"D$17*$E$6/(6*8*'Steel Eurocode 3'!$X$8*'Steel Eurocode 3'!$E$10)*100*1000*X275","v":1.5781466655547187},{"$f":"D$18*E$7/(6*8*'Steel Eurocode 3'!X$8*'Steel Eurocode 3'!E$10)*100*1000*Y275","v":1.3135491618714008},{"$f":"D$14*B275*(8^3-2*8*B275^2+B275^3)/24/('Steel Eurocode 3'!E$10*'Steel Eurocode 3'!X$8)*100*1000","v":8.7332215765557279},null,105.31370666666646,131.4846719999997,2.6550828399077024E-6,1.0356591888360691E-5,2.2313308731548608E-5,3.7206536013120868E-5,null,0.26787857559836475,0.51802529675033948,{"$f":"C$17*$E$6/(6*8*'Steel Eurocode 3'!$X$8*'Steel Eurocode 3'!$E$10)*100*1000*AK275","v":0.54892057932338045},{"$f":"C$18*E$7/(6*8*'Steel Eurocode 3'!X$8*'Steel Eurocode 3'!E$10)*100*1000*Y275","v":0.45688666499874803},{"$f":"C$14*B275*(8^3-2*8*B275^2+B275^3)/24/('Steel Eurocode 3'!E$10*'Steel Eurocode 3'!X$8)*100*1000","v":2.861474959552992},null,105.31370666666646,131.4846719999997,9.2350707475050514E-7,3.6022928307341529E-6,7.7611508631473402E-6,1.2941403830650735E-5]
[197,6.2720000000000047,-375.71467161599929,-180.04694400000022,-13.674738235354312,-13.674738235354312,-4.5829141717407964,-7.6640625,-17.8828125,-25.546875,-30.65625,{"$f":"'Graph Properties'!C$3*8/2-B276*C$3","v":-98.296944000000224},13.243499999999964,30.901499999999917,44.144999999999882,52.973999999999847,{"$f":"C$3*8/2*'Graph Properties'!B276-'Graph Properties'!C$3*B276^2/2","v":234.45067161599968},0.7575932769577165,1.4656160700525362,{"$f":"D$17*$E$6/(6*8*'Steel Eurocode 3'!$X$8*'Steel Eurocode 3'!$E$10)*100*1000*X276","v":1.5542701426069518},{"$f":"D$18*E$7/(6*8*'Steel Eurocode 3'!X$8*'Steel Eurocode 3'!E$10)*100*1000*Y276","v":1.295446913184886},{"$f":"D$14*B276*(8^3-2*8*B276^2+B276^3)/24/('Steel Eurocode 3'!E$10*'Steel Eurocode 3'!X$8)*100*1000","v":8.6018118325522206},null,103.72036607999976,129.67265894399972,2.6116256592444272E-6,1.0187558428821592E-5,2.1950965684263147E-5,3.6607126384788509E-5,null,0.26351070502877094,0.50977950262696936,{"$f":"C$17*$E$6/(6*8*'Steel Eurocode 3'!$X$8*'Steel Eurocode 3'!$E$10)*100*1000*AK276","v":0.540615701776331},{"$f":"C$18*E$7/(6*8*'Steel Eurocode 3'!X$8*'Steel Eurocode 3'!E$10)*100*1000*Y276","v":0.45059023067300374},{"$f":"C$14*B276*(8^3-2*8*B276^2+B276^3)/24/('Steel Eurocode 3'!E$10*'Steel Eurocode 3'!X$8)*100*1000","v":2.8184180316357215},null,103.72036607999976,129.67265894399972,9.0839153365023548E-7,3.5434985839379451E-6,7.6351184988741354E-6,1.2732913525143829E-5]
[198,6.3040000000000047,-369.9310179839992,-181.4314080000002,-13.462824576312336,-13.462824576312336,-4.5118843721021769,-7.6640625,-17.8828125,-25.546875,-30.65625,{"$f":"'Graph Properties'!C$3*8/2-B277*C$3","v":-99.681408000000204},12.998249999999963,30.329249999999917,43.32749999999988,51.99299999999986,{"$f":"C$3*8/2*'Graph Properties'!B277-'Graph Properties'!C$3*B277^2/2","v":231.28301798399957},0.7449561014093885,1.4417238007394397,{"$f":"D$17*$E$6/(6*8*'Steel Eurocode 3'!$X$8*'Steel Eurocode 3'!$E$10)*100*1000*X277","v":1.5301284607900334},{"$f":"D$18*E$7/(6*8*'Steel Eurocode 3'!X$8*'Steel Eurocode 3'!E$10)*100*1000*Y277","v":1.2770264738553894},{"$f":"D$14*B277*(8^3-2*8*B277^2+B277^3)/24/('Steel Eurocode 3'!E$10*'Steel Eurocode 3'!X$8)*100*1000","v":8.4689897395180846},null,102.10933077333308,127.82879539199976,2.5679033197119997E-6,1.0017464333805884E-5,2.1586236207155313E-5,3.6003474214549709E-5,null,0.25911516570761339,0.50146914808328336,{"$f":"C$17*$E$6/(6*8*'Steel Eurocode 3'!$X$8*'Steel Eurocode 3'!$E$10)*100*1000*AK277","v":0.53221859505740288},{"$f":"C$18*E$7/(6*8*'Steel Eurocode 3'!X$8*'Steel Eurocode 3'!E$10)*100*1000*Y277","v":0.44418312134100491},{"$f":"C$14*B277*(8^3-2*8*B277^2+B277^3)/24/('Steel Eurocode 3'!E$10*'Steel Eurocode 3'!X$8)*100*1000","v":2.7748983419128721},null,102.10933077333308,127.82879539199976,8.9318376337808676E-7,3.4843354204542206E-6,7.5082560720540217E-6,1.2522947552886855E-5]
[199,6.3360000000000047,-364.10306150399902,-182.81587200000018,-13.248684855468301,-13.248684855468301,-4.4401083951950522,-7.6640625,-17.8828125,-25.546875,-30.65625,{"$f":"'Graph Properties'!C$3*8/2-B278*C$3","v":-101.06587200000018},12.752999999999963,29.756999999999916,42.509999999999877,51.011999999999858,{"$f":"C$3*8/2*'Graph Properties'!B278-'Graph Properties'!C$3*B278^2/2","v":228.07106150399943},0.73224085130514371,1.4176493574625375,{"$f":"D$17*$E$6/(6*8*'Steel Eurocode 3'!$X$8*'Steel Eurocode 3'!$E$10)*100*1000*X278","v":1.5057265304533922},{"$f":"D$18*E$7/(6*8*'Steel Eurocode 3'!X$8*'Steel Eurocode 3'!E$10)*100*1000*Y278","v":1.2582937363022242},{"$f":"D$14*B278*(8^3-2*8*B278^2+B278^3)/24/('Steel Eurocode 3'!E$10*'Steel Eurocode 3'!X$8)*100*1000","v":8.3347743799450029},null,100.48092842666642,125.95367116799974,2.5239207316598497E-6,9.8463292447112865E-6,2.1219164493369973E-5,3.5395658067995349E-5,null,0.25469247001918038,0.49309542868262185,{"$f":"C$17*$E$6/(6*8*'Steel Eurocode 3'!$X$8*'Steel Eurocode 3'!$E$10)*100*1000*AK278","v":0.52373096711422329},{"$f":"C$18*E$7/(6*8*'Steel Eurocode 3'!X$8*'Steel Eurocode 3'!E$10)*100*1000*Y278","v":0.437667386539904},{"$f":"C$14*B278*(8^3-2*8*B278^2+B278^3)/24/('Steel Eurocode 3'!E$10*'Steel Eurocode 3'!X$8)*100*1000","v":2.7309221428391233},null,100.48092842666642,125.95367116799974,8.7788547188168678E-7,3.4248101720734906E-6,7.3805789542156425E-6,1.2311533241041861E-5]
[200,6.3680000000000048,-358.2308021759992,-184.20033600000022,-13.032354135320029,-13.032354135320029,-4.3675980463534207,-7.6640625,-17.8828125,-25.546875,-30.65625,{"$f":"'Graph Properties'!C$3*8/2-B279*C$3","v":-102.45033600000022},12.507749999999964,29.184749999999916,41.692499999999875,50.030999999999857,{"$f":"C$3*8/2*'Graph Properties'!B279-'Graph Properties'!C$3*B279^2/2","v":224.8148021759996},0.71944899974981058,1.3933961774664301,{"$f":"D$17*$E$6/(6*8*'Steel Eurocode 3'!$X$8*'Steel Eurocode 3'!$E$10)*100*1000*X279","v":1.4810692619464558},{"$f":"D$18*E$7/(6*8*'Steel Eurocode 3'!X$8*'Steel Eurocode 3'!E$10)*100*1000*Y279","v":1.2392545929447056},{"$f":"D$14*B279*(8^3-2*8*B279^2+B279^3)/24/('Steel Eurocode 3'!E$10*'Steel Eurocode 3'!X$8)*100*1000","v":8.1991851032126259},null,98.835486719999722,124.0478760959997,2.4796828054374048E-6,9.6741728029355105E-6,2.0849794736051982E-5,3.4783756510716283E-5,null,0.25024313034776013,0.48465953998832328,{"$f":"C$17*$E$6/(6*8*'Steel Eurocode 3'!$X$8*'Steel Eurocode 3'!$E$10)*100*1000*AK279","v":0.51515452589441946},{"$f":"C$18*E$7/(6*8*'Steel Eurocode 3'!X$8*'Steel Eurocode 3'!E$10)*100*1000*Y279","v":0.43104507580685408},{"$f":"C$14*B279*(8^3-2*8*B279^2+B279^3)/24/('Steel Eurocode 3'!E$10*'Steel Eurocode 3'!X$8)*100*1000","v":2.6864957743160636},null,98.835486719999722,124.0478760959997,8.6249836710866247E-7,3.3649296705862637E-6,7.2521025168876463E-6,1.2098697916770879E-5]
[201,6.4000000000000048,-352.31423999999902,-185.5848000000002,-12.813867745253354,-12.813867745253354,-4.2943652183582017,-7.6640625,-17.8828125,-25.546875,-30.65625,{"$f":"'Graph Properties'!C$3*8/2-B280*C$3","v":-103.8348000000002},12.262499999999964,28.612499999999915,40.874999999999886,49.049999999999855,{"$f":"C$3*8/2*'Graph Properties'!B280-'Graph Properties'!C$3*B280^2/2","v":221.5142399999994},0.70658201984821756,1.3689676979957159,{"$f":"D$17*$E$6/(6*8*'Steel Eurocode 3'!$X$8*'Steel Eurocode 3'!$E$10)*100*1000*X280","v":1.4561615656186546},{"$f":"D$18*E$7/(6*8*'Steel Eurocode 3'!X$8*'Steel Eurocode 3'!E$10)*100*1000*Y280","v":1.2199149362021486},{"$f":"D$14*B280*(8^3-2*8*B280^2+B280^3)/24/('Steel Eurocode 3'!E$10*'Steel Eurocode 3'!X$8)*100*1000","v":8.0622415255886164},null,97.173333333333062,122.11199999999968,2.4351944513940947E-6,9.5010146498762703E-6,2.04781711283462E-5,3.416784810830336E-5,null,0.24576765907764089,0.47616267756372721,{"$f":"C$17*$E$6/(6*8*'Steel Eurocode 3'!$X$8*'Steel Eurocode 3'!$E$10)*100*1000*AK280","v":0.50649097934561893},{"$f":"C$18*E$7/(6*8*'Steel Eurocode 3'!X$8*'Steel Eurocode 3'!E$10)*100*1000*Y280","v":0.42431823867900814},{"$f":"C$14*B280*(8^3-2*8*B280^2+B280^3)/24/('Steel Eurocode 3'!E$10*'Steel Eurocode 3'!X$8)*100*1000","v":2.6416256636922064},null,97.173333333333062,122.11199999999968,8.4702415700664144E-7,3.3047007477830504E-6,7.1228421315986781E-6,1.188446890723595E-5]
[202,6.4320000000000048,-346.35337497599903,-186.96926400000018,-12.593261281542095,-12.593261281542095,-4.2204218914372333,-7.6640625,-17.8828125,-25.546875,-30.65625,{"$f":"'Graph Properties'!C$3*8/2-B281*C$3","v":-105.21926400000018},12.017249999999963,28.040249999999915,40.057499999999877,48.068999999999846,{"$f":"C$3*8/2*'Graph Properties'!B281-'Graph Properties'!C$3*B281^2/2","v":218.1693749759994},0.69364138470519365,1.3443673562949952,{"$f":"D$17*$E$6/(6*8*'Steel Eurocode 3'!$X$8*'Steel Eurocode 3'!$E$10)*100*1000*X281","v":1.4310083518194161},{"$f":"D$18*E$7/(6*8*'Steel Eurocode 3'!X$8*'Steel Eurocode 3'!E$10)*100*1000*Y281","v":1.2002806584938672},{"$f":"D$14*B281*(8^3-2*8*B281^2+B281^3)/24/('Steel Eurocode 3'!E$10*'Steel Eurocode 3'!X$8)*100*1000","v":7.9239635302286224},null,95.494795946666386,120.14663270399967,2.3904605798793469E-6,9.3268744269312829E-6,2.0104337863397489E-5,3.3548011426347442E-5,null,0.2412665685931108,0.4676060369721724,{"$f":"C$17*$E$6/(6*8*'Steel Eurocode 3'!$X$8*'Steel Eurocode 3'!$E$10)*100*1000*AK281","v":0.49774203541544904},{"$f":"C$18*E$7/(6*8*'Steel Eurocode 3'!X$8*'Steel Eurocode 3'!E$10)*100*1000*Y281","v":0.417488924693519},{"$f":"C$14*B281*(8^3-2*8*B281^2+B281^3)/24/('Steel Eurocode 3'!E$10*'Steel Eurocode 3'!X$8)*100*1000","v":2.5963183257629825},null,95.494795946666386,120.14663270399967,8.3146454952325116E-7,3.2441302354543591E-6,6.9928131698773872E-6,1.1668873539599111E-5]
[203,6.4640000000000049,-340.34820710399913,-188.35372800000022,-12.370570607348075,-12.370570607348075,-4.1457801332652711,-7.6640625,-17.8828125,-25.546875,-30.65625,{"$f":"'Graph Properties'!C$3*8/2-B282*C$3","v":-106.60372800000022},11.771999999999963,27.467999999999915,39.239999999999874,47.087999999999845,{"$f":"C$3*8/2*'Graph Properties'!B282-'Graph Properties'!C$3*B282^2/2","v":214.78020710399949},0.68062856742556721,1.31959858960887,{"$f":"D$17*$E$6/(6*8*'Steel Eurocode 3'!$X$8*'Steel Eurocode 3'!$E$10)*100*1000*X282","v":1.40561453089817},{"$f":"D$18*E$7/(6*8*'Steel Eurocode 3'!X$8*'Steel Eurocode 3'!E$10)*100*1000*Y282","v":1.1803576522391765},{"$f":"D$14*B282*(8^3-2*8*B282^2+B282^3)/24/('Steel Eurocode 3'!E$10*'Steel Eurocode 3'!X$8)*100*1000","v":7.784371267176291},null,93.800202239999749,118.1523640319997,2.3454861012425916E-6,9.1517717754982637E-6,1.9728339134350703E-5,3.2924325030439404E-5,null,0.23674037127845815,0.45899081377699824,{"$f":"C$17*$E$6/(6*8*'Steel Eurocode 3'!$X$8*'Steel Eurocode 3'!$E$10)*100*1000*AK282","v":0.48890940205153738},{"$f":"C$18*E$7/(6*8*'Steel Eurocode 3'!X$8*'Steel Eurocode 3'!E$10)*100*1000*Y282","v":0.41055918338753961},{"$f":"C$14*B282*(8^3-2*8*B282^2+B282^3)/24/('Steel Eurocode 3'!E$10*'Steel Eurocode 3'!X$8)*100*1000","v":2.5505803627707371},null,93.800202239999749,118.1523640319997,8.1582125260611888E-7,3.1832249653907004E-6,6.862031003252418E-6,1.14519391410224E-5]
[204,6.4960000000000049,-334.29873638399891,-189.7381920000002,-12.145831852721106,-12.145831852721106,-4.0704520989639876,-7.6640625,-17.8828125,-25.546875,-30.65625,{"$f":"'Graph Properties'!C$3*8/2-B283*C$3","v":-107.9881920000002},11.526749999999963,26.895749999999914,38.422499999999872,46.106999999999843,{"$f":"C$3*8/2*'Graph Properties'!B283-'Graph Properties'!C$3*B283^2/2","v":211.34673638399931},0.66754504111416701,1.2946648351819383,{"$f":"D$17*$E$6/(6*8*'Steel Eurocode 3'!$X$8*'Steel Eurocode 3'!$E$10)*100*1000*X283","v":1.3799850132043434},{"$f":"D$18*E$7/(6*8*'Steel Eurocode 3'!X$8*'Steel Eurocode 3'!E$10)*100*1000*Y283","v":1.16015180985739},{"$f":"D$14*B283*(8^3-2*8*B283^2+B283^3)/24/('Steel Eurocode 3'!E$10*'Steel Eurocode 3'!X$8)*100*1000","v":7.6434851533632662},null,92.089879893333034,116.12978380799967,2.3002759258332568E-6,8.9757263369749266E-6,1.9350219134350703E-5,3.2296867486170087E-5,null,0.23218957951797112,0.45031820354154367,{"$f":"C$17*$E$6/(6*8*'Steel Eurocode 3'!$X$8*'Steel Eurocode 3'!$E$10)*100*1000*AK283","v":0.47999478720151073},{"$f":"C$18*E$7/(6*8*'Steel Eurocode 3'!X$8*'Steel Eurocode 3'!E$10)*100*1000*Y283","v":0.4035310642982225},{"$f":"C$14*B283*(8^3-2*8*B283^2+B283^3)/24/('Steel Eurocode 3'!E$10*'Steel Eurocode 3'!X$8)*100*1000","v":2.5044184644047398},null,92.089879893333034,116.12978380799967,8.0009597420287189E-7,3.1219917693825828E-6,6.7305110032524179E-6,1.1233693038667855E-5]
[205,6.5280000000000049,-328.20496281599918,-191.12265600000023,-11.919081414599006,-11.919081414599006,-3.994450031101981,-7.6640625,-17.8828125,-25.546875,-30.65625,{"$f":"'Graph Properties'!C$3*8/2-B284*C$3","v":-109.37265600000023},11.281499999999962,26.323499999999914,37.604999999999869,45.125999999999856,{"$f":"C$3*8/2*'Graph Properties'!B284-'Graph Properties'!C$3*B284^2/2","v":207.86896281599957},0.65439227887582152,1.2695695302588017,{"$f":"D$17*$E$6/(6*8*'Steel Eurocode 3'!$X$8*'Steel Eurocode 3'!$E$10)*100*1000*X284","v":1.3541247090873665},{"$f":"D$18*E$7/(6*8*'Steel Eurocode 3'!X$8*'Steel Eurocode 3'!E$10)*100*1000*Y284","v":1.1396690237678224},{"$f":"D$14*B284*(8^3-2*8*B284^2+B284^3)/24/('Steel Eurocode 3'!E$10*'Steel Eurocode 3'!X$8)*100*1000","v":7.5013258726091934},null,90.364156586666354,114.07948185599963,2.2548349640007714E-6,8.7987577527589868E-6,1.8970022056542349E-5,3.1665717359130366E-5,null,0.22761470569593786,0.4415894018291483,{"$f":"C$17*$E$6/(6*8*'Steel Eurocode 3'!$X$8*'Steel Eurocode 3'!$E$10)*100*1000*AK284","v":0.47099989881299703},{"$f":"C$18*E$7/(6*8*'Steel Eurocode 3'!X$8*'Steel Eurocode 3'!E$10)*100*1000*Y284","v":0.39640661696272073},{"$f":"C$14*B284*(8^3-2*8*B284^2+B284^3)/24/('Steel Eurocode 3'!E$10*'Steel Eurocode 3'!X$8)*100*1000","v":2.4578394078011772},null,90.364156586666354,114.07948185599963,7.8429042226113776E-7,3.0604374792205166E-6,6.598268541406033E-6,1.1014162559697516E-5]
[206,6.5600000000000049,-322.06688639999908,-192.50712000000021,-11.690355956807572,-11.690355956807572,-3.9177862596947595,-7.6640625,-17.8828125,-25.546875,-30.65625,{"$f":"'Graph Properties'!C$3*8/2-B285*C$3","v":-110.75712000000021},11.036249999999962,25.75124999999991,36.787499999999881,44.144999999999854,{"$f":"C$3*8/2*'Graph Properties'!B285-'Graph Properties'!C$3*B285^2/2","v":204.34688639999945},0.6411717538153594,1.2443161120840591,{"$f":"D$17*$E$6/(6*8*'Steel Eurocode 3'!$X$8*'Steel Eurocode 3'!$E$10)*100*1000*X285","v":1.3280385288966692},{"$f":"D$18*E$7/(6*8*'Steel Eurocode 3'!X$8*'Steel Eurocode 3'!E$10)*100*1000*Y285","v":1.1189151863897897},{"$f":"D$14*B285*(8^3-2*8*B285^2+B285^3)/24/('Steel Eurocode 3'!E$10*'Steel Eurocode 3'!X$8)*100*1000","v":7.3579143756216938},null,88.623359999999764,112.00204799999972,2.2091681260945638E-6,8.6208856642481582E-6,1.8587792094070493E-5,3.1030953214911083E-5,null,0.22301626219664675,0.43280560420315106,{"$f":"C$17*$E$6/(6*8*'Steel Eurocode 3'!$X$8*'Steel Eurocode 3'!$E$10)*100*1000*AK285","v":0.46192644483362405},{"$f":"C$18*E$7/(6*8*'Steel Eurocode 3'!X$8*'Steel Eurocode 3'!E$10)*100*1000*Y285","v":0.38918789091818762},{"$f":"C$14*B285*(8^3-2*8*B285^2+B285^3)/24/('Steel Eurocode 3'!E$10*'Steel Eurocode 3'!X$8)*100*1000","v":2.4108500575431497},null,88.623359999999764,112.00204799999972,7.6840630472854397E-7,2.9985689266950114E-6,6.4653189892419108E-6,1.0793375031273421E-5]
[207,6.592000000000005,-315.884507135999,-193.89158400000019,-11.459692410060605,-11.459692410060605,-3.8404732022047532,-7.6640625,-17.8828125,-25.546875,-30.65625,{"$f":"'Graph Properties'!C$3*8/2-B286*C$3","v":-112.14158400000019},10.790999999999961,25.17899999999991,35.969999999999871,43.163999999999845,{"$f":"C$3*8/2*'Graph Properties'!B286-'Graph Properties'!C$3*B286^2/2","v":200.78050713599941},0.62788493903760945,1.2189080179023113,{"$f":"D$17*$E$6/(6*8*'Steel Eurocode 3'!$X$8*'Steel Eurocode 3'!$E$10)*100*1000*X286","v":1.3017313829816763},{"$f":"D$18*E$7/(6*8*'Steel Eurocode 3'!X$8*'Steel Eurocode 3'!E$10)*100*1000*Y286","v":1.0978961901426039},{"$f":"D$14*B286*(8^3-2*8*B286^2+B286^3)/24/('Steel Eurocode 3'!E$10*'Steel Eurocode 3'!X$8)*100*1000","v":7.2132718799964044},null,86.867817813333033,109.89807206399968,2.1632803224640632E-6,8.4421297128401578E-6,1.8203573440080002E-5,3.0392653619103116E-5,null,0.21839476140438591,0.42396800622689113,{"$f":"C$17*$E$6/(6*8*'Steel Eurocode 3'!$X$8*'Steel Eurocode 3'!$E$10)*100*1000*AK286","v":0.45277613321101784},{"$f":"C$18*E$7/(6*8*'Steel Eurocode 3'!X$8*'Steel Eurocode 3'!E$10)*100*1000*Y286","v":0.38187693570177517},{"$f":"C$14*B286*(8^3-2*8*B286^2+B286^3)/24/('Steel Eurocode 3'!E$10*'Steel Eurocode 3'!X$8)*100*1000","v":2.363457365660683},null,86.867817813333033,109.89807206399968,7.5244532955271757E-7,2.9363929435965766E-6,6.3316777182886948E-6,1.0571357780557606E-5]
[208,6.624000000000005,-309.65782502399907,-195.27604800000023,-11.227127971959902,-11.227127971959902,-3.7625233635413089,-7.6640625,-17.8828125,-25.546875,-30.65625,{"$f":"'Graph Properties'!C$3*8/2-B287*C$3","v":-113.52604800000023},10.545749999999961,24.606749999999909,35.152499999999876,42.182999999999851,{"$f":"C$3*8/2*'Graph Properties'!B287-'Graph Properties'!C$3*B287^2/2","v":197.16982502399946},0.61453330764740011,1.1933486849581594,{"$f":"D$17*$E$6/(6*8*'Steel Eurocode 3'!$X$8*'Steel Eurocode 3'!$E$10)*100*1000*X287","v":1.2752081816918204},{"$f":"D$18*E$7/(6*8*'Steel Eurocode 3'!X$8*'Steel Eurocode 3'!E$10)*100*1000*Y287","v":1.0766179274455809},{"$f":"D$14*B287*(8^3-2*8*B287^2+B287^3)/24/('Steel Eurocode 3'!E$10*'Steel Eurocode 3'!X$8)*100*1000","v":7.0674198702169404},null,85.097857706666389,107.76814387199965,2.1171764634586981E-6,8.2625095399326994E-6,1.7817410287715724E-5,2.9750897137297317E-5,null,0.21375071570344353,0.41507780346370743,{"$f":"C$17*$E$6/(6*8*'Steel Eurocode 3'!$X$8*'Steel Eurocode 3'!$E$10)*100*1000*AK287","v":0.44355067189280706},{"$f":"C$18*E$7/(6*8*'Steel Eurocode 3'!X$8*'Steel Eurocode 3'!E$10)*100*1000*Y287","v":0.37447580085063675},{"$f":"C$14*B287*(8^3-2*8*B287^2+B287^3)/24/('Steel Eurocode 3'!E$10*'Steel Eurocode 3'!X$8)*100*1000","v":2.3156683716307143},null,85.097857706666389,107.76814387199965,7.3640920468128616E-7,2.8739163617157213E-6,6.1973601000750343E-6,1.0348138134712109E-5]
[209,6.656000000000005,-303.38684006399893,-196.66051200000021,-10.99270010699526,-10.99270010699526,-3.6839493360606994,-7.6640625,-17.8828125,-25.546875,-30.65625,{"$f":"'Graph Properties'!C$3*8/2-B288*C$3","v":-114.91051200000021},10.300499999999962,24.034499999999909,34.334999999999866,41.201999999999842,{"$f":"C$3*8/2*'Graph Properties'!B288-'Graph Properties'!C$3*B288^2/2","v":193.51484006399937},0.60111833274956006,1.1676415504962019,{"$f":"D$17*$E$6/(6*8*'Steel Eurocode 3'!$X$8*'Steel Eurocode 3'!$E$10)*100*1000*X288","v":1.2484738353765283},{"$f":"D$18*E$7/(6*8*'Steel Eurocode 3'!X$8*'Steel Eurocode 3'!E$10)*100*1000*Y288","v":1.0550862907180354},{"$f":"D$14*B288*(8^3-2*8*B288^2+B288^3)/24/('Steel Eurocode 3'!E$10*'Steel Eurocode 3'!X$8)*100*1000","v":6.9203800976549337},null,83.313807359999714,105.61285324799968,2.0708614594278973E-6,8.0820447869234983E-6,1.7429346830122529E-5,2.9105762335084548E-5,null,0.20908463747810779,0.40613619147693975,{"$f":"C$17*$E$6/(6*8*'Steel Eurocode 3'!$X$8*'Steel Eurocode 3'!$E$10)*100*1000*AK288","v":0.43425176882661853},{"$f":"C$18*E$7/(6*8*'Steel Eurocode 3'!X$8*'Steel Eurocode 3'!E$10)*100*1000*Y288","v":0.36698653590192531},{"$f":"C$14*B288*(8^3-2*8*B288^2+B288^3)/24/('Steel Eurocode 3'!E$10*'Steel Eurocode 3'!X$8)*100*1000","v":2.267490202377108},null,83.313807359999714,105.61285324799968,7.2029963806187721E-7,2.8111460128429554E-6,6.0623815061295751E-6,1.0123743420898973E-5]
[210,6.6880000000000051,-297.07155225599882,-198.04497600000019,-10.75644654654446,-10.75644654654446,-3.6047637995661059,-7.6640625,-17.8828125,-25.546875,-30.65625,{"$f":"'Graph Properties'!C$3*8/2-B289*C$3","v":-116.29497600000019},10.055249999999962,23.462249999999909,33.51749999999987,40.22099999999984,{"$f":"C$3*8/2*'Graph Properties'!B289-'Graph Properties'!C$3*B289^2/2","v":189.81555225599925},0.58764148744891787,1.1417900517610393,{"$f":"D$17*$E$6/(6*8*'Steel Eurocode 3'!$X$8*'Steel Eurocode 3'!$E$10)*100*1000*X289","v":1.2215332543852286},{"$f":"D$18*E$7/(6*8*'Steel Eurocode 3'!X$8*'Steel Eurocode 3'!E$10)*100*1000*Y289","v":1.0333071723792813},{"$f":"D$14*B289*(8^3-2*8*B289^2+B289^3)/24/('Steel Eurocode 3'!E$10*'Steel Eurocode 3'!X$8)*100*1000","v":6.7721745805699918},null,81.515994453333008,103.43279001599967,2.0243402207210893E-6,7.9007550952102684E-6,1.7039427260445273E-5,2.8457327778055666E-5,null,0.20439703911266704,0.39714436582992657,{"$f":"C$17*$E$6/(6*8*'Steel Eurocode 3'!$X$8*'Steel Eurocode 3'!$E$10)*100*1000*AK289","v":0.42488113196007948},{"$f":"C$18*E$7/(6*8*'Steel Eurocode 3'!X$8*'Steel Eurocode 3'!E$10)*100*1000*Y289","v":0.35941119039279346},{"$f":"C$14*B289*(8^3-2*8*B289^2+B289^3)/24/('Steel Eurocode 3'!E$10*'Steel Eurocode 3'!X$8)*100*1000","v":2.2189300722706395},null,81.515994453333008,103.43279001599967,7.0411833764211787E-7,2.7480887287687885E-6,5.9267573079809632E-6,9.8982009662802288E-6]
[211,6.7200000000000051,-290.71196159999892,-199.42944000000023,-10.518405288873282,-10.518405288873282,-3.5249795213076336,-7.6640625,-17.8828125,-25.546875,-30.65625,{"$f":"'Graph Properties'!C$3*8/2-B290*C$3","v":-117.67944000000023},9.8099999999999614,22.889999999999908,32.699999999999875,39.239999999999853,{"$f":"C$3*8/2*'Graph Properties'!B290-'Graph Properties'!C$3*B290^2/2","v":186.07196159999933},0.5741042448503022,1.1157976259972715,{"$f":"D$17*$E$6/(6*8*'Steel Eurocode 3'!$X$8*'Steel Eurocode 3'!$E$10)*100*1000*X290","v":1.1943913490673519},{"$f":"D$18*E$7/(6*8*'Steel Eurocode 3'!X$8*'Steel Eurocode 3'!E$10)*100*1000*Y290","v":1.0112864648486333},{"$f":"D$14*B290*(8^3-2*8*B290^2+B290^3)/24/('Steel Eurocode 3'!E$10*'Steel Eurocode 3'!X$8)*100*1000","v":6.622825604109722},null,79.704746666666381,101.22854399999966,1.9776176576877026E-6,7.7186601061907249E-6,1.6647695771828808E-5,2.7805672031801524E-5,null,0.19968843299140948,0.38810352208600746,{"$f":"C$17*$E$6/(6*8*'Steel Eurocode 3'!$X$8*'Steel Eurocode 3'!$E$10)*100*1000*AK290","v":0.41544046924081807},{"$f":"C$18*E$7/(6*8*'Steel Eurocode 3'!X$8*'Steel Eurocode 3'!E$10)*100*1000*Y290","v":0.35175181386039411},{"$f":"C$14*B290*(8^3-2*8*B290^2+B290^3)/24/('Steel Eurocode 3'!E$10*'Steel Eurocode 3'!X$8)*100*1000","v":2.1699952831290044},null,79.704746666666381,101.22854399999966,6.8786701136963564E-7,2.6847513412837303E-6,5.7905028771578455E-6,9.6715380980179202E-6]
[212,6.7520000000000051,-284.30806809599892,-200.81390400000021,-10.278614599135512,-10.278614599135512,-3.4446093559823079,-7.6640625,-17.8828125,-25.546875,-30.65625,{"$f":"'Graph Properties'!C$3*8/2-B291*C$3","v":-119.06390400000021},9.564749999999961,22.317749999999908,31.882499999999865,38.258999999999844,{"$f":"C$3*8/2*'Graph Properties'!B291-'Graph Properties'!C$3*B291^2/2","v":182.28406809599937},0.56050807805854164,1.0896677104494996,{"$f":"D$17*$E$6/(6*8*'Steel Eurocode 3'!$X$8*'Steel Eurocode 3'!$E$10)*100*1000*X291","v":1.1670530297723252},{"$f":"D$18*E$7/(6*8*'Steel Eurocode 3'!X$8*'Steel Eurocode 3'!E$10)*100*1000*Y291","v":0.98903006054540532},{"$f":"D$14*B291*(8^3-2*8*B291^2+B291^3)/24/('Steel Eurocode 3'!E$10*'Steel Eurocode 3'!X$8)*100*1000","v":6.472355720309741},null,77.880391679999718,99.000705023999615,1.9306986806771671E-6,7.5357794612625843E-6,1.6254196557418E-5,2.7150873661912996E-5,null,0.19495933149862318,0.37901485580852151,{"$f":"C$17*$E$6/(6*8*'Steel Eurocode 3'!$X$8*'Steel Eurocode 3'!$E$10)*100*1000*AK291","v":0.40593148861646089},{"$f":"C$18*E$7/(6*8*'Steel Eurocode 3'!X$8*'Steel Eurocode 3'!E$10)*100*1000*Y291","v":0.34401045584188006},{"$f":"C$14*B291*(8^3-2*8*B291^2+B291^3)/24/('Steel Eurocode 3'!E$10*'Steel Eurocode 3'!X$8)*100*1000","v":2.1206932242168222},null,77.880391679999718,99.000705023999615,6.7154736719205808E-7,2.62114068217829E-6,5.6536335851888694E-6,9.4437821432740849E-6]
[213,6.7840000000000051,-277.85987174399907,-202.19836800000024,-10.037113009372913,-10.037113009372913,-3.3636662457340649,-7.6640625,-17.8828125,-25.546875,-30.65625,{"$f":"'Graph Properties'!C$3*8/2-B292*C$3","v":-120.44836800000024},9.3194999999999606,21.745499999999907,31.06499999999987,37.277999999999842,{"$f":"C$3*8/2*'Graph Properties'!B292-'Graph Properties'!C$3*B292^2/2","v":178.4518717439995},0.54685446017846506,1.0634037423623235,{"$f":"D$17*$E$6/(6*8*'Steel Eurocode 3'!$X$8*'Steel Eurocode 3'!$E$10)*100*1000*X292","v":1.139523206849578},{"$f":"D$18*E$7/(6*8*'Steel Eurocode 3'!X$8*'Steel Eurocode 3'!E$10)*100*1000*Y292","v":0.96654385188891312},{"$f":"D$14*B292*(8^3-2*8*B292^2+B292^3)/24/('Steel Eurocode 3'!E$10*'Steel Eurocode 3'!X$8)*100*1000","v":6.3207877480936334},null,76.043257173333075,96.749862911999628,1.8835882000389106E-6,7.352132801823561E-6,1.5858973810357703E-5,2.6493011233980938E-5,null,0.19021024701859648,0.36987956256080812,{"$f":"C$17*$E$6/(6*8*'Steel Eurocode 3'!$X$8*'Steel Eurocode 3'!$E$10)*100*1000*AK292","v":0.39635589803463578},{"$f":"C$18*E$7/(6*8*'Steel Eurocode 3'!X$8*'Steel Eurocode 3'!E$10)*100*1000*Y292","v":0.33618916587440451},{"$f":"C$14*B292*(8^3-2*8*B292^2+B292^3)/24/('Steel Eurocode 3'!E$10*'Steel Eurocode 3'!X$8)*100*1000","v":2.0710313722456202},null,76.043257173333075,96.749862911999628,6.5516111305701237E-7,2.5572635832429775E-6,5.5161648036026793E-6,9.2149604292107606E-6]
[214,6.8160000000000052,-271.36737254399895,-203.58283200000022,-9.7939393185152568,-9.7939393185152568,-3.2821632201537683,-7.6640625,-17.8828125,-25.546875,-30.65625,{"$f":"'Graph Properties'!C$3*8/2-B293*C$3","v":-121.83283200000022},9.0742499999999602,21.173249999999907,30.24749999999986,36.296999999999841,{"$f":"C$3*8/2*'Graph Properties'!B293-'Graph Properties'!C$3*B293^2/2","v":174.57537254399938},0.5331448643149006,1.0370091589803425,{"$f":"D$17*$E$6/(6*8*'Steel Eurocode 3'!$X$8*'Steel Eurocode 3'!$E$10)*100*1000*X293","v":1.1118067906485372},{"$f":"D$18*E$7/(6*8*'Steel Eurocode 3'!X$8*'Steel Eurocode 3'!E$10)*100*1000*Y293","v":0.94383373129847015},{"$f":"D$14*B293*(8^3-2*8*B293^2+B293^3)/24/('Steel Eurocode 3'!E$10*'Steel Eurocode 3'!X$8)*100*1000","v":6.1681447732730073},null,74.193670826666335,94.476607487999615,1.8362911261223621E-6,7.1677397692713688E-6,1.5462071723792777E-5,2.5832163313596204E-5,null,0.1854416919356176,0.36069883790620594,{"$f":"C$17*$E$6/(6*8*'Steel Eurocode 3'!$X$8*'Steel Eurocode 3'!$E$10)*100*1000*AK293","v":0.3867154054429694},{"$f":"C$18*E$7/(6*8*'Steel Eurocode 3'!X$8*'Steel Eurocode 3'!E$10)*100*1000*Y293","v":0.32828999349512},{"$f":"C$14*B293*(8^3-2*8*B293^2+B293^3)/24/('Steel Eurocode 3'!E$10*'Steel Eurocode 3'!X$8)*100*1000","v":2.0210172913738553},null,74.193670826666335,94.476607487999615,6.3870995691212587E-7,2.4931268762683019E-6,5.3781119039279228E-6,8.9851002829899822E-6]
[215,6.8480000000000052,-264.83057049599881,-204.9672960000002,-9.5491325923803085,-9.5491325923803085,-3.2001133962791952,-7.6640625,-17.8828125,-25.546875,-30.65625,{"$f":"'Graph Properties'!C$3*8/2-B294*C$3","v":-123.2172960000002},8.8289999999999598,20.600999999999907,29.429999999999865,35.315999999999839,{"$f":"C$3*8/2*'Graph Properties'!B294-'Graph Properties'!C$3*B294^2/2","v":170.65457049599922},0.51938076357267737,1.010487397548157,{"$f":"D$17*$E$6/(6*8*'Steel Eurocode 3'!$X$8*'Steel Eurocode 3'!$E$10)*100*1000*X294","v":1.0839086915186342},{"$f":"D$18*E$7/(6*8*'Steel Eurocode 3'!X$8*'Steel Eurocode 3'!E$10)*100*1000*Y294","v":0.92090559119339122},{"$f":"D$14*B294*(8^3-2*8*B294^2+B294^3)/24/('Steel Eurocode 3'!E$10*'Steel Eurocode 3'!X$8)*100*1000","v":6.0144501485474482},null,72.331960319999666,92.181528575999607,1.7888123692769501E-6,6.982620005003723E-6,1.5063534490868087E-5,2.5168408466349656E-5,null,0.1806541786339747,0.35147387740805458,{"$f":"C$17*$E$6/(6*8*'Steel Eurocode 3'!$X$8*'Steel Eurocode 3'!$E$10)*100*1000*AK294","v":0.37701171878909012},{"$f":"C$18*E$7/(6*8*'Steel Eurocode 3'!X$8*'Steel Eurocode 3'!E$10)*100*1000*Y294","v":0.32031498824117949},{"$f":"C$14*B294*(8^3-2*8*B294^2+B294^3)/24/('Steel Eurocode 3'!E$10*'Steel Eurocode 3'!X$8)*100*1000","v":1.9706586332068963},null,72.331960319999666,92.181528575999607,6.2219560670502607E-7,2.428737393044773E-6,5.2394902576932466E-6,8.7542290317737925E-6]
[216,6.8800000000000052,-258.24946559999898,-206.35176000000024,-9.3027321636738272,-9.3027321636738272,-3.1175299785950439,-7.6640625,-17.8828125,-25.546875,-30.65625,{"$f":"'Graph Properties'!C$3*8/2-B295*C$3","v":-124.60176000000024},8.5837499999999594,20.028749999999906,28.612499999999869,34.334999999999837,{"$f":"C$3*8/2*'Graph Properties'!B295-'Graph Properties'!C$3*B295^2/2","v":166.68946559999938},0.50556363105662361,0.98384189531036736,{"$f":"D$17*$E$6/(6*8*'Steel Eurocode 3'!$X$8*'Steel Eurocode 3'!$E$10)*100*1000*X295","v":1.0558338198092958},{"$f":"D$18*E$7/(6*8*'Steel Eurocode 3'!X$8*'Steel Eurocode 3'!E$10)*100*1000*Y295","v":0.89776532399299069},{"$f":"D$14*B295*(8^3-2*8*B295^2+B295^3)/24/('Steel Eurocode 3'!E$10*'Steel Eurocode 3'!X$8)*100*1000","v":5.8597274935045496},null,70.458453333332955,89.865215999999577,1.7411568398521035E-6,6.7967931504183392E-6,1.4663406304728481E-5,2.4501825257832155E-5,null,0.17584821949795601,0.34220587662969315,{"$f":"C$17*$E$6/(6*8*'Steel Eurocode 3'!$X$8*'Steel Eurocode 3'!$E$10)*100*1000*AK295","v":0.36724654602062462},{"$f":"C$18*E$7/(6*8*'Steel Eurocode 3'!X$8*'Steel Eurocode 3'!E$10)*100*1000*Y295","v":0.31226619964973584},{"$f":"C$14*B295*(8^3-2*8*B295^2+B295^3)/24/('Steel Eurocode 3'!E$10*'Steel Eurocode 3'!X$8)*100*1000","v":1.9199631367970342},null,70.458453333332955,89.865215999999577,6.0561977038334033E-7,2.3641019653629004E-6,5.1003152364272967E-6,8.5223740027242278E-6]
[217,6.9120000000000053,-251.62405785599896,-207.73622400000022,-9.0547776319895608,-9.0547776319895608,-3.0344262590329265,-7.6640625,-17.8828125,-25.546875,-30.65625,{"$f":"'Graph Properties'!C$3*8/2-B296*C$3","v":-125.98622400000022},8.3384999999999589,19.456499999999906,27.79499999999986,33.353999999999836,{"$f":"C$3*8/2*'Graph Properties'!B296-'Graph Properties'!C$3*B296^2/2","v":162.68005785599939},0.49169493987156804,0.95707608951157364,{"$f":"D$17*$E$6/(6*8*'Steel Eurocode 3'!$X$8*'Steel Eurocode 3'!$E$10)*100*1000*X296","v":1.0275870858699536},{"$f":"D$18*E$7/(6*8*'Steel Eurocode 3'!X$8*'Steel Eurocode 3'!E$10)*100*1000*Y296","v":0.87441882211658373},{"$f":"D$14*B296*(8^3-2*8*B296^2+B296^3)/24/('Steel Eurocode 3'!E$10*'Steel Eurocode 3'!X$8)*100*1000","v":5.7040006946198822},null,68.573477546666368,87.528259583999613,1.6933294481972514E-6,6.6102788469129319E-6,1.4261731358518824E-5,2.383249225363456E-5,null,0.17102432691184971,0.33289603113446048,{"$f":"C$17*$E$6/(6*8*'Steel Eurocode 3'!$X$8*'Steel Eurocode 3'!$E$10)*100*1000*AK296","v":0.35742159508520127},{"$f":"C$18*E$7/(6*8*'Steel Eurocode 3'!X$8*'Steel Eurocode 3'!E$10)*100*1000*Y296","v":0.30414567725794212},{"$f":"C$14*B296*(8^3-2*8*B296^2+B296^3)/24/('Steel Eurocode 3'!E$10*'Steel Eurocode 3'!X$8)*100*1000","v":1.8689386286434733},null,68.573477546666368,87.528259583999613,5.8898415589469603E-7,2.2992274250131932E-6,4.9606022116587198E-6,8.2895625230033245E-6]
[218,6.9440000000000053,-244.95434726399895,-209.1206880000002,-8.8053088638092678,-8.8053088638092678,-2.9508156169713819,-7.6640625,-17.8828125,-25.546875,-30.65625,{"$f":"'Graph Properties'!C$3*8/2-B297*C$3","v":-127.3706880000002},8.0932499999999603,18.884249999999906,26.977499999999864,32.372999999999841,{"$f":"C$3*8/2*'Graph Properties'!B297-'Graph Properties'!C$3*B297^2/2","v":158.62634726399938},0.4777761631223395,0.93019341739637618,{"$f":"D$17*$E$6/(6*8*'Steel Eurocode 3'!$X$8*'Steel Eurocode 3'!$E$10)*100*1000*X297","v":0.99917340005003363},{"$f":"D$18*E$7/(6*8*'Steel Eurocode 3'!X$8*'Steel Eurocode 3'!E$10)*100*1000*Y297","v":0.85087197798348402},{"$f":"D$14*B297*(8^3-2*8*B297^2+B297^3)/24/('Steel Eurocode 3'!E$10*'Steel Eurocode 3'!X$8)*100*1000","v":5.5472939052570345},null,66.677360639999733,85.171249151999632,1.645335104661822E-6,6.4230967358852173E-6,1.3858553845383972E-5,2.3160488019347734E-5,null,0.16618301325994414,0.32354553648569601,{"$f":"C$17*$E$6/(6*8*'Steel Eurocode 3'!$X$8*'Steel Eurocode 3'!$E$10)*100*1000*AK297","v":0.34753857393044646},{"$f":"C$18*E$7/(6*8*'Steel Eurocode 3'!X$8*'Steel Eurocode 3'!E$10)*100*1000*Y297","v":0.29595547060295091},{"$f":"C$14*B297*(8^3-2*8*B297^2+B297^3)/24/('Steel Eurocode 3'!E$10*'Steel Eurocode 3'!X$8)*100*1000","v":1.8175930226923445},null,66.677360639999733,85.171249151999632,5.7229047118672064E-7,2.234120603786162E-6,4.8203665549161636E-6,8.0558219197731238E-6]
[219,6.9760000000000053,-238.24033382399904,-210.50515200000024,-8.5543659925026834,-8.5543659925026834,-2.8667115192358565,-7.6640625,-17.8828125,-25.546875,-30.65625,{"$f":"'Graph Properties'!C$3*8/2-B298*C$3","v":-128.75515200000024},7.847999999999959,18.311999999999905,26.159999999999869,31.39199999999984,{"$f":"C$3*8/2*'Graph Properties'!B298-'Graph Properties'!C$3*B298^2/2","v":154.52833382399945},0.46380877391376635,0.90319731620937505,{"$f":"D$17*$E$6/(6*8*'Steel Eurocode 3'!$X$8*'Steel Eurocode 3'!$E$10)*100*1000*X298","v":0.97059767269896458},{"$f":"D$18*E$7/(6*8*'Steel Eurocode 3'!X$8*'Steel Eurocode 3'!E$10)*100*1000*Y298","v":0.82713068401300649},{"$f":"D$14*B298*(8^3-2*8*B298^2+B298^3)/24/('Steel Eurocode 3'!E$10*'Steel Eurocode 3'!X$8)*100*1000","v":5.3896315456675703},null,64.77043029333305,82.794774527999664,1.5971787195952441E-6,6.2352664587329075E-6,1.3453917958468783E-5,2.2485891120562532E-5,null,0.16132479092652743,0.314155588246739,{"$f":"C$17*$E$6/(6*8*'Steel Eurocode 3'!$X$8*'Steel Eurocode 3'!$E$10)*100*1000*AK298","v":0.33759919050398762},{"$f":"C$18*E$7/(6*8*'Steel Eurocode 3'!X$8*'Steel Eurocode 3'!E$10)*100*1000*Y298","v":0.28769762922191527},{"$f":"C$14*B298*(8^3-2*8*B298^2+B298^3)/24/('Steel Eurocode 3'!E$10*'Steel Eurocode 3'!X$8)*100*1000","v":1.7659343203366873},null,64.77043029333305,82.794774527999664,5.5554042420704134E-7,2.1687883334723155E-6,4.6796236377282723E-6,7.8211795201956621E-6]
[220,7.0080000000000053,-231.48201753599895,-211.88961600000022,-8.3019894183275547,-8.3019894183275547,-2.7821275200987268,-7.6640625,-17.8828125,-25.546875,-30.65625,{"$f":"'Graph Properties'!C$3*8/2-B299*C$3","v":-130.13961600000022},7.6027499999999595,17.739749999999905,25.342499999999873,30.410999999999838,{"$f":"C$3*8/2*'Graph Properties'!B299-'Graph Properties'!C$3*B299^2/2","v":150.38601753599937},0.44979424535067741,0.87609122319516997,{"$f":"D$17*$E$6/(6*8*'Steel Eurocode 3'!$X$8*'Steel Eurocode 3'!$E$10)*100*1000*X299","v":0.94186481416617507},{"$f":"D$18*E$7/(6*8*'Steel Eurocode 3'!X$8*'Steel Eurocode 3'!E$10)*100*1000*Y299","v":0.80320083262446418},{"$f":"D$14*B299*(8^3-2*8*B299^2+B299^3)/24/('Steel Eurocode 3'!E$10*'Steel Eurocode 3'!X$8)*100*1000","v":5.2310383029910676},null,62.853014186666314,80.399425535999569,1.5488652033469466E-6,6.0468076568537204E-6,1.304786789091812E-5,2.1808780122869819E-5,null,0.15645017229588776,0.30472738198092864,{"$f":"C$17*$E$6/(6*8*'Steel Eurocode 3'!$X$8*'Steel Eurocode 3'!$E$10)*100*1000*AK299","v":0.32760515275345214},{"$f":"C$18*E$7/(6*8*'Steel Eurocode 3'!X$8*'Steel Eurocode 3'!E$10)*100*1000*Y299","v":0.27937420265198748},{"$f":"C$14*B299*(8^3-2*8*B299^2+B299^3)/24/('Steel Eurocode 3'!E$10*'Steel Eurocode 3'!X$8)*100*1000","v":1.7139706104164705},null,62.853014186666314,80.399425535999569,5.3873572290328579E-7,2.1032374458621633E-6,4.5383888316236935E-6,7.5856626514329797E-6]
[221,7.0400000000000054,-224.67939839999895,-213.27408000000025,-8.0482198084296108,-8.0482198084296108,-2.6970772612792775,-7.6640625,-17.8828125,-25.546875,-30.65625,{"$f":"'Graph Properties'!C$3*8/2-B300*C$3","v":-131.52408000000025},7.3574999999999591,17.167499999999905,24.524999999999864,29.429999999999836,{"$f":"C$3*8/2*'Graph Properties'!B300-'Graph Properties'!C$3*B300^2/2","v":146.19939839999938},0.43573405053790115,0.848878575598361,{"$f":"D$17*$E$6/(6*8*'Steel Eurocode 3'!$X$8*'Steel Eurocode 3'!$E$10)*100*1000*X300","v":0.9129797348010964},{"$f":"D$18*E$7/(6*8*'Steel Eurocode 3'!X$8*'Steel Eurocode 3'!E$10)*100*1000*Y300","v":0.77908831623717401},{"$f":"D$14*B300*(8^3-2*8*B300^2+B300^3)/24/('Steel Eurocode 3'!E$10*'Steel Eurocode 3'!X$8)*100*1000","v":5.0715391312550775},null,60.925439999999696,77.985791999999606,1.5003994662663584E-6,5.8577399716453697E-6,1.2640447835876838E-5,2.1129233591860448E-5,null,0.15155966975231339,0.29526211325160384,{"$f":"C$17*$E$6/(6*8*'Steel Eurocode 3'!$X$8*'Steel Eurocode 3'!$E$10)*100*1000*AK300","v":0.3175581686264683},{"$f":"C$18*E$7/(6*8*'Steel Eurocode 3'!X$8*'Steel Eurocode 3'!E$10)*100*1000*Y300","v":0.27098724043032135},{"$f":"C$14*B300*(8^3-2*8*B300^2+B300^3)/24/('Steel Eurocode 3'!E$10*'Steel Eurocode 3'!X$8)*100*1000","v":1.6617100692185707},null,60.925439999999696,77.985791999999606,5.2187807522308118E-7,2.0374747727462152E-6,4.396677508131074E-6,7.3492986406471122E-6]
[222,7.0720000000000054,-217.8324764159988,-214.65854400000023,-7.7930980968425931,-7.7930980968425931,-2.6115744719437219,-7.6640625,-17.8828125,-25.546875,-30.65625,{"$f":"'Graph Properties'!C$3*8/2-B301*C$3","v":-132.90854400000023},7.1122499999999587,16.595249999999904,23.707499999999854,28.448999999999835,{"$f":"C$3*8/2*'Graph Properties'!B301-'Graph Properties'!C$3*B301^2/2","v":141.96847641599925},0.4216296625802663,0.82156281066354864,{"$f":"D$17*$E$6/(6*8*'Steel Eurocode 3'!$X$8*'Steel Eurocode 3'!$E$10)*100*1000*X301","v":0.88394734495315475},{"$f":"D$18*E$7/(6*8*'Steel Eurocode 3'!X$8*'Steel Eurocode 3'!E$10)*100*1000*Y301","v":0.75479902727044934},{"$f":"D$14*B301*(8^3-2*8*B301^2+B301^3)/24/('Steel Eurocode 3'!E$10*'Steel Eurocode 3'!X$8)*100*1000","v":4.9111592513751745},null,58.988035413333023,75.554463743999634,1.451786418702908E-6,5.6680830445055701E-6,1.2231701986489798E-5,2.0447330093125284E-5,null,0.14665379568009257,0.28576097762210395,{"$f":"C$17*$E$6/(6*8*'Steel Eurocode 3'!$X$8*'Steel Eurocode 3'!$E$10)*100*1000*AK301","v":0.30745994607066252},{"$f":"C$18*E$7/(6*8*'Steel Eurocode 3'!X$8*'Steel Eurocode 3'!E$10)*100*1000*Y301","v":0.26253879209406927},{"$f":"C$14*B301*(8^3-2*8*B301^2+B301^3)/24/('Steel Eurocode 3'!E$10*'Steel Eurocode 3'!X$8)*100*1000","v":1.6091609604767938},null,58.988035413333023,75.554463743999634,5.0496918911405497E-7,1.9715071459149807E-6,4.2545050387790598E-6,7.1121148150000992E-6]
[223,7.1040000000000054,-210.94125158399873,-216.04300800000021,-7.5366654844882115,-7.5366654844882115,-2.5256329687051808,-7.6640625,-17.8828125,-25.546875,-30.65625,{"$f":"'Graph Properties'!C$3*8/2-B302*C$3","v":-134.29300800000021},6.8669999999999582,16.022999999999904,22.889999999999858,27.467999999999826,{"$f":"C$3*8/2*'Graph Properties'!B302-'Graph Properties'!C$3*B302^2/2","v":137.6932515839992},0.40748255458260124,0.79414736563533306,{"$f":"D$17*$E$6/(6*8*'Steel Eurocode 3'!$X$8*'Steel Eurocode 3'!$E$10)*100*1000*X302","v":0.85477255497177895},{"$f":"D$18*E$7/(6*8*'Steel Eurocode 3'!X$8*'Steel Eurocode 3'!E$10)*100*1000*Y302","v":0.73033885814360355},{"$f":"D$14*B302*(8^3-2*8*B302^2+B302^3)/24/('Steel Eurocode 3'!E$10*'Steel Eurocode 3'!X$8)*100*1000","v":4.7499241511548949},null,57.041128106666292,73.10603059199957,1.4030309710060241E-6,5.4778565168320361E-6,1.1821674535901857E-5,1.9763148192255187E-5,null,0.14173306246351347,0.27622517065576813,{"$f":"C$17*$E$6/(6*8*'Steel Eurocode 3'!$X$8*'Steel Eurocode 3'!$E$10)*100*1000*AK302","v":0.29731219303366219},{"$f":"C$18*E$7/(6*8*'Steel Eurocode 3'!X$8*'Steel Eurocode 3'!E$10)*100*1000*Y302","v":0.25403090718038379},{"$f":"C$14*B302*(8^3-2*8*B302^2+B302^3)/24/('Steel Eurocode 3'!E$10*'Steel Eurocode 3'!X$8)*100*1000","v":1.556331635371853},null,57.041128106666292,73.10603059199957,4.8801077252383443E-7,1.9053413971589692E-6,4.1118867950962967E-6,6.8741385016539778E-6]
[224,7.1360000000000054,-204.00572390399878,-217.42747200000025,-7.2789634391762004,-7.2789634391762004,-2.4392666556237024,-7.6640625,-17.8828125,-25.546875,-30.65625,{"$f":"'Graph Properties'!C$3*8/2-B303*C$3","v":-135.67747200000025},6.6217499999999578,15.450749999999903,22.072499999999863,26.486999999999824,{"$f":"C$3*8/2*'Graph Properties'!B303-'Graph Properties'!C$3*B303^2/2","v":133.37372390399923},0.39329419964973489,0.76663567775831387,{"$f":"D$17*$E$6/(6*8*'Steel Eurocode 3'!$X$8*'Steel Eurocode 3'!$E$10)*100*1000*X303","v":0.82546027520639997},{"$f":"D$18*E$7/(6*8*'Steel Eurocode 3'!X$8*'Steel Eurocode 3'!E$10)*100*1000*Y303","v":0.70571370127595268},{"$f":"D$14*B303*(8^3-2*8*B303^2+B303^3)/24/('Steel Eurocode 3'!E$10*'Steel Eurocode 3'!X$8)*100*1000","v":4.5878595852857984},null,55.085045759999673,70.641082367999559,1.3541380335251355E-6,5.287080030022484E-6,1.1410409677257874E-5,1.9076766454841013E-5,null,0.13679798248686428,0.26665588791593531,{"$f":"C$17*$E$6/(6*8*'Steel Eurocode 3'!$X$8*'Steel Eurocode 3'!$E$10)*100*1000*AK303","v":0.28711661746309564},{"$f":"C$18*E$7/(6*8*'Steel Eurocode 3'!X$8*'Steel Eurocode 3'!E$10)*100*1000*Y303","v":0.24546563522641826},{"$f":"C$14*B303*(8^3-2*8*B303^2+B303^3)/24/('Steel Eurocode 3'!E$10*'Steel Eurocode 3'!X$8)*100*1000","v":1.5032305325313888},null,55.085045759999673,70.641082367999559,4.7100453340004704E-7,1.83898435826869E-6,3.9688381486114332E-6,6.6353970277707859E-6]
[225,7.1680000000000055,-197.02589337599892,-218.81193600000023,-7.0200336956042753,-7.0200336956042753,-2.3524895242062511,-7.6640625,-17.8828125,-25.546875,-30.65625,{"$f":"'Graph Properties'!C$3*8/2-B304*C$3","v":-137.06193600000023},6.3764999999999583,14.878499999999901,21.254999999999868,25.505999999999837,{"$f":"C$3*8/2*'Graph Properties'!B304-'Graph Properties'!C$3*B304^2/2","v":129.00989337599935},0.3790660708864958,0.73903118427709213,{"$f":"D$17*$E$6/(6*8*'Steel Eurocode 3'!$X$8*'Steel Eurocode 3'!$E$10)*100*1000*X304","v":0.79601541600644432},{"$f":"D$18*E$7/(6*8*'Steel Eurocode 3'!X$8*'Steel Eurocode 3'!E$10)*100*1000*Y304","v":0.68092944908681097},{"$f":"D$14*B304*(8^3-2*8*B304^2+B304^3)/24/('Steel Eurocode 3'!E$10*'Steel Eurocode 3'!X$8)*100*1000","v":4.4249915753474323},null,53.120116053332993,68.160208895999574,1.3051125166096713E-6,5.0957732254746291E-6,1.0997951603702707E-5,1.8388263446473628E-5,null,0.13184906813443331,0.25705432496594494,{"$f":"C$17*$E$6/(6*8*'Steel Eurocode 3'!$X$8*'Steel Eurocode 3'!$E$10)*100*1000*AK304","v":0.2768749273065893},{"$f":"C$18*E$7/(6*8*'Steel Eurocode 3'!X$8*'Steel Eurocode 3'!E$10)*100*1000*Y304","v":0.23684502576932551},{"$f":"C$14*B304*(8^3-2*8*B304^2+B304^3)/24/('Steel Eurocode 3'!E$10*'Steel Eurocode 3'!X$8)*100*1000","v":1.4498661780299582},null,53.120116053332993,68.160208895999574,4.5395217969032034E-7,1.7724428610346533E-6,3.8253744708531152E-6,6.395917720512565E-6]
[226,7.2000000000000055,-190.00175999999865,-220.19640000000021,-6.7599182553581398,-6.7599182553581398,-2.2653156534067063,-7.6640625,-17.8828125,-25.546875,-30.65625,{"$f":"'Graph Properties'!C$3*8/2-B305*C$3","v":-138.44640000000021},6.1312499999999579,14.306249999999901,20.437499999999858,24.524999999999835,{"$f":"C$3*8/2*'Graph Properties'!B305-'Graph Properties'!C$3*B305^2/2","v":124.6017599999991},0.36479964139771248,0.71133732243626702,{"$f":"D$17*$E$6/(6*8*'Steel Eurocode 3'!$X$8*'Steel Eurocode 3'!$E$10)*100*1000*X305","v":0.76644288772134039},{"$f":"D$18*E$7/(6*8*'Steel Eurocode 3'!X$8*'Steel Eurocode 3'!E$10)*100*1000*Y305","v":0.65599199399549202},{"$f":"D$14*B305*(8^3-2*8*B305^2+B305^3)/24/('Steel Eurocode 3'!E$10*'Steel Eurocode 3'!X$8)*100*1000","v":4.2613464098073282},null,51.146666666666249,65.663999999999533,1.2559593306090594E-6,4.9039557445861844E-6,1.0584344508381215E-5,1.7697717732743884E-5,null,0.12688683179050869,0.24742167736913628,{"$f":"C$17*$E$6/(6*8*'Steel Eurocode 3'!$X$8*'Steel Eurocode 3'!$E$10)*100*1000*AK305","v":0.26658883051177057},{"$f":"C$18*E$7/(6*8*'Steel Eurocode 3'!X$8*'Steel Eurocode 3'!E$10)*100*1000*Y305","v":0.22817112834625805},{"$f":"C$14*B305*(8^3-2*8*B305^2+B305^3)/24/('Steel Eurocode 3'!E$10*'Steel Eurocode 3'!X$8)*100*1000","v":1.3962471853890328},null,51.146666666666249,65.663999999999533,4.3685541934228148E-7,1.7057237372473684E-6,3.6815111333499875E-6,6.1557279070413504E-6]
[227,7.2320000000000055,-182.9333237759987,-221.58086400000025,-6.498659386911509,-6.498659386911509,-2.1777592096258704,-7.6640625,-17.8828125,-25.546875,-30.65625,{"$f":"'Graph Properties'!C$3*8/2-B306*C$3","v":-139.83086400000025},5.8859999999999575,13.733999999999901,19.619999999999848,23.543999999999834,{"$f":"C$3*8/2*'Graph Properties'!B306-'Graph Properties'!C$3*B306^2/2","v":120.14932377599916},0.35049638428821367,0.68355752948043891,{"$f":"D$17*$E$6/(6*8*'Steel Eurocode 3'!$X$8*'Steel Eurocode 3'!$E$10)*100*1000*X306","v":0.73674760070052048},{"$f":"D$18*E$7/(6*8*'Steel Eurocode 3'!X$8*'Steel Eurocode 3'!E$10)*100*1000*Y306","v":0.63090722842131186},{"$f":"D$14*B306*(8^3-2*8*B306^2+B306^3)/24/('Steel Eurocode 3'!E$10*'Steel Eurocode 3'!X$8)*100*1000","v":4.0969506440210237},null,49.165025279999668,63.153045503999579,1.2066833858727294E-6,4.7116472287548662E-6,1.0169632584438257E-5,1.7005207879242646E-5,null,0.12191178583937866,0.23775914068884829,{"$f":"C$17*$E$6/(6*8*'Steel Eurocode 3'!$X$8*'Steel Eurocode 3'!$E$10)*100*1000*AK306","v":0.25626003502626798},{"$f":"C$18*E$7/(6*8*'Steel Eurocode 3'!X$8*'Steel Eurocode 3'!E$10)*100*1000*Y306","v":0.2194459924943693},{"$f":"C$14*B306*(8^3-2*8*B306^2+B306^3)/24/('Steel Eurocode 3'!E$10*'Steel Eurocode 3'!X$8)*100*1000","v":1.342382255577006},null,49.165025279999668,63.153045503999579,4.1971596030355804E-7,1.6388338186973446E-6,3.5372635076306976E-6,5.9148549145191808E-6]
[228,7.2640000000000056,-175.82058470399863,-222.96532800000023,-6.2362996256260814,-6.2362996256260814,-2.0898344467114627,-7.6640625,-17.8828125,-25.546875,-30.65625,{"$f":"'Graph Properties'!C$3*8/2-B307*C$3","v":-141.21532800000023},5.6407499999999571,13.1617499999999,18.802499999999867,22.562999999999832,{"$f":"C$3*8/2*'Graph Properties'!B307-'Graph Properties'!C$3*B307^2/2","v":115.65258470399908},0.33615777266282787,0.65569524265420787,{"$f":"D$17*$E$6/(6*8*'Steel Eurocode 3'!$X$8*'Steel Eurocode 3'!$E$10)*100*1000*X307","v":0.70693446529340909},{"$f":"D$18*E$7/(6*8*'Steel Eurocode 3'!X$8*'Steel Eurocode 3'!E$10)*100*1000*Y307","v":0.60568104478358298},{"$f":"D$14*B307*(8^3-2*8*B307^2+B307^3)/24/('Steel Eurocode 3'!E$10*'Steel Eurocode 3'!X$8)*100*1000","v":3.9318311002320536},null,47.175519573332963,60.627935231999516,1.1572895927501096E-6,4.5188673193783889E-6,9.7538600250186924E-6,1.6310812451560772E-5,null,0.11692444266533145,0.22806791048842018,{"$f":"C$17*$E$6/(6*8*'Steel Eurocode 3'!$X$8*'Steel Eurocode 3'!$E$10)*100*1000*AK307","v":0.24589024879770749},{"$f":"C$18*E$7/(6*8*'Steel Eurocode 3'!X$8*'Steel Eurocode 3'!E$10)*100*1000*Y307","v":0.21067166775081142},{"$f":"C$14*B307*(8^3-2*8*B307^2+B307^3)/24/('Steel Eurocode 3'!E$10*'Steel Eurocode 3'!X$8)*100*1000","v":1.2882801770091921},null,47.175519573332963,60.627935231999516,4.0253551052177724E-7,1.5717799371750918E-6,3.3926469652238923E-6,5.6733260701080944E-6]
[229,7.2960000000000056,-168.66354278399885,-224.34979200000026,-5.9728817737515616,-5.9728817737515616,-2.0015557059581206,-7.6640625,-17.8828125,-25.546875,-30.65625,{"$f":"'Graph Properties'!C$3*8/2-B308*C$3","v":-142.59979200000026},5.3954999999999576,12.5894999999999,17.984999999999857,21.581999999999823,{"$f":"C$3*8/2*'Graph Properties'!B308-'Graph Properties'!C$3*B308^2/2","v":111.11154278399931},0.32178527962638404,0.62775389920217439,{"$f":"D$17*$E$6/(6*8*'Steel Eurocode 3'!$X$8*'Steel Eurocode 3'!$E$10)*100*1000*X308","v":0.67700839184943729},{"$f":"D$18*E$7/(6*8*'Steel Eurocode 3'!X$8*'Steel Eurocode 3'!E$10)*100*1000*Y308","v":0.58031933550162174},{"$f":"D$14*B308*(8^3-2*8*B308^2+B308^3)/24/('Steel Eurocode 3'!E$10*'Steel Eurocode 3'!X$8)*100*1000","v":3.7660148675719438},null,45.178477226666303,58.089259007999544,1.1077828615906289E-6,4.3256356578544688E-6,9.3370710232673782E-6,1.5614610015289123E-5,null,0.11192531465265526,0.21834918233119105,{"$f":"C$17*$E$6/(6*8*'Steel Eurocode 3'!$X$8*'Steel Eurocode 3'!$E$10)*100*1000*AK308","v":0.2354811797737173},{"$f":"C$18*E$7/(6*8*'Steel Eurocode 3'!X$8*'Steel Eurocode 3'!E$10)*100*1000*Y308","v":0.20185020365273795},{"$f":"C$14*B308*(8^3-2*8*B308^2+B308^3)/24/('Steel Eurocode 3'!E$10*'Steel Eurocode 3'!X$8)*100*1000","v":1.233949825547819},null,45.178477226666303,58.089259007999544,3.8531577794456651E-7,1.5045689244711192E-6,3.2476768776582184E-6,5.431168700970129E-6]
[230,7.3280000000000056,-161.46219801599869,-225.73425600000024,-5.7084489004256316,-5.7084489004256316,-1.9129374161073989,-7.6640625,-17.8828125,-25.546875,-30.65625,{"$f":"'Graph Properties'!C$3*8/2-B309*C$3","v":-143.98425600000024},5.1502499999999571,12.017249999999899,17.167499999999862,20.600999999999821,{"$f":"C$3*8/2*'Graph Properties'!B309-'Graph Properties'!C$3*B309^2/2","v":106.52619801599917},0.30738037828371023,0.59973693636893843,{"$f":"D$17*$E$6/(6*8*'Steel Eurocode 3'!$X$8*'Steel Eurocode 3'!$E$10)*100*1000*X309","v":0.64697429071803303},{"$f":"D$18*E$7/(6*8*'Steel Eurocode 3'!X$8*'Steel Eurocode 3'!E$10)*100*1000*Y309","v":0.55482799299474195},{"$f":"D$14*B309*(8^3-2*8*B309^2+B309^3)/24/('Steel Eurocode 3'!E$10*'Steel Eurocode 3'!X$8)*100*1000","v":3.5995293020602084},null,43.174225919999628,55.537606655999582,1.0581681027437157E-6,4.1319718855808181E-6,8.9193097723291737E-6,1.4916679136018558E-5,null,0.10691491418563835,0.20860415178050026,{"$f":"C$17*$E$6/(6*8*'Steel Eurocode 3'!$X$8*'Steel Eurocode 3'!$E$10)*100*1000*AK309","v":0.22503453590192452},{"$f":"C$18*E$7/(6*8*'Steel Eurocode 3'!X$8*'Steel Eurocode 3'!E$10)*100*1000*Y309","v":0.1929836497373015},{"$f":"C$14*B309*(8^3-2*8*B309^2+B309^3)/24/('Steel Eurocode 3'!E$10*'Steel Eurocode 3'!X$8)*100*1000","v":1.1794001645020342},null,43.174225919999628,55.537606655999582,3.6805847051955332E-7,1.4372076123759368E-6,3.1023686164623214E-6,5.1884101342673243E-6]
[231,7.3600000000000056,-154.21655039999865,-227.11872000000022,-5.4430443416739873,-5.4430443416739873,-1.8239940933477734,-7.6640625,-17.8828125,-25.546875,-30.65625,{"$f":"'Graph Properties'!C$3*8/2-B310*C$3","v":-145.36872000000022},4.9049999999999567,11.444999999999899,16.349999999999852,19.619999999999834,{"$f":"C$3*8/2*'Graph Properties'!B310-'Graph Properties'!C$3*B310^2/2","v":101.89655039999911},0.29294454173963552,0.57164779139910005,{"$f":"D$17*$E$6/(6*8*'Steel Eurocode 3'!$X$8*'Steel Eurocode 3'!$E$10)*100*1000*X310","v":0.61683707224862594},{"$f":"D$18*E$7/(6*8*'Steel Eurocode 3'!X$8*'Steel Eurocode 3'!E$10)*100*1000*Y310","v":0.52921290968225776},{"$f":"D$14*B310*(8^3-2*8*B310^2+B310^3)/24/('Steel Eurocode 3'!E$10*'Steel Eurocode 3'!X$8)*100*1000","v":3.4324020266043678},null,41.163093333332995,52.973567999999602,1.0084502265587993E-6,3.9378956439551546E-6,8.5006204653489382E-6,1.4217098379339939E-5,null,0.10189375364856884,0.19883401439968698,{"$f":"C$17*$E$6/(6*8*'Steel Eurocode 3'!$X$8*'Steel Eurocode 3'!$E$10)*100*1000*AK310","v":0.21455202512995683},{"$f":"C$18*E$7/(6*8*'Steel Eurocode 3'!X$8*'Steel Eurocode 3'!E$10)*100*1000*Y310","v":0.18407405554165485},{"$f":"C$14*B310*(8^3-2*8*B310^2+B310^3)/24/('Steel Eurocode 3'!E$10*'Steel Eurocode 3'!X$8)*100*1000","v":1.1246402446279058},null,41.163093333332995,52.973567999999602,3.5076529619436494E-7,1.3697028326800536E-6,2.9567375531648476E-6,4.9450776971617174E-6]
[232,7.3920000000000057,-146.92659993599867,-228.50318400000026,-5.1767117004103111,-5.1767117004103111,-1.7347403413146369,-7.6640625,-17.8828125,-25.546875,-30.65625,{"$f":"'Graph Properties'!C$3*8/2-B311*C$3","v":-146.75318400000026},4.6597499999999563,10.872749999999899,15.532499999999843,18.638999999999832,{"$f":"C$3*8/2*'Graph Properties'!B311-'Graph Properties'!C$3*B311^2/2","v":97.222599935999142},0.2784792430989883,0.54348990153725907,{"$f":"D$17*$E$6/(6*8*'Steel Eurocode 3'!$X$8*'Steel Eurocode 3'!$E$10)*100*1000*X311","v":0.58660164679064297},{"$f":"D$18*E$7/(6*8*'Steel Eurocode 3'!X$8*'Steel Eurocode 3'!E$10)*100*1000*Y311","v":0.50347997798348287},{"$f":"D$14*B311*(8^3-2*8*B311^2+B311^3)/24/('Steel Eurocode 3'!E$10*'Steel Eurocode 3'!X$8)*100*1000","v":3.2646609309999381},null,39.145407146666287,50.397732863999522,9.5863414338530798E-7,3.7434265743751912E-6,8.0810472954715292E-6,1.351594631084412E-5,null,9.6862345425735075E-2,0.18903996575209009,{"$f":"C$17*$E$6/(6*8*'Steel Eurocode 3'!$X$8*'Steel Eurocode 3'!$E$10)*100*1000*AK311","v":0.20403535540544102},{"$f":"C$18*E$7/(6*8*'Steel Eurocode 3'!X$8*'Steel Eurocode 3'!E$10)*100*1000*Y311","v":0.17512347060295055},{"$f":"C$14*B311*(8^3-2*8*B311^2+B311^3)/24/('Steel Eurocode 3'!E$10*'Steel Eurocode 3'!X$8)*100*1000","v":1.0696792041284202},null,39.145407146666287,50.397732863999522,3.3343796291662879E-7,1.3020614171739794E-6,2.8107990592944447E-6,4.7011987168153454E-6]
[233,7.4240000000000057,-139.59234662399879,-229.88764800000024,-4.9094948464362851,-4.9094948464362851,-1.6451908510903022,-7.6640625,-17.8828125,-25.546875,-30.65625,{"$f":"'Graph Properties'!C$3*8/2-B312*C$3","v":-148.13764800000024},4.4144999999999559,10.300499999999898,14.714999999999861,17.657999999999831,{"$f":"C$3*8/2*'Graph Properties'!B312-'Graph Properties'!C$3*B312^2/2","v":92.504346623999254},0.26398595546659742,0.51526670402801611,{"$f":"D$17*$E$6/(6*8*'Steel Eurocode 3'!$X$8*'Steel Eurocode 3'!$E$10)*100*1000*X312","v":0.5562729246935153},{"$f":"D$18*E$7/(6*8*'Steel Eurocode 3'!X$8*'Steel Eurocode 3'!E$10)*100*1000*Y312","v":0.47763509031773438},{"$f":"D$14*B312*(8^3-2*8*B312^2+B312^3)/24/('Steel Eurocode 3'!E$10*'Steel Eurocode 3'!X$8)*100*1000","v":3.096334171930422},null,37.121495039999672,47.810691071999599,9.0872476357267074E-7,3.5485843182386446E-6,7.6606344558418077E-6,1.2813301496121969E-5,null,9.1821201901425176E-2,0.179223201401049,{"$f":"C$17*$E$6/(6*8*'Steel Eurocode 3'!$X$8*'Steel Eurocode 3'!$E$10)*100*1000*AK312","v":0.19348623467600531},{"$f":"C$18*E$7/(6*8*'Steel Eurocode 3'!X$8*'Steel Eurocode 3'!E$10)*100*1000*Y312","v":0.16613394445834237},{"$f":"C$14*B312*(8^3-2*8*B312^2+B312^3)/24/('Steel Eurocode 3'!E$10*'Steel Eurocode 3'!X$8)*100*1000","v":1.0145262686534802},null,37.121495039999672,47.810691071999599,3.1607817863397236E-7,1.234290197648224E-6,2.6645685063797589E-6,4.4568005203902489E-6]
[234,7.4560000000000057,-132.21379046399875,-231.27211200000022,-4.6414379164415811,-4.6414379164415811,-1.5553604012039988,-7.6640625,-17.8828125,-25.546875,-30.65625,{"$f":"'Graph Properties'!C$3*8/2-B313*C$3","v":-149.52211200000022},4.1692499999999564,9.7282499999998979,13.897499999999852,16.676999999999822,{"$f":"C$3*8/2*'Graph Properties'!B313-'Graph Properties'!C$3*B313^2/2","v":87.741790463999223},0.24946615194729121,0.4869816361159709,{"$f":"D$17*$E$6/(6*8*'Steel Eurocode 3'!$X$8*'Steel Eurocode 3'!$E$10)*100*1000*X313","v":0.52585581630667011},{"$f":"D$18*E$7/(6*8*'Steel Eurocode 3'!X$8*'Steel Eurocode 3'!E$10)*100*1000*Y313","v":0.45168413910432414},{"$f":"D$14*B313*(8^3-2*8*B313^2+B313^3)/24/('Steel Eurocode 3'!E$10*'Steel Eurocode 3'!X$8)*100*1000","v":2.9274501729673248},null,35.091684693333036,45.213032447999581,8.5872699747031613E-7,3.3533885169432286E-6,7.2394261396046288E-6,1.2109242500764338E-5,null,8.6770835459927392E-2,0.1693849169099029,{"$f":"C$17*$E$6/(6*8*'Steel Eurocode 3'!$X$8*'Steel Eurocode 3'!$E$10)*100*1000*AK313","v":0.18290637088927653},{"$f":"C$18*E$7/(6*8*'Steel Eurocode 3'!X$8*'Steel Eurocode 3'!E$10)*100*1000*Y313","v":0.15710752664498229},{"$f":"C$14*B313*(8^3-2*8*B313^2+B313^3)/24/('Steel Eurocode 3'!E$10*'Steel Eurocode 3'!X$8)*100*1000","v":0.95919075129990972},null,35.091684693333036,45.213032447999581,2.9868765129402296E-7,1.1663960058932968E-6,2.5180612659494359E-6,4.2119104350484648E-6]
[235,7.4880000000000058,-124.7909314559988,-232.65657600000026,-4.3725853140038673,-4.3725853140038673,-1.4652638576318751,-7.6640625,-17.8828125,-25.546875,-30.65625,{"$f":"'Graph Properties'!C$3*8/2-B314*C$3","v":-150.90657600000026},3.923999999999956,9.1559999999998976,13.079999999999856,15.69599999999982,{"$f":"C$3*8/2*'Graph Properties'!B314-'Graph Properties'!C$3*B314^2/2","v":82.934931455999276},0.23492130564589853,0.45863813504572365,{"$f":"D$17*$E$6/(6*8*'Steel Eurocode 3'!$X$8*'Steel Eurocode 3'!$E$10)*100*1000*X314","v":0.49535523197953507},{"$f":"D$18*E$7/(6*8*'Steel Eurocode 3'!X$8*'Steel Eurocode 3'!E$10)*100*1000*Y314","v":0.42563301676256754},{"$f":"D$14*B314*(8^3-2*8*B314^2+B314^3)/24/('Steel Eurocode 3'!E$10*'Steel Eurocode 3'!X$8)*100*1000","v":2.758037624570143},null,33.056303786666319,42.605346815999553,8.086457554276729E-7,3.1578588118866581E-6,6.8174665399048533E-6,1.140384789036209E-5,null,8.171175848552989E-2,0.15952630784199076,{"$f":"C$17*$E$6/(6*8*'Steel Eurocode 3'!$X$8*'Steel Eurocode 3'!$E$10)*100*1000*AK314","v":0.17229747199288176},{"$f":"C$18*E$7/(6*8*'Steel Eurocode 3'!X$8*'Steel Eurocode 3'!E$10)*100*1000*Y314","v":0.14804626670002347},{"$f":"C$14*B314*(8^3-2*8*B314^2+B314^3)/24/('Steel Eurocode 3'!E$10*'Steel Eurocode 3'!X$8)*100*1000","v":0.90368205261144907},null,33.056303786666319,42.605346815999553,2.8126808884440792E-7,1.0983856736997068E-6,2.3712927095321228E-6,3.9665557879520304E-6]
[236,7.5200000000000058,-117.32376959999849,-234.04104000000024,-4.1029817095888097,-4.1029817095888097,-1.3749161737969979,-7.6640625,-17.8828125,-25.546875,-30.65625,{"$f":"'Graph Properties'!C$3*8/2-B315*C$3","v":-152.29104000000024},3.6787499999999556,8.5837499999998972,12.262499999999847,14.714999999999819,{"$f":"C$3*8/2*'Graph Properties'!B315-'Graph Properties'!C$3*B315^2/2","v":78.083769599998959},0.22035288966724781,0.43023963806187465,{"$f":"D$17*$E$6/(6*8*'Steel Eurocode 3'!$X$8*'Steel Eurocode 3'!$E$10)*100*1000*X315","v":0.46477608206153986},{"$f":"D$18*E$7/(6*8*'Steel Eurocode 3'!X$8*'Steel Eurocode 3'!E$10)*100*1000*Y315","v":0.39948761571177882},{"$f":"D$14*B315*(8^3-2*8*B315^2+B315^3)/24/('Steel Eurocode 3'!E$10*'Steel Eurocode 3'!X$8)*100*1000","v":2.5881254840863686},null,31.015679999999577,39.988223999999491,7.5848594779416991E-7,2.9620148444666481E-6,6.3947998498873389E-6,1.0697196230506085E-5,null,7.6644483362520971E-2,0.14964856976065202,{"$f":"C$17*$E$6/(6*8*'Steel Eurocode 3'!$X$8*'Steel Eurocode 3'!$E$10)*100*1000*AK315","v":0.16166124593444864},{"$f":"C$18*E$7/(6*8*'Steel Eurocode 3'!X$8*'Steel Eurocode 3'!E$10)*100*1000*Y315","v":0.1389522141606187},{"$f":"C$14*B315*(8^3-2*8*B315^2+B315^3)/24/('Steel Eurocode 3'!E$10*'Steel Eurocode 3'!X$8)*100*1000","v":0.8480096605787576},null,31.015679999999577,39.988223999999491,2.638211992327547E-7,1.0302660328579645E-6,2.2242782086564655E-6,3.7207639062629857E-6]
[237,7.5520000000000058,-109.81230489599869,-235.42550400000027,-3.8326720405500732,-3.8326720405500732,-1.2843323905693556,-7.6640625,-17.8828125,-25.546875,-30.65625,{"$f":"'Graph Properties'!C$3*8/2-B316*C$3","v":-153.67550400000027},3.4334999999999556,8.0114999999998968,11.444999999999851,13.733999999999817,{"$f":"C$3*8/2*'Graph Properties'!B316-'Graph Properties'!C$3*B316^2/2","v":73.188304895999181},0.20576237711616782,0.4017895824090239,{"$f":"D$17*$E$6/(6*8*'Steel Eurocode 3'!$X$8*'Steel Eurocode 3'!$E$10)*100*1000*X316","v":0.43412327690211489},{"$f":"D$18*E$7/(6*8*'Steel Eurocode 3'!X$8*'Steel Eurocode 3'!E$10)*100*1000*Y316","v":0.37325382837127336},{"$f":"D$14*B316*(8^3-2*8*B316^2+B316^3)/24/('Steel Eurocode 3'!E$10*'Steel Eurocode 3'!X$8)*100*1000","v":2.4177429757514934},null,28.97014101333292,37.362253823999481,7.0825248491923591E-7,2.765876256080914E-6,5.9714702626969466E-6,9.9893660867871854E-6,null,7.1569522475188815E-2,0.13975289822922571,{"$f":"C$17*$E$6/(6*8*'Steel Eurocode 3'!$X$8*'Steel Eurocode 3'!$E$10)*100*1000*AK316","v":0.15099940066160517},{"$f":"C$18*E$7/(6*8*'Steel Eurocode 3'!X$8*'Steel Eurocode 3'!E$10)*100*1000*Y316","v":0.12982741856392113},{"$f":"C$14*B316*(8^3-2*8*B316^2+B316^3)/24/('Steel Eurocode 3'!E$10*'Steel Eurocode 3'!X$8)*100*1000","v":0.79218315063941458},null,28.97014101333292,37.362253823999481,2.4634869040669074E-7,9.6204391515857877E-7,2.0770331348511113E-6,3.4745621171433682E-6]
[238,7.5840000000000058,-102.25653734399856,-236.80996800000025,-3.561701511129308,-3.561701511129308,-1.1935276362658493,-7.6640625,-17.8828125,-25.546875,-30.65625,{"$f":"'Graph Properties'!C$3*8/2-B317*C$3","v":-155.05996800000025},3.1882499999999552,7.4392499999998956,10.627499999999856,12.75299999999983,{"$f":"C$3*8/2*'Graph Properties'!B317-'Graph Properties'!C$3*B317^2/2","v":68.248537343999033},0.19115124109748716,0.37329140533177146,{"$f":"D$17*$E$6/(6*8*'Steel Eurocode 3'!$X$8*'Steel Eurocode 3'!$E$10)*100*1000*X317","v":0.40340172685068887},{"$f":"D$18*E$7/(6*8*'Steel Eurocode 3'!X$8*'Steel Eurocode 3'!E$10)*100*1000*Y317","v":0.3469375471603659},{"$f":"D$14*B317*(8^3-2*8*B317^2+B317^3)/24/('Steel Eurocode 3'!E$10*'Steel Eurocode 3'!X$8)*100*1000","v":2.2469195906889943},null,26.920014506666348,34.728026111999554,6.5795027715229953E-7,2.5694626881271709E-6,5.5475219714785313E-6,9.2804360247962461E-6,null,6.6487388207821602E-2,0.12984048881105092,{"$f":"C$17*$E$6/(6*8*'Steel Eurocode 3'!$X$8*'Steel Eurocode 3'!$E$10)*100*1000*AK317","v":0.14031364412197872},{"$f":"C$18*E$7/(6*8*'Steel Eurocode 3'!X$8*'Steel Eurocode 3'!E$10)*100*1000*Y317","v":0.12067392944708376},{"$f":"C$14*B317*(8^3-2*8*B317^2+B317^3)/24/('Steel Eurocode 3'!E$10*'Steel Eurocode 3'!X$8)*100*1000","v":0.73621218567791447},null,26.920014506666348,34.728026111999554,2.2885227031384327E-7,8.9372615239205927E-7,1.9295728596447065E-6,3.2279777477552155E-6]
[239,7.6160000000000059,-94.656466943998481,-238.19443200000023,-3.2901155924561682,-3.2901155924561682,-1.1025171266503038,-7.6640625,-17.8828125,-25.546875,-30.65625,{"$f":"'Graph Properties'!C$3*8/2-B318*C$3","v":-156.44443200000023},2.9429999999999548,6.8669999999998952,9.809999999999846,11.771999999999821,{"$f":"C$3*8/2*'Graph Properties'!B318-'Graph Properties'!C$3*B318^2/2","v":63.264466943998968},0.17652095471603432,0.34474854407471756,{"$f":"D$17*$E$6/(6*8*'Steel Eurocode 3'!$X$8*'Steel Eurocode 3'!$E$10)*100*1000*X318","v":0.37261634225668705},{"$f":"D$18*E$7/(6*8*'Steel Eurocode 3'!X$8*'Steel Eurocode 3'!E$10)*100*1000*Y318","v":0.32054466449836899},{"$f":"D$14*B318*(8^3-2*8*B318^2+B318^3)/24/('Steel Eurocode 3'!E$10*'Steel Eurocode 3'!X$8)*100*1000","v":2.0756850869103602},null,24.86562815999963,32.086130687999514,6.0758423484278952E-7,2.3727937820031328E-6,5.1229991693769548E-6,8.5704846101241304E-6,null,6.1398592944707592E-2,0.1199125370694669,{"$f":"C$17*$E$6/(6*8*'Steel Eurocode 3'!$X$8*'Steel Eurocode 3'!$E$10)*100*1000*AK318","v":0.12960568426319549},{"$f":"C$18*E$7/(6*8*'Steel Eurocode 3'!X$8*'Steel Eurocode 3'!E$10)*100*1000*Y318","v":0.11149379634725876},{"$f":"C$14*B318*(8^3-2*8*B318^2+B318^3)/24/('Steel Eurocode 3'!E$10*'Steel Eurocode 3'!X$8)*100*1000","v":0.68010651602567507},null,24.86562815999963,32.086130687999514,2.1133364690183981E-7,8.2531957634891577E-7,1.7819127545658973E-6,2.9810381252605664E-6]
[240,7.6480000000000059,-87.012093695998743,-239.57889600000027,-3.0179600225483032,-3.0179600225483032,-1.011316164933461,-7.6640625,-17.8828125,-25.546875,-30.65625,{"$f":"'Graph Properties'!C$3*8/2-B319*C$3","v":-157.82889600000027},2.6977499999999548,6.2947499999998948,8.9924999999998505,10.790999999999826,{"$f":"C$3*8/2*'Graph Properties'!B319-'Graph Properties'!C$3*B319^2/2","v":58.236093695999216},0.16187299107663813,0.31616443588246218,{"$f":"D$17*$E$6/(6*8*'Steel Eurocode 3'!$X$8*'Steel Eurocode 3'!$E$10)*100*1000*X319","v":0.34177203346954155},{"$f":"D$18*E$7/(6*8*'Steel Eurocode 3'!X$8*'Steel Eurocode 3'!E$10)*100*1000*Y319","v":0.29408107280459855},{"$f":"D$14*B319*(8^3-2*8*B319^2+B319^3)/24/('Steel Eurocode 3'!E$10*'Steel Eurocode 3'!X$8)*100*1000","v":1.9040694893150625},null,22.807309653332993,29.437157375999504,5.5715926834013475E-7,2.1758891791065161E-6,4.6979460495370748E-6,7.8595904083616967E-6,null,5.6303649070134992E-2,0.10997023856781291,{"$f":"C$17*$E$6/(6*8*'Steel Eurocode 3'!$X$8*'Steel Eurocode 3'!$E$10)*100*1000*AK319","v":0.11887722903288402},{"$f":"C$18*E$7/(6*8*'Steel Eurocode 3'!X$8*'Steel Eurocode 3'!E$10)*100*1000*Y319","v":0.10228906880159948},{"$f":"C$14*B319*(8^3-2*8*B319^2+B319^3)/24/('Steel Eurocode 3'!E$10*'Steel Eurocode 3'!X$8)*100*1000","v":0.62387597946102957},null,22.807309653332993,29.437157375999504,1.9379452811830772E-7,7.5683101881965766E-7,1.6340681911433301E-6,2.7337705768214593E-6]
[241,7.6800000000000059,-79.323417599998606,-240.96336000000025,-2.7452808063113512,-2.7452808063113512,-0.91994014177297978,-7.6640625,-17.8828125,-25.546875,-30.65625,{"$f":"'Graph Properties'!C$3*8/2-B320*C$3","v":-159.21336000000025},2.4524999999999544,5.7224999999998936,8.1749999999998408,9.8099999999998175,{"$f":"C$3*8/2*'Graph Properties'!B320-'Graph Properties'!C$3*B320^2/2","v":53.163417599999093},0.14720882328412707,0.28754251799960562,{"$f":"D$17*$E$6/(6*8*'Steel Eurocode 3'!$X$8*'Steel Eurocode 3'!$E$10)*100*1000*X320","v":0.3108737108386786},{"$f":"D$18*E$7/(6*8*'Steel Eurocode 3'!X$8*'Steel Eurocode 3'!E$10)*100*1000*Y320","v":0.26755266449836884},{"$f":"D$14*B320*(8^3-2*8*B320^2+B320^3)/24/('Steel Eurocode 3'!E$10*'Steel Eurocode 3'!X$8)*100*1000","v":1.7321030896905709},null,20.745386666666263,26.781695999999499,5.0668028799376374E-7,1.9787685208350345E-6,4.2724068051037488E-6,7.1478319850998049E-6,null,5.120306896839201E-2,0.100014788869428,{"$f":"C$17*$E$6/(6*8*'Steel Eurocode 3'!$X$8*'Steel Eurocode 3'!$E$10)*100*1000*AK320","v":0.1081299863786708},{"$f":"C$18*E$7/(6*8*'Steel Eurocode 3'!X$8*'Steel Eurocode 3'!E$10)*100*1000*Y320","v":9.3061796347258696E-2},{"$f":"C$14*B320*(8^3-2*8*B320^2+B320^3)/24/('Steel Eurocode 3'!E$10*'Steel Eurocode 3'!X$8)*100*1000","v":0.56753050120923032},null,20.745386666666263,26.781695999999499,1.7623662191087432E-7,6.8826731159479442E-7,1.4860545409056518E-6,2.4862024295999317E-6]
[242,7.712000000000006,-71.590438655998327,-242.34782400000023,-2.4721242155389476,-2.4721242155389476,-0.82840453527343816,-7.6640625,-17.8828125,-25.546875,-30.65625,{"$f":"'Graph Properties'!C$3*8/2-B321*C$3","v":-160.59782400000023},2.2072499999999544,5.1502499999998932,7.3574999999998454,8.8289999999998088,{"$f":"C$3*8/2*'Graph Properties'!B321-'Graph Properties'!C$3*B321^2/2","v":48.046438655998827},0.13252992444332976,0.2588862276707477,{"$f":"D$17*$E$6/(6*8*'Steel Eurocode 3'!$X$8*'Steel Eurocode 3'!$E$10)*100*1000*X321","v":0.27992628471352848},{"$f":"D$18*E$7/(6*8*'Steel Eurocode 3'!X$8*'Steel Eurocode 3'!E$10)*100*1000*Y321","v":0.240965331998994},{"$f":"D$14*B321*(8^3-2*8*B321^2+B321^3)/24/('Steel Eurocode 3'!E$10*'Steel Eurocode 3'!X$8)*100*1000","v":1.5598164467123476},null,18.680186879999553,24.120336383999472,4.5615220415310546E-7,1.7814514485864031E-6,3.8464256292218369E-6,6.4352879059293142E-6,null,4.6097365023766886E-2,9.004738353765139E-2,{"$f":"C$17*$E$6/(6*8*'Steel Eurocode 3'!$X$8*'Steel Eurocode 3'!$E$10)*100*1000*AK321","v":9.7365664248183811E-2},{"$f":"C$18*E$7/(6*8*'Steel Eurocode 3'!X$8*'Steel Eurocode 3'!E$10)*100*1000*Y321","v":8.3814028521389208E-2},{"$f":"C$14*B321*(8^3-2*8*B321^2+B321^3)/24/('Steel Eurocode 3'!E$10*'Steel Eurocode 3'!X$8)*100*1000","v":0.51108009394244691},null,18.680186879999553,24.120336383999472,1.5866163622716709E-7,6.1963528646483586E-7,1.3378871753815084E-6,2.2383610107580223E-6]
[243,7.744000000000006,-63.813156863998614,-243.73228800000027,-2.1985367889127305,-2.1985367889127305,-0.73672491098633441,-7.6640625,-17.8828125,-25.546875,-30.65625,{"$f":"'Graph Properties'!C$3*8/2-B322*C$3","v":-161.98228800000027},1.961999999999954,4.5779999999998928,6.5399999999998499,7.8479999999998142,{"$f":"C$3*8/2*'Graph Properties'!B322-'Graph Properties'!C$3*B322^2/2","v":42.8851568639991},0.11783776765907489,0.23019900214048894,{"$f":"D$17*$E$6/(6*8*'Steel Eurocode 3'!$X$8*'Steel Eurocode 3'!$E$10)*100*1000*X322","v":0.24893466544352261},{"$f":"D$18*E$7/(6*8*'Steel Eurocode 3'!X$8*'Steel Eurocode 3'!E$10)*100*1000*Y322","v":0.21432496772579004},{"$f":"D$14*B322*(8^3-2*8*B322^2+B322^3)/24/('Steel Eurocode 3'!E$10*'Steel Eurocode 3'!X$8)*100*1000","v":1.387240385943854},null,16.612037973333031,21.453668351999568,4.055799271675885E-7,1.5839576037583374E-6,3.4200467150361976E-6,5.7220367364410872E-6,null,4.0987049620547791E-2,8.0069218135822254E-2,{"$f":"C$17*$E$6/(6*8*'Steel Eurocode 3'!$X$8*'Steel Eurocode 3'!$E$10)*100*1000*AK322","v":8.6585970589051334E-2},{"$f":"C$18*E$7/(6*8*'Steel Eurocode 3'!X$8*'Steel Eurocode 3'!E$10)*100*1000*Y322","v":7.4547814861144354E-2},{"$f":"C$14*B322*(8^3-2*8*B322^2+B322^3)/24/('Steel Eurocode 3'!E$10*'Steel Eurocode 3'!X$8)*100*1000","v":0.45453485777976865},null,16.612037973333031,21.453668351999568,1.4107127901481337E-7,5.5094177522029126E-7,1.1895814660995468E-6,1.9902736474577693E-6]
[244,7.776000000000006,-55.991572223998496,-245.11675200000025,-1.9245653320023184,-1.9245653320023184,-0.64491692191008121,-7.6640625,-17.8828125,-25.546875,-30.65625,{"$f":"'Graph Properties'!C$3*8/2-B323*C$3","v":-163.36675200000025},1.7167499999999538,4.0057499999998925,5.7224999999998403,6.8669999999998055,{"$f":"C$3*8/2*'Graph Properties'!B323-'Graph Properties'!C$3*B323^2/2","v":37.679572223999003},0.10313382603619103,0.20148427865342911,{"$f":"D$17*$E$6/(6*8*'Steel Eurocode 3'!$X$8*'Steel Eurocode 3'!$E$10)*100*1000*X323","v":0.21790376337808362},{"$f":"D$18*E$7/(6*8*'Steel Eurocode 3'!X$8*'Steel Eurocode 3'!E$10)*100*1000*Y323","v":0.18763746409806834},{"$f":"D$14*B323*(8^3-2*8*B323^2+B323^3)/24/('Steel Eurocode 3'!E$10*'Steel Eurocode 3'!X$8)*100*1000","v":1.2144059998365464},null,14.541267626666297,18.782281727999475,3.549683673866416E-7,1.386306627748552E-6,2.9933142556916883E-6,5.0081570422259795E-6,null,3.5872635143022968E-2,7.0081488227279706E-2,{"$f":"C$17*$E$6/(6*8*'Steel Eurocode 3'!$X$8*'Steel Eurocode 3'!$E$10)*100*1000*AK323","v":7.5792613348898641E-2},{"$f":"C$18*E$7/(6*8*'Steel Eurocode 3'!X$8*'Steel Eurocode 3'!E$10)*100*1000*Y323","v":6.5265204903675933E-2},{"$f":"C$14*B323*(8^3-2*8*B323^2+B323^3)/24/('Steel Eurocode 3'!E$10*'Steel Eurocode 3'!X$8)*100*1000","v":0.39790498028720395},null,14.541267626666297,18.782281727999475,1.2346725822144055E-7,4.8219360965167022E-7,1.0411527845884134E-6,1.7419676668612104E-6]
[245,7.808000000000006,-48.125684735998504,-246.50121600000023,-1.6502569172653501,-1.6502569172653501,-0.55299630849001757,-7.6640625,-17.8828125,-25.546875,-30.65625,{"$f":"'Graph Properties'!C$3*8/2-B324*C$3","v":-164.75121600000023},1.4714999999999536,3.4334999999998921,4.9049999999998448,5.8859999999998251,{"$f":"C$3*8/2*'Graph Properties'!B324-'Graph Properties'!C$3*B324^2/2","v":32.42968473599899},8.8419572679506869E-2,0.17274549445416856,{"$f":"D$17*$E$6/(6*8*'Steel Eurocode 3'!$X$8*'Steel Eurocode 3'!$E$10)*100*1000*X324","v":0.18683848886664536},{"$f":"D$18*E$7/(6*8*'Steel Eurocode 3'!X$8*'Steel Eurocode 3'!E$10)*100*1000*Y324","v":0.16090871353514705},{"$f":"D$14*B324*(8^3-2*8*B324^2+B324^3)/24/('Steel Eurocode 3'!E$10*'Steel Eurocode 3'!X$8)*100*1000","v":1.0413446477298822},null,12.46820351999969,16.106766335999566,3.0432243515969356E-7,1.1885181619547623E-6,2.5662724443331697E-6,4.2937273888748553E-6,null,3.0754633975480637E-2,6.0085389375362966E-2,{"$f":"C$17*$E$6/(6*8*'Steel Eurocode 3'!$X$8*'Steel Eurocode 3'!$E$10)*100*1000*AK324","v":6.4987300475354906E-2},{"$f":"C$18*E$7/(6*8*'Steel Eurocode 3'!X$8*'Steel Eurocode 3'!E$10)*100*1000*Y324","v":5.5968248186138096E-2},{"$f":"C$14*B324*(8^3-2*8*B324^2+B324^3)/24/('Steel Eurocode 3'!E$10*'Steel Eurocode 3'!X$8)*100*1000","v":0.3412007364776809},null,12.46820351999969,16.106766335999566,1.0585128179467601E-7,4.1339762154948243E-7,8.9261650237675451E-7,1.4934703961303842E-6]
[246,7.8400000000000061,-40.215494399998576,-247.88568000000026,-1.375658884047428,-1.375658884047428,-0.46097889861839081,-7.6640625,-17.8828125,-25.546875,-30.65625,{"$f":"'Graph Properties'!C$3*8/2-B325*C$3","v":-166.13568000000026},1.2262499999999534,2.8612499999998913,4.0874999999998494,4.9049999999998164,{"$f":"C$3*8/2*'Graph Properties'!B325-'Graph Properties'!C$3*B325^2/2","v":27.135494399999061},7.369648069385093E-2,0.14398608678730726,{"$f":"D$17*$E$6/(6*8*'Steel Eurocode 3'!$X$8*'Steel Eurocode 3'!$E$10)*100*1000*X325","v":0.15574375225863318},{"$f":"D$18*E$7/(6*8*'Steel Eurocode 3'!X$8*'Steel Eurocode 3'!E$10)*100*1000*Y325","v":0.13414460845633758},{"$f":"D$14*B325*(8^3-2*8*B325^2+B325^3)/24/('Steel Eurocode 3'!E$10*'Steel Eurocode 3'!X$8)*100*1000","v":0.86808795585129905},null,10.393173333332982,13.427711999999531,2.5364704083617309E-7,9.9061184777468234E-7,2.138965474105498E-6,3.5788263419785705E-6,null,2.5633558502209018E-2,5.0082117143411216E-2,{"$f":"C$17*$E$6/(6*8*'Steel Eurocode 3'!$X$8*'Steel Eurocode 3'!$E$10)*100*1000*AK325","v":5.4171739916046319E-2},{"$f":"C$18*E$7/(6*8*'Steel Eurocode 3'!X$8*'Steel Eurocode 3'!E$10)*100*1000*Y325","v":4.6658994245682629E-2},{"$f":"C$14*B325*(8^3-2*8*B325^2+B325^3)/24/('Steel Eurocode 3'!E$10*'Steel Eurocode 3'!X$8)*100*1000","v":0.28443248881104166},null,10.393173333332982,13.427711999999531,8.8225057682147151E-8,3.4456064270423734E-7,7.4398799099321669E-7,1.2448091624273289E-6]
[247,7.8720000000000061,-32.261001215998476,-249.27014400000024,-1.1008188385821798,-1.1008188385821798,-0.36888060763437652,-7.6640625,-17.8828125,-25.546875,-30.65625,{"$f":"'Graph Properties'!C$3*8/2-B326*C$3","v":-167.52014400000024},0.98099999999995324,2.2889999999998909,3.2699999999998397,3.9239999999998076,{"$f":"C$3*8/2*'Graph Properties'!B326-'Graph Properties'!C$3*B326^2/2","v":21.797001215998989},5.8966023184051898E-2,0.11520949289744535,{"$f":"D$17*$E$6/(6*8*'Steel Eurocode 3'!$X$8*'Steel Eurocode 3'!$E$10)*100*1000*X326","v":0.12462446390347744},{"$f":"D$18*E$7/(6*8*'Steel Eurocode 3'!X$8*'Steel Eurocode 3'!E$10)*100*1000*Y326","v":0.10735104128095586},{"$f":"D$14*B326*(8^3-2*8*B326^2+B326^3)/24/('Steel Eurocode 3'!E$10*'Steel Eurocode 3'!X$8)*100*1000","v":0.69466781731624927},null,8.3165047466662827,10.745708543999513,2.0294709476550893E-7,7.9260732660602798E-7,1.7114375381535339E-6,2.8635324671279874E-6,null,2.0509921107496314E-2,4.0072867094763626E-2,{"$f":"C$17*$E$6/(6*8*'Steel Eurocode 3'!$X$8*'Steel Eurocode 3'!$E$10)*100*1000*AK326","v":4.3347639618600844E-2},{"$f":"C$18*E$7/(6*8*'Steel Eurocode 3'!X$8*'Steel Eurocode 3'!E$10)*100*1000*Y326","v":3.7339492619462906E-2},{"$f":"C$14*B326*(8^3-2*8*B326^2+B326^3)/24/('Steel Eurocode 3'!E$10*'Steel Eurocode 3'!X$8)*100*1000","v":0.22761068719405284},null,8.3165047466662827,10.745708543999513,7.0590293831481372E-8,2.7568950490644453E-7,5.9528262196644649E-7,9.9601129291408276E-7]
[248,7.9040000000000061,-24.262205183998503,-250.65460800000028,-0.82578465399119483,-0.82578465399119483,-0.2767174383240576,-7.6640625,-17.8828125,-25.546875,-30.65625,{"$f":"'Graph Properties'!C$3*8/2-B327*C$3","v":-168.90460800000028},0.73574999999995305,1.7167499999998903,2.4524999999998442,2.9429999999998131,{"$f":"C$3*8/2*'Graph Properties'!B327-'Graph Properties'!C$3*B327^2/2","v":16.414205183999002},4.4229673254938373E-2,8.6419150029183017E-2,{"$f":"D$17*$E$6/(6*8*'Steel Eurocode 3'!$X$8*'Steel Eurocode 3'!$E$10)*100*1000*X327","v":9.3485534150605995E-2},{"$f":"D$18*E$7/(6*8*'Steel Eurocode 3'!X$8*'Steel Eurocode 3'!E$10)*100*1000*Y327","v":8.0533904428315553E-2},{"$f":"D$14*B327*(8^3-2*8*B327^2+B327^3)/24/('Steel Eurocode 3'!E$10*'Steel Eurocode 3'!X$8)*100*1000","v":0.52111639212815186},null,6.2385254399995347,8.0613457919994289,1.522275072971298E-7,5.9452423984651353E-7,1.2837328296221348E-6,2.1479243299139649E-6,null,1.5384234175630739E-2,3.0058834792759323E-2,{"$f":"C$17*$E$6/(6*8*'Steel Eurocode 3'!$X$8*'Steel Eurocode 3'!$E$10)*100*1000*AK327","v":3.2516707530645561E-2},{"$f":"C$18*E$7/(6*8*'Steel Eurocode 3'!X$8*'Steel Eurocode 3'!E$10)*100*1000*Y327","v":2.801179284463149E-2},{"$f":"C$14*B327*(8^3-2*8*B327^2+B327^3)/24/('Steel Eurocode 3'!E$10*'Steel Eurocode 3'!X$8)*100*1000","v":0.17074586898039051},null,6.2385254399995347,8.0613457919994289,5.2948698190306012E-8,2.0679103994661342E-7,4.4651576682509024E-7,7.4710411475268344E-7]
[249,7.9360000000000062,-16.219106303998579,-252.03907200000026,-0.55060447028410286,-0.55060447028410286,-0.18450548092045066,-7.6640625,-17.8828125,-25.546875,-30.65625,{"$f":"'Graph Properties'!C$3*8/2-B328*C$3","v":-170.28907200000026},0.49049999999995281,1.1444999999998899,1.6349999999998346,1.9619999999998043,{"$f":"C$3*8/2*'Graph Properties'!B328-'Graph Properties'!C$3*B328^2/2","v":10.987106303999099},2.9488904011339002E-2,5.7618495427120373E-2,{"$f":"D$17*$E$6/(6*8*'Steel Eurocode 3'!$X$8*'Steel Eurocode 3'!$E$10)*100*1000*X328","v":6.2331873349450999E-2},{"$f":"D$18*E$7/(6*8*'Steel Eurocode 3'!X$8*'Steel Eurocode 3'!E$10)*100*1000*Y328","v":5.3699090317733122E-2},{"$f":"D$14*B328*(8^3-2*8*B328^2+B328^3)/24/('Steel Eurocode 3'!E$10*'Steel Eurocode 3'!X$8)*100*1000","v":0.34746610717845938},null,4.159563093332963,5.3752135679994808,1.0149318878046448E-7,3.9638222889385453E-7,8.5589554165615985E-7,1.4320804959273635E-6,null,1.025701009090052E-2,2.0041215800737509E-2,{"$f":"C$17*$E$6/(6*8*'Steel Eurocode 3'!$X$8*'Steel Eurocode 3'!$E$10)*100*1000*AK328","v":2.1680651599809041E-2},{"$f":"C$18*E$7/(6*8*'Steel Eurocode 3'!X$8*'Steel Eurocode 3'!E$10)*100*1000*Y328","v":1.8677944458341953E-2},{"$f":"C$14*B328*(8^3-2*8*B328^2+B328^3)/24/('Steel Eurocode 3'!E$10*'Steel Eurocode 3'!X$8)*100*1000","v":0.11384865897066165},null,4.159563093332963,5.3752135679994808,3.5301978706248508E-8,1.3787207961525371E-7,2.9770279709779473E-7,4.9811495510516981E-7]
[250,7.9680000000000062,-8.1317045759983166,-253.42353600000024,-0.27532669435848411,-0.27532669435848411,-9.2260913103475728E-2,-7.6640625,-17.8828125,-25.546875,-30.65625,{"$f":"'Graph Properties'!C$3*8/2-B329*C$3","v":-171.67353600000024},0.24524999999995256,0.57224999999988935,0.81749999999983913,0.9809999999998098,{"$f":"C$3*8/2*'Graph Properties'!B329-'Graph Properties'!C$3*B329^2/2","v":5.515704575998825},1.4745188558082382E-2,2.8810966335857443E-2,{"$f":"D$17*$E$6/(6*8*'Steel Eurocode 3'!$X$8*'Steel Eurocode 3'!$E$10)*100*1000*X329","v":3.1168391849436872E-2},{"$f":"D$18*E$7/(6*8*'Steel Eurocode 3'!X$8*'Steel Eurocode 3'!E$10)*100*1000*Y329","v":2.6852491368521119E-2},{"$f":"D$14*B329*(8^3-2*8*B329^2+B329^3)/24/('Steel Eurocode 3'!E$10*'Steel Eurocode 3'!X$8)*100*1000","v":0.17374965624658631},null,2.0799453866662816,2.6879016959994715,5.0749049564941679E-8,1.9820093514576547E-7,4.2796986740046763E-7,7.1607953075904209E-7,null,5.1287612375938707E-3,1.0021205682037369E-2,{"$f":"C$17*$E$6/(6*8*'Steel Eurocode 3'!$X$8*'Steel Eurocode 3'!$E$10)*100*1000*AK329","v":1.0841179773717171E-2},{"$f":"C$18*E$7/(6*8*'Steel Eurocode 3'!X$8*'Steel Eurocode 3'!E$10)*100*1000*Y329","v":9.3399969977464737E-3},{"$f":"C$14*B329*(8^3-2*8*B329^2+B329^3)/24/('Steel Eurocode 3'!E$10*'Steel Eurocode 3'!X$8)*100*1000","v":5.6929769412380836E-2},null,2.0799453866662816,2.6879016959994715,1.7651843326936233E-8,6.8939455702874943E-8,1.4885908431320611E-7,2.490711411335798E-7]
[251,8.0000000000000053,4.203581926986999E-13,-254.80800000000022,4.5843592514894429E-14,4.5843592514894429E-14,1.5361896714401687E-14,-7.6640625,-17.8828125,-25.546875,-30.65625,{"$f":"'Graph Properties'!C$3*8/2-B330*C$3","v":-173.05800000000022},-4.0842329518397946E-14,-9.5298768876261875E-14,-1.2789769243681803E-13,-1.5631940186722204E-13,{"$f":"C$3*8/2*'Graph Properties'!B330-'Graph Properties'!C$3*B330^2/2","v":0},-2.4556080628163064E-15,-4.798085130868718E-15,{"$f":"D$17*$E$6/(6*8*'Steel Eurocode 3'!$X$8*'Steel Eurocode 3'!$E$10)*100*1000*X330","v":-5.1108590575688977E-15},{"$f":"D$18*E$7/(6*8*'Steel Eurocode 3'!X$8*'Steel Eurocode 3'!E$10)*100*1000*Y330","v":-4.5429858289501311E-15},{"$f":"D$14*B330*(8^3-2*8*B330^2+B330^3)/24/('Steel Eurocode 3'!E$10*'Steel Eurocode 3'!X$8)*100*1000","v":-2.8936054434690377E-14},null,-3.4106051316484809E-13,-4.5474735088646412E-13,-8.4515507853027333E-21,-3.3007631413465795E-20,-7.1272526701253756E-20,-1.1925337800994094E-19,null,-8.5412454358828019E-16,-1.6688991759543362E-15,{"$f":"C$17*$E$6/(6*8*'Steel Eurocode 3'!$X$8*'Steel Eurocode 3'!$E$10)*100*1000*AK330","v":-1.7776901069804861E-15},{"$f":"C$18*E$7/(6*8*'Steel Eurocode 3'!X$8*'Steel Eurocode 3'!E$10)*100*1000*Y330","v":-1.580168983982654E-15},{"$f":"C$14*B330*(8^3-2*8*B330^2+B330^3)/24/('Steel Eurocode 3'!E$10*'Steel Eurocode 3'!X$8)*100*1000","v":-9.4810139038959315E-15},null,-3.4106051316484809E-13,-4.5474735088646412E-13,-2.9396698383661676E-21,-1.148091527424897E-20,-2.4790444070001305E-20,-4.1479435829544668E-20]
[]
[null,"Diagrams"]
[null,"x",{"$f":"TRANSPOSE(B80:B330)","v":0},3.2000000000000001E-2,6.4000000000000001E-2,9.6000000000000002E-2,0.128,0.16,0.192,0.224,0.25600000000000001,0.28800000000000003,0.32000000000000006,0.35200000000000009,0.38400000000000012,0.41600000000000015,0.44800000000000018,0.4800000000000002,0.51200000000000023,0.54400000000000026,0.57600000000000029,0.60800000000000032,0.64000000000000035,0.67200000000000037,0.7040000000000004,0.73600000000000043,0.76800000000000046,0.80000000000000049,0.83200000000000052,0.86400000000000055,0.89600000000000057,0.9280000000000006,0.96000000000000063,0.99200000000000066,1.0240000000000007,1.0560000000000007,1.0880000000000007,1.1200000000000008,1.1520000000000008,1.1840000000000008,1.2160000000000009,1.2480000000000009,1.2800000000000009,1.3120000000000009,1.344000000000001,1.376000000000001,1.408000000000001,1.4400000000000011,1.4720000000000011,1.5040000000000011,1.5360000000000011,1.5680000000000012,1.6000000000000012,1.6320000000000012,1.6640000000000013,1.6960000000000013,1.7280000000000013,1.7600000000000013,1.7920000000000014,1.8240000000000014,1.8560000000000014,1.8880000000000015,1.9200000000000015,1.9520000000000015,1.9840000000000015,2.0160000000000013,2.0480000000000014,2.0800000000000014,2.1120000000000014,2.1440000000000015,2.1760000000000015,2.2080000000000015,2.2400000000000015,2.2720000000000016,2.3040000000000016,2.3360000000000016,2.3680000000000017,2.4000000000000017,2.4320000000000017,2.4640000000000017,2.4960000000000018,2.5280000000000018,2.5600000000000018,2.5920000000000019,2.6240000000000019,2.6560000000000019,2.6880000000000019,2.720000000000002,2.752000000000002,2.784000000000002,2.8160000000000021,2.8480000000000021,2.8800000000000021,2.9120000000000021,2.9440000000000022,2.9760000000000022,3.0080000000000022,3.0400000000000023,3.0720000000000023,3.1040000000000023,3.1360000000000023,3.1680000000000024,3.2000000000000024,3.2320000000000024,3.2640000000000025,3.2960000000000025,3.3280000000000025,3.3600000000000025,3.3920000000000026,3.4240000000000026,3.4560000000000026,3.4880000000000027,3.5200000000000027,3.5520000000000027,3.5840000000000027,3.6160000000000028,3.6480000000000028,3.6800000000000028,3.7120000000000029,3.7440000000000029,3.7760000000000029,3.8080000000000029,3.840000000000003,3.872000000000003,3.904000000000003,3.9360000000000031,3.9680000000000031,4.0000000000000027,4.0320000000000027,4.0640000000000027,4.0960000000000027,4.1280000000000028,4.1600000000000028,4.1920000000000028,4.2240000000000029,4.2560000000000029,4.2880000000000029,4.3200000000000029,4.352000000000003,4.384000000000003,4.416000000000003,4.4480000000000031,4.4800000000000031,4.5120000000000031,4.5440000000000031,4.5760000000000032,4.6080000000000032,4.6400000000000032,4.6720000000000033,4.7040000000000033,4.7360000000000033,4.7680000000000033,4.8000000000000034,4.8320000000000034,4.8640000000000034,4.8960000000000035,4.9280000000000035,4.9600000000000035,4.9920000000000035,5.0240000000000036,5.0560000000000036,5.0880000000000036,5.1200000000000037,5.1520000000000037,5.1840000000000037,5.2160000000000037,5.2480000000000038,5.2800000000000038,5.3120000000000038,5.3440000000000039,5.3760000000000039,5.4080000000000039,5.4400000000000039,5.472000000000004,5.504000000000004,5.536000000000004,5.5680000000000041,5.6000000000000041,5.6320000000000041,5.6640000000000041,5.6960000000000042,5.7280000000000042,5.7600000000000042,5.7920000000000043,5.8240000000000043,5.8560000000000043,5.8880000000000043,5.9200000000000044,5.9520000000000044,5.9840000000000044,6.0160000000000045,6.0480000000000045,6.0800000000000045,6.1120000000000045,6.1440000000000046,6.1760000000000046,6.2080000000000046,6.2400000000000047,6.2720000000000047,6.3040000000000047,6.3360000000000047,6.3680000000000048,6.4000000000000048,6.4320000000000048,6.4640000000000049,6.4960000000000049,6.5280000000000049,6.5600000000000049,6.592000000000005,6.624000000000005,6.656000000000005,6.6880000000000051,6.7200000000000051,6.7520000000000051,6.7840000000000051,6.8160000000000052,6.8480000000000052,6.8800000000000052,6.9120000000000053,6.9440000000000053,6.9760000000000053,7.0080000000000053,7.0400000000000054,7.0720000000000054,7.1040000000000054,7.1360000000000054,7.1680000000000055,7.2000000000000055,7.2320000000000055,7.2640000000000056,7.2960000000000056,7.3280000000000056,7.3600000000000056,7.3920000000000057,7.4240000000000057,7.4560000000000057,7.4880000000000058,7.5200000000000058,7.5520000000000058,7.5840000000000058,7.6160000000000059,7.6480000000000059,7.6800000000000059,7.712000000000006,7.744000000000006,7.776000000000006,7.808000000000006,7.8400000000000061,7.8720000000000061,7.9040000000000061,7.9360000000000062,7.9680000000000062,8.0000000000000053]
[null,"M",{"$f":"TRANSPOSE(C80:C330)","v":0},-8.1317045760000006,-16.219106304,-24.262205183999999,-32.261001215999997,-40.215494399999997,-48.125684735999997,-55.991572223999995,-63.813156863999993,-71.590438656000003,-79.323417600000013,-87.012093696000022,-94.656466944000016,-102.25653734400002,-109.81230489600003,-117.32376960000005,-124.79093145600004,-132.21379046400006,-139.59234662400007,-146.92659993600009,-154.21655040000007,-161.46219801600009,-168.66354278400007,-175.82058470400011,-182.93332377600009,-190.0017600000001,-197.02589337600011,-204.00572390400009,-210.9412515840001,-217.83247641600013,-224.67939840000011,-231.48201753600014,-238.22856182400014,-244.89025526400013,-251.46578985600013,-257.95516560000016,-264.35838249600016,-270.67544054400014,-276.90633974400009,-283.05108009600019,-289.10966160000015,-295.08208425600014,-300.96834806400017,-306.76845302400017,-312.48239913600014,-318.1101864000002,-323.65181481600018,-329.1072843840002,-334.47659510400018,-339.7597469760002,-344.9567400000002,-350.06757417600022,-355.09224950400016,-360.03076598400025,-364.8831236160002,-369.64932240000024,-374.3293623360002,-378.92324342400025,-383.43096566400015,-387.85252905600021,-392.18793360000018,-396.43717929600018,-400.60026614400022,-404.68242614400015,-408.71505129600018,-412.70337360000019,-416.64739305600017,-420.54710966400023,-424.40252342400015,-428.21363433600015,-431.98044240000013,-435.70294761600019,-439.3811499840001,-443.01504950400022,-446.60464617600019,-450.14994000000013,-453.65093097600015,-457.10761910400021,-460.52000438400023,-463.88808681600017,-467.21186640000019,-470.49134313600018,-473.72651702400015,-476.91738806400019,-480.06395625600015,-483.1662216000002,-486.22418409600016,-489.2378437440002,-492.2072005440001,-495.1322544960002,-498.01300560000016,-500.8494538560002,-503.64159926400021,-506.38944182400019,-509.09167353600026,-511.71951840000014,-514.26120441600017,-516.71673158400017,-519.08609990400021,-521.36930937600016,-523.56636000000015,-525.67725177600016,-527.7019847040001,-529.64055878400018,-531.49297401600006,-533.25923040000009,-534.93932793600015,-536.53326662400013,-538.04104646400015,-539.46266745600019,-540.79812960000015,-542.04743289600003,-543.21057734400006,-544.287562944,-545.27838969600009,-546.18305759999998,-547.00156665600002,-547.73391686400009,-548.38010822400008,-548.94014073599999,-549.41401440000004,-549.80172921600001,-550.10328518400001,-550.31868230399994,-550.447920576,-550.49099999999999,-550.46884857599991,-550.40239430400004,-550.29163718399991,-550.13657721599998,-549.93721440000002,-549.69354873600003,-549.405580224,-549.07330886399996,-548.69673465599999,-548.27585759999999,-547.81067769599986,-547.30119494399992,-546.74740934399995,-546.14932089600006,-545.50692959999992,-544.82023545599986,-544.08923846399989,-543.313938624,-542.49433593599986,-541.63043039999991,-540.72222201599993,-539.76971078399981,-538.77289670399978,-537.73177977599994,-536.64635999999996,-535.51663737599984,-534.3426119039998,-533.12428358399984,-531.86165241599986,-530.55471839999984,-529.2034815359998,-526.82694182399973,-524.07909926399975,-521.28695385599963,-518.45050559999959,-515.56975449599963,-512.64470054399976,-509.67534374399963,-506.66168409599959,-503.60372159999963,-500.50145625599964,-497.35488806399962,-494.16401702399958,-490.92884313599961,-487.64936639999968,-484.32558681599954,-480.95750438399949,-477.54511910399964,-474.08843097599964,-470.5874399999995,-467.04214617599951,-463.45254950399953,-459.81864998399953,-456.14044761599939,-452.41794239999945,-448.65113433599959,-444.84002342399947,-440.98460966399955,-437.08489305599937,-433.14087359999922,-429.15255129599944,-425.11992614399941,-420.3889981439994,-414.95976729599926,-409.48623359999914,-403.96839705599928,-398.4062576639991,-392.79981542399912,-387.14907033599923,-381.45402239999902,-375.71467161599929,-369.9310179839992,-364.10306150399902,-358.2308021759992,-352.31423999999902,-346.35337497599903,-340.34820710399913,-334.29873638399891,-328.20496281599918,-322.06688639999908,-315.884507135999,-309.65782502399907,-303.38684006399893,-297.07155225599882,-290.71196159999892,-284.30806809599892,-277.85987174399907,-271.36737254399895,-264.83057049599881,-258.24946559999898,-251.62405785599896,-244.95434726399895,-238.24033382399904,-231.48201753599895,-224.67939839999895,-217.8324764159988,-210.94125158399873,-204.00572390399878,-197.02589337599892,-190.00175999999865,-182.9333237759987,-175.82058470399863,-168.66354278399885,-161.46219801599869,-154.21655039999865,-146.92659993599867,-139.59234662399879,-132.21379046399875,-124.7909314559988,-117.32376959999849,-109.81230489599869,-102.25653734399856,-94.656466943998481,-87.012093695998743,-79.323417599998606,-71.590438655998327,-63.813156863998614,-55.991572223998496,-48.125684735998504,-40.215494399998576,-32.261001215998476,-24.262205183998503,-16.219106303998579,-8.1317045759983166,4.203581926986999E-13]
[null,"Q",{"$f":"TRANSPOSE(D80:D330)","v":254.80799999999999},253.42353599999998,252.039072,250.654608,249.27014399999999,247.88567999999998,246.501216,245.11675199999999,243.73228799999998,242.347824,240.96335999999999,239.57889599999999,238.19443199999998,236.809968,235.42550399999999,234.04103999999998,232.65657599999997,231.27211199999999,229.88764799999998,228.50318399999998,227.11871999999997,225.73425599999999,224.34979199999998,222.96532799999997,221.58086399999996,220.19639999999998,218.81193599999997,217.42747199999997,216.04300799999999,214.65854399999998,213.27407999999997,211.88961599999996,209.52415199999993,206.83168799999993,204.13922399999993,201.44675999999993,198.75429599999993,196.06183199999992,193.36936799999992,190.67690399999992,187.98443999999992,185.29197599999992,182.59951199999992,179.90704799999992,177.21458399999989,174.52211999999992,171.82965599999989,169.13719199999991,166.44472799999988,163.75226399999988,161.05979999999988,158.36733599999988,155.67487199999988,152.98240799999988,150.28994399999988,147.59747999999988,144.90501599999988,142.21255199999987,139.52008799999987,136.82762399999987,134.13515999999987,131.44269599999987,128.75023199999987,126.71176799999994,125.32730399999994,123.94283999999993,122.55837599999994,121.17391199999993,119.78944799999994,118.40498399999993,117.02051999999993,115.63605599999993,114.25159199999993,112.86712799999992,111.48266399999993,110.09819999999992,108.71373599999993,107.32927199999992,105.94480799999992,104.56034399999992,103.17587999999992,101.79141599999991,100.40695199999992,99.02248799999991,97.638023999999916,96.253559999999908,94.869095999999914,93.484631999999905,92.100167999999911,90.715703999999903,89.331239999999909,87.9467759999999,86.562311999999906,85.177847999999898,83.466383999999806,80.773919999999819,78.081455999999804,75.388991999999803,72.696527999999788,70.004063999999801,67.3115999999998,64.619135999999784,61.926671999999783,59.234207999999796,56.541743999999788,53.84927999999978,51.156815999999765,48.464351999999792,45.771887999999777,43.079423999999769,40.38695999999976,37.694495999999774,35.002031999999772,32.309567999999757,29.617103999999749,26.924639999999769,24.232175999999761,21.539711999999749,18.847247999999741,16.154783999999758,13.46231999999975,10.769855999999741,8.0773919999997617,5.3849279999997464,2.6924639999997382,0,-1.384464000000122,-2.7689280000001304,-4.1533920000001103,-5.5378560000001187,-6.922320000000127,-8.3067840000001354,-9.6912480000001153,-11.075712000000124,-12.460176000000132,-13.84464000000014,-15.22910400000012,-16.613568000000129,-17.998032000000137,-19.382496000000145,-20.766960000000125,-22.151424000000134,-23.535888000000142,-24.92035200000015,-26.30481600000013,-27.689280000000139,-29.073744000000147,-30.458208000000127,-31.842672000000135,-33.227136000000144,-34.611600000000152,-35.996064000000132,-37.38052800000014,-38.764992000000149,-40.149456000000157,-41.533920000000137,-42.918384000000145,-85.177848000000154,-86.562312000000162,-87.946776000000142,-89.33124000000015,-90.715704000000159,-92.100168000000167,-93.484632000000147,-94.869096000000155,-96.253560000000164,-97.638024000000172,-99.022488000000152,-100.40695200000016,-101.79141600000017,-103.17588000000018,-104.56034400000016,-105.94480800000017,-107.32927200000017,-108.71373600000018,-110.09820000000016,-111.48266400000017,-112.86712800000018,-114.25159200000019,-115.63605600000017,-117.02052000000018,-118.40498400000018,-119.78944800000019,-121.17391200000017,-122.55837600000018,-123.94284000000016,-125.3273040000002,-126.71176800000018,-168.97123200000021,-170.35569600000019,-171.74016000000017,-173.12462400000021,-174.50908800000019,-175.89355200000017,-177.27801600000021,-178.66248000000019,-180.04694400000022,-181.4314080000002,-182.81587200000018,-184.20033600000022,-185.5848000000002,-186.96926400000018,-188.35372800000022,-189.7381920000002,-191.12265600000023,-192.50712000000021,-193.89158400000019,-195.27604800000023,-196.66051200000021,-198.04497600000019,-199.42944000000023,-200.81390400000021,-202.19836800000024,-203.58283200000022,-204.9672960000002,-206.35176000000024,-207.73622400000022,-209.1206880000002,-210.50515200000024,-211.88961600000022,-213.27408000000025,-214.65854400000023,-216.04300800000021,-217.42747200000025,-218.81193600000023,-220.19640000000021,-221.58086400000025,-222.96532800000023,-224.34979200000026,-225.73425600000024,-227.11872000000022,-228.50318400000026,-229.88764800000024,-231.27211200000022,-232.65657600000026,-234.04104000000024,-235.42550400000027,-236.80996800000025,-238.19443200000023,-239.57889600000027,-240.96336000000025,-242.34782400000023,-243.73228800000027,-245.11675200000025,-246.50121600000023,-247.88568000000026,-249.27014400000024,-250.65460800000028,-252.03907200000026,-253.42353600000024,-254.80800000000022]
[null,"δ DL + LL",{"$f":"TRANSPOSE(F80:F330)","v":0},-0.27292906280153845,-0.54580920717015269,-0.81859175932024764,-1.091228312354223,-1.3636707262624748,-1.6358711279233931,-1.9077819111033647,-2.1793557364567708,-2.450545531525989,-2.7213044907413901,-2.9915860754213419,-3.2613440137722072,-3.5305323008883454,-3.7991051987521076,-4.0670172362338439,-4.3342232090918982,-4.6006781799726095,-4.8663374784103137,-5.1311567008273409,-5.3950917105340137,-5.6580986377286573,-5.920133879497584,-6.1811540998151067,-6.4411162295435336,-6.6999774664331628,-6.9576952751222949,-7.2142273871372202,-7.4695318008922316,-7.7235667816896072,-7.9762908617196295,-8.2276628400605674,-8.4776417859931819,-8.7261871206761867,-8.9732587581551222,-9.2188171307325,-9.4628231890087164,-9.705238401882049,-9.9460247565486739,-10.185144758502636,-10.422561431535881,-10.658238317738231,-10.892139477497402,-11.12422948949899,-11.354473450726482,-11.582836976461241,-11.809286200282532,-12.033787774067495,-12.256308867991153,-12.476817170526431,-12.69528088844412,-12.911668746812913,-13.125949988999379,-13.338094376667975,-13.548072189781056,-13.755854226598846,-13.961411803679463,-14.164716755878912,-14.365741436351076,-14.564458716547744,-14.760841986218562,-14.954865153411088,-15.14650264447075,-15.335729403386157,-15.522520842030882,-15.706852689579414,-15.888700942748947,-16.068041865144675,-16.244851987259779,-16.419108106475448,-16.590787287060859,-16.759866860173187,-16.926324423857594,-17.090137843047248,-17.251285249563303,-17.409745042114928,-17.56549588629926,-17.718516714601446,-17.868786726394628,-18.016285387939941,-18.160992432386522,-18.302887859771484,-18.441951937019965,-18.578165197945076,-18.711508443247922,-18.841962740517623,-18.969509424231266,-19.094130095753968,-19.215806623338811,-19.334521142126889,-19.450256054147289,-19.562994028317075,-19.672718000441343,-19.779411173213155,-19.88305701625449,-19.983639291486401,-20.081142194137833,-20.175550434421158,-20.266849240846614,-20.355024360222345,-20.440062057654359,-20.521949116546566,-20.600672838600754,-20.6762210438166,-20.748582070491675,-20.817744775221424,-20.883698532899174,-20.946433236716157,-21.005939298161476,-21.062207647022127,-21.115229731382982,-21.164997517626819,-21.211503490434286,-21.254740652783916,-21.294702525952133,-21.33138314951325,-21.364777081339462,-21.394879397600853,-21.421685692765394,-21.445192079598932,-21.465395189165211,-21.482292170825858,-21.49588069224038,-21.506158939366191,-21.513125616458559,-21.516779946070663,-21.517121658578148,-21.5141508769496,-21.507868001517004,-21.498273699500359,-21.485368905007647,-21.469154819034834,-21.449632909465919,-21.426804911072843,-21.400672825515592,-21.371238921342119,-21.338505733988374,-21.302476065778322,-21.263152985923895,-21.220539830525041,-21.174640202569702,-21.125457971933802,-21.072997275381269,-21.017262516564035,-20.958258366022005,-20.895989761183106,-20.83046190636324,-20.761680272766299,-20.68965059848421,-20.614378888496848,-20.535871414672105,-20.454134715765875,-20.369175597422032,-20.281001132172452,-20.189618659437016,-20.095035785523578,-19.997260383628003,-19.896301146248469,-19.792171840821613,-19.684888977306578,-19.574469353010301,-19.460930032127703,-19.344288345741703,-19.224561891823221,-19.101768535231166,-18.975926407712432,-18.847053907901945,-18.715169701322587,-18.580292720385245,-18.442442164388815,-18.301637499520183,-18.157898458854213,-18.011245042353792,-17.861697516869786,-17.709276416141059,-17.554002540794464,-17.395896958344867,-17.234981003195109,-17.071276276636041,-16.90480464684649,-16.735588248893318,-16.563649484731336,-16.389011023203373,-16.21169580004026,-16.031727017860803,-15.849128146171825,-15.663922921368133,-15.476135346732526,-15.285789856114118,-15.092914914851244,-14.897543019771465,-14.699707098268663,-14.499440344624693,-14.29677622000942,-14.09174845248069,-13.884391036984372,-13.674738235354312,-13.462824576312336,-13.248684855468301,-13.032354135320029,-12.813867745253354,-12.593261281542095,-12.370570607348075,-12.145831852721106,-11.919081414599006,-11.690355956807572,-11.459692410060605,-11.227127971959902,-10.99270010699526,-10.75644654654446,-10.518405288873282,-10.278614599135512,-10.037113009372913,-9.7939393185152568,-9.5491325923803085,-9.3027321636738272,-9.0547776319895608,-8.8053088638092678,-8.5543659925026834,-8.3019894183275547,-8.0482198084296108,-7.7930980968425931,-7.5366654844882115,-7.2789634391762004,-7.0200336956042753,-6.7599182553581398,-6.498659386911509,-6.2362996256260814,-5.9728817737515616,-5.7084489004256316,-5.4430443416739873,-5.1767117004103111,-4.9094948464362851,-4.6414379164415811,-4.3725853140038673,-4.1029817095888097,-3.8326720405500732,-3.561701511129308,-3.2901155924561682,-3.0179600225483032,-2.7452808063113512,-2.4721242155389476,-2.1985367889127305,-1.9245653320023184,-1.6502569172653501,-1.375658884047428,-1.1008188385821798,-0.82578465399119483,-0.55060447028410286,-0.27532669435848411,4.5843592514894429E-14]
[null,"δ LL",{"$f":"TRANSPOSE(G80:G330)","v":0},-9.1426954301059127E-2,-0.18283756331559781,-0.27421556191677093,-0.36554477242465183,-0.45680910460623247,-0.54799255567542327,-0.63907921029305326,-0.73005324056686949,-0.82089890605153881,-0.91160055374864513,-1.0021426181066915,-1.0925096210210996,-1.1826861718342094,-1.2726569673352801,-1.3624067917604878,-1.4519205167929288,-1.5411831015626172,-1.6301795926464857,-1.7188951240683856,-1.8073149172990863,-1.8954242812562767,-1.9832086123045629,-2.0706533942554706,-2.1577441983674435,-2.244466683345844,-2.3308065953429531,-2.4167497679579699,-2.5022821222370126,-2.5873896666731175,-2.6720584972062391,-2.7562747972232531,-2.8400248387108129,-2.9232950106642228,-3.0060718681339917,-3.0883421410502341,-3.1700927342369027,-3.251310727411783,-3.3319833751865038,-3.4120981070665239,-3.4916425274511464,-3.5706044156335053,-3.6489717258005752,-3.7267325870331662,-3.8038753033059267,-3.8803883534873407,-3.9562603913397298,-4.0314802455192531,-4.1060369195759066,-4.1799195919535244,-4.2531176159897726,-4.3256205199161624,-4.3974180068580351,-4.4684999548345727,-4.5388564167587928,-4.6084776204375526,-4.6773539685715413,-4.7454760387552914,-4.8128345834771658,-4.8794205301193694,-4.9452249809579438,-5.0102392131627633,-5.0744546787975455,-5.1378630045921136,-5.2004559746352008,-5.2622254779973892,-5.3231634914239034,-5.3832620791068893,-5.442513392685405,-5.5009096712454371,-5.5584432413198819,-5.6151065168885577,-5.6708919993782025,-5.7257922776624728,-5.7798000280619384,-5.8329080143440954,-5.8851090877233503,-5.936396186861038,-5.986762337865402,-6.0362006542916102,-6.0847043371417477,-6.1322666748648178,-6.1788810433567436,-6.224540905960362,-6.2692398134654344,-6.3129714041086409,-6.3557294035735712,-6.3975076249907463,-6.4382999689375957,-6.4781004234384696,-6.5169030639646435,-6.5547020534343003,-6.5914916422125494,-6.6272661681114204,-6.6620200564040832,-6.6957478286492673,-6.728444151737806,-6.7601038663015052,-6.7907219878660134,-6.8202937068508085,-6.8488143885692061,-6.8762795732283664,-6.9026849759292821,-6.9280264866667798,-6.9523001703295266,-6.9755022667000262,-6.9976291904546208,-7.0186775311634859,-7.0386440532906356,-7.0575256961939248,-7.0753195741250385,-7.0920229762295062,-7.1076333665466889,-7.1221483840097868,-7.1355658424458355,-7.1478837305757112,-7.1591002120141232,-7.1692136252696192,-7.1782224837445865,-7.1861254757352464,-7.1929214644316568,-7.1986094879177163,-7.2031887591711561,-7.2066586660635465,-7.2090187713602996,-7.2102688127206509,-7.210408699054069,-7.2094384704403858,-7.2073582580499806,-7.2041682805001512,-7.1998688438551124,-7.1944603416259962,-7.1879432547708557,-7.1803181516946593,-7.1715856882492979,-7.1617466077335772,-7.1508017408932245,-7.1387520059208853,-7.1255984084561188,-7.1113420415854103,-7.0959840858421579,-7.0795258092066815,-7.0619685671062156,-7.0433138024149216,-7.0235630454538649,-7.0027179139910469,-6.9807801132413738,-6.9577514358666743,-6.9336337619757016,-6.908429059124118,-6.8821393823145094,-6.8547668739963843,-6.8263137640661578,-6.7967823698671745,-6.7661750961896949,-6.7344944352708946,-6.7017429667948694,-6.667923550036746,-6.633040804083949,-6.5971002965610825,-6.5601076896561263,-6.5220687330039695,-6.4829892636864273,-6.442875206232225,-6.4017325726170142,-6.3595674622633585,-6.3163860620407482,-6.272194646265584,-6.2269995767011874,-6.1808073025578016,-6.1336243604925871,-6.0854573746096179,-6.0363130564598944,-5.9861982050413314,-5.9351197067987602,-5.8830845356239339,-5.8300997528555234,-5.776172507279119,-5.7213100351272281,-5.6655196600792745,-5.6088087932616055,-5.5511849332474839,-5.4926556660570913,-5.433228665157527,-5.3729116914628108,-5.3117125933338807,-5.249639306578592,-5.18669985445172,-5.1229024045865419,-5.0582565214897759,-4.9927731665415624,-4.9264634455005609,-4.8593385515723355,-4.7914097654093819,-4.7226884551111006,-4.6531860762238244,-4.5829141717407964,-4.5118843721021769,-4.4401083951950522,-4.3675980463534207,-4.2943652183582017,-4.2204218914372333,-4.1457801332652711,-4.0704520989639876,-3.994450031101981,-3.9177862596947595,-3.8404732022047532,-3.7625233635413089,-3.6839493360606994,-3.6047637995661059,-3.5249795213076336,-3.4446093559823079,-3.3636662457340649,-3.2821632201537683,-3.2001133962791952,-3.1175299785950439,-3.0344262590329265,-2.9508156169713819,-2.8667115192358565,-2.7821275200987268,-2.6970772612792775,-2.6115744719437219,-2.5256329687051808,-2.4392666556237024,-2.3524895242062511,-2.2653156534067063,-2.1777592096258704,-2.0898344467114627,-2.0015557059581206,-1.9129374161073989,-1.8239940933477734,-1.7347403413146369,-1.6451908510903022,-1.5553604012039988,-1.4652638576318751,-1.3749161737969979,-1.2843323905693556,-1.1935276362658493,-1.1025171266503038,-1.011316164933461,-0.91994014177297978,-0.82840453527343816,-0.73672491098633441,-0.64491692191008121,-0.55299630849001757,-0.46097889861839081,-0.36888060763437652,-0.2767174383240576,-0.18450548092045066,-9.2260913103475728E-2,1.5361896714401687E-14]
[null,"δ in diagram",{"$f":"IF('Steel Eurocode 3'!$L$62<>'Steel Eurocode 3'!$AC$43,'Graph Properties'!C336,'Graph Properties'!C337)","v":0},{"$f":"IF('Steel Eurocode 3'!$L$62<>'Steel Eurocode 3'!$AC$43,'Graph Properties'!D336,'Graph Properties'!D337)","v":-0.27292906280153845},{"$f":"IF('Steel Eurocode 3'!$L$62<>'Steel Eurocode 3'!$AC$43,'Graph Properties'!E336,'Graph Properties'!E337)","v":-0.54580920717015269},{"$f":"IF('Steel Eurocode 3'!$L$62<>'Steel Eurocode 3'!$AC$43,'Graph Properties'!F336,'Graph Properties'!F337)","v":-0.81859175932024764},{"$f":"IF('Steel Eurocode 3'!$L$62<>'Steel Eurocode 3'!$AC$43,'Graph Properties'!G336,'Graph Properties'!G337)","v":-1.091228312354223},{"$f":"IF('Steel Eurocode 3'!$L$62<>'Steel Eurocode 3'!$AC$43,'Graph Properties'!H336,'Graph Properties'!H337)","v":-1.3636707262624748},{"$f":"IF('Steel Eurocode 3'!$L$62<>'Steel Eurocode 3'!$AC$43,'Graph Properties'!I336,'Graph Properties'!I337)","v":-1.6358711279233931},{"$f":"IF('Steel Eurocode 3'!$L$62<>'Steel Eurocode 3'!$AC$43,'Graph Properties'!J336,'Graph Properties'!J337)","v":-1.9077819111033647},{"$f":"IF('Steel Eurocode 3'!$L$62<>'Steel Eurocode 3'!$AC$43,'Graph Properties'!K336,'Graph Properties'!K337)","v":-2.1793557364567708},{"$f":"IF('Steel Eurocode 3'!$L$62<>'Steel Eurocode 3'!$AC$43,'Graph Properties'!L336,'Graph Properties'!L337)","v":-2.450545531525989},{"$f":"IF('Steel Eurocode 3'!$L$62<>'Steel Eurocode 3'!$AC$43,'Graph Properties'!M336,'Graph Properties'!M337)","v":-2.7213044907413901},{"$f":"IF('Steel Eurocode 3'!$L$62<>'Steel Eurocode 3'!$AC$43,'Graph Properties'!N336,'Graph Properties'!N337)","v":-2.9915860754213419},{"$f":"IF('Steel Eurocode 3'!$L$62<>'Steel Eurocode 3'!$AC$43,'Graph Properties'!O336,'Graph Properties'!O337)","v":-3.2613440137722072},{"$f":"IF('Steel Eurocode 3'!$L$62<>'Steel Eurocode 3'!$AC$43,'Graph Properties'!P336,'Graph Properties'!P337)","v":-3.5305323008883454},{"$f":"IF('Steel Eurocode 3'!$L$62<>'Steel Eurocode 3'!$AC$43,'Graph Properties'!Q336,'Graph Properties'!Q337)","v":-3.7991051987521076},{"$f":"IF('Steel Eurocode 3'!$L$62<>'Steel Eurocode 3'!$AC$43,'Graph Properties'!R336,'Graph Properties'!R337)","v":-4.0670172362338439},{"$f":"IF('Steel Eurocode 3'!$L$62<>'Steel Eurocode 3'!$AC$43,'Graph Properties'!S336,'Graph Properties'!S337)","v":-4.3342232090918982},{"$f":"IF('Steel Eurocode 3'!$L$62<>'Steel Eurocode 3'!$AC$43,'Graph Properties'!T336,'Graph Properties'!T337)","v":-4.6006781799726095},{"$f":"IF('Steel Eurocode 3'!$L$62<>'Steel Eurocode 3'!$AC$43,'Graph Properties'!U336,'Graph Properties'!U337)","v":-4.8663374784103137},{"$f":"IF('Steel Eurocode 3'!$L$62<>'Steel Eurocode 3'!$AC$43,'Graph Properties'!V336,'Graph Properties'!V337)","v":-5.1311567008273409},{"$f":"IF('Steel Eurocode 3'!$L$62<>'Steel Eurocode 3'!$AC$43,'Graph Properties'!W336,'Graph Properties'!W337)","v":-5.3950917105340137},{"$f":"IF('Steel Eurocode 3'!$L$62<>'Steel Eurocode 3'!$AC$43,'Graph Properties'!X336,'Graph Properties'!X337)","v":-5.6580986377286573},{"$f":"IF('Steel Eurocode 3'!$L$62<>'Steel Eurocode 3'!$AC$43,'Graph Properties'!Y336,'Graph Properties'!Y337)","v":-5.920133879497584},{"$f":"IF('Steel Eurocode 3'!$L$62<>'Steel Eurocode 3'!$AC$43,'Graph Properties'!Z336,'Graph Properties'!Z337)","v":-6.1811540998151067},{"$f":"IF('Steel Eurocode 3'!$L$62<>'Steel Eurocode 3'!$AC$43,'Graph Properties'!AA336,'Graph Properties'!AA337)","v":-6.4411162295435336},{"$f":"IF('Steel Eurocode 3'!$L$62<>'Steel Eurocode 3'!$AC$43,'Graph Properties'!AB336,'Graph Properties'!AB337)","v":-6.6999774664331628},{"$f":"IF('Steel Eurocode 3'!$L$62<>'Steel Eurocode 3'!$AC$43,'Graph Properties'!AC336,'Graph Properties'!AC337)","v":-6.9576952751222949},{"$f":"IF('Steel Eurocode 3'!$L$62<>'Steel Eurocode 3'!$AC$43,'Graph Properties'!AD336,'Graph Properties'!AD337)","v":-7.2142273871372202},{"$f":"IF('Steel Eurocode 3'!$L$62<>'Steel Eurocode 3'!$AC$43,'Graph Properties'!AE336,'Graph Properties'!AE337)","v":-7.4695318008922316},{"$f":"IF('Steel Eurocode 3'!$L$62<>'Steel Eurocode 3'!$AC$43,'Graph Properties'!AF336,'Graph Properties'!AF337)","v":-7.7235667816896072},{"$f":"IF('Steel Eurocode 3'!$L$62<>'Steel Eurocode 3'!$AC$43,'Graph Properties'!AG336,'Graph Properties'!AG337)","v":-7.9762908617196295},{"$f":"IF('Steel Eurocode 3'!$L$62<>'Steel Eurocode 3'!$AC$43,'Graph Properties'!AH336,'Graph Properties'!AH337)","v":-8.2276628400605674},{"$f":"IF('Steel Eurocode 3'!$L$62<>'Steel Eurocode 3'!$AC$43,'Graph Properties'!AI336,'Graph Properties'!AI337)","v":-8.4776417859931819},{"$f":"IF('Steel Eurocode 3'!$L$62<>'Steel Eurocode 3'!$AC$43,'Graph Properties'!AJ336,'Graph Properties'!AJ337)","v":-8.7261871206761867},{"$f":"IF('Steel Eurocode 3'!$L$62<>'Steel Eurocode 3'!$AC$43,'Graph Properties'!AK336,'Graph Properties'!AK337)","v":-8.9732587581551222},{"$f":"IF('Steel Eurocode 3'!$L$62<>'Steel Eurocode 3'!$AC$43,'Graph Properties'!AL336,'Graph Properties'!AL337)","v":-9.2188171307325},{"$f":"IF('Steel Eurocode 3'!$L$62<>'Steel Eurocode 3'!$AC$43,'Graph Properties'!AM336,'Graph Properties'!AM337)","v":-9.4628231890087164},{"$f":"IF('Steel Eurocode 3'!$L$62<>'Steel Eurocode 3'!$AC$43,'Graph Properties'!AN336,'Graph Properties'!AN337)","v":-9.705238401882049},{"$f":"IF('Steel Eurocode 3'!$L$62<>'Steel Eurocode 3'!$AC$43,'Graph Properties'!AO336,'Graph Properties'!AO337)","v":-9.9460247565486739},{"$f":"IF('Steel Eurocode 3'!$L$62<>'Steel Eurocode 3'!$AC$43,'Graph Properties'!AP336,'Graph Properties'!AP337)","v":-10.185144758502636},{"$f":"IF('Steel Eurocode 3'!$L$62<>'Steel Eurocode 3'!$AC$43,'Graph Properties'!AQ336,'Graph Properties'!AQ337)","v":-10.422561431535881},{"$f":"IF('Steel Eurocode 3'!$L$62<>'Steel Eurocode 3'!$AC$43,'Graph Properties'!AR336,'Graph Properties'!AR337)","v":-10.658238317738231},{"$f":"IF('Steel Eurocode 3'!$L$62<>'Steel Eurocode 3'!$AC$43,'Graph Properties'!AS336,'Graph Properties'!AS337)","v":-10.892139477497402},{"$f":"IF('Steel Eurocode 3'!$L$62<>'Steel Eurocode 3'!$AC$43,'Graph Properties'!AT336,'Graph Properties'!AT337)","v":-11.12422948949899},{"$f":"IF('Steel Eurocode 3'!$L$62<>'Steel Eurocode 3'!$AC$43,'Graph Properties'!AU336,'Graph Properties'!AU337)","v":-11.354473450726482},{"$f":"IF('Steel Eurocode 3'!$L$62<>'Steel Eurocode 3'!$AC$43,'Graph Properties'!AV336,'Graph Properties'!AV337)","v":-11.582836976461241},{"$f":"IF('Steel Eurocode 3'!$L$62<>'Steel Eurocode 3'!$AC$43,'Graph Properties'!AW336,'Graph Properties'!AW337)","v":-11.809286200282532},{"$f":"IF('Steel Eurocode 3'!$L$62<>'Steel Eurocode 3'!$AC$43,'Graph Properties'!AX336,'Graph Properties'!AX337)","v":-12.033787774067495},{"$f":"IF('Steel Eurocode 3'!$L$62<>'Steel Eurocode 3'!$AC$43,'Graph Properties'!AY336,'Graph Properties'!AY337)","v":-12.256308867991153},{"$f":"IF('Steel Eurocode 3'!$L$62<>'Steel Eurocode 3'!$AC$43,'Graph Properties'!AZ336,'Graph Properties'!AZ337)","v":-12.476817170526431},{"$f":"IF('Steel Eurocode 3'!$L$62<>'Steel Eurocode 3'!$AC$43,'Graph Properties'!BA336,'Graph Properties'!BA337)","v":-12.69528088844412},{"$f":"IF('Steel Eurocode 3'!$L$62<>'Steel Eurocode 3'!$AC$43,'Graph Properties'!BB336,'Graph Properties'!BB337)","v":-12.911668746812913},{"$f":"IF('Steel Eurocode 3'!$L$62<>'Steel Eurocode 3'!$AC$43,'Graph Properties'!BC336,'Graph Properties'!BC337)","v":-13.125949988999379},{"$f":"IF('Steel Eurocode 3'!$L$62<>'Steel Eurocode 3'!$AC$43,'Graph Properties'!BD336,'Graph Properties'!BD337)","v":-13.338094376667975},{"$f":"IF('Steel Eurocode 3'!$L$62<>'Steel Eurocode 3'!$AC$43,'Graph Properties'!BE336,'Graph Properties'!BE337)","v":-13.548072189781056},{"$f":"IF('Steel Eurocode 3'!$L$62<>'Steel Eurocode 3'!$AC$43,'Graph Properties'!BF336,'Graph Properties'!BF337)","v":-13.755854226598846},{"$f":"IF('Steel Eurocode 3'!$L$62<>'Steel Eurocode 3'!$AC$43,'Graph Properties'!BG336,'Graph Properties'!BG337)","v":-13.961411803679463},{"$f":"IF('Steel Eurocode 3'!$L$62<>'Steel Eurocode 3'!$AC$43,'Graph Properties'!BH336,'Graph Properties'!BH337)","v":-14.164716755878912},{"$f":"IF('Steel Eurocode 3'!$L$62<>'Steel Eurocode 3'!$AC$43,'Graph Properties'!BI336,'Graph Properties'!BI337)","v":-14.365741436351076},{"$f":"IF('Steel Eurocode 3'!$L$62<>'Steel Eurocode 3'!$AC$43,'Graph Properties'!BJ336,'Graph Properties'!BJ337)","v":-14.564458716547744},{"$f":"IF('Steel Eurocode 3'!$L$62<>'Steel Eurocode 3'!$AC$43,'Graph Properties'!BK336,'Graph Properties'!BK337)","v":-14.760841986218562},{"$f":"IF('Steel Eurocode 3'!$L$62<>'Steel Eurocode 3'!$AC$43,'Graph Properties'!BL336,'Graph Properties'!BL337)","v":-14.954865153411088},{"$f":"IF('Steel Eurocode 3'!$L$62<>'Steel Eurocode 3'!$AC$43,'Graph Properties'!BM336,'Graph Properties'!BM337)","v":-15.14650264447075},{"$f":"IF('Steel Eurocode 3'!$L$62<>'Steel Eurocode 3'!$AC$43,'Graph Properties'!BN336,'Graph Properties'!BN337)","v":-15.335729403386157},{"$f":"IF('Steel Eurocode 3'!$L$62<>'Steel Eurocode 3'!$AC$43,'Graph Properties'!BO336,'Graph Properties'!BO337)","v":-15.522520842030882},{"$f":"IF('Steel Eurocode 3'!$L$62<>'Steel Eurocode 3'!$AC$43,'Graph Properties'!BP336,'Graph Properties'!BP337)","v":-15.706852689579414},{"$f":"IF('Steel Eurocode 3'!$L$62<>'Steel Eurocode 3'!$AC$43,'Graph Properties'!BQ336,'Graph Properties'!BQ337)","v":-15.888700942748947},{"$f":"IF('Steel Eurocode 3'!$L$62<>'Steel Eurocode 3'!$AC$43,'Graph Properties'!BR336,'Graph Properties'!BR337)","v":-16.068041865144675},{"$f":"IF('Steel Eurocode 3'!$L$62<>'Steel Eurocode 3'!$AC$43,'Graph Properties'!BS336,'Graph Properties'!BS337)","v":-16.244851987259779},{"$f":"IF('Steel Eurocode 3'!$L$62<>'Steel Eurocode 3'!$AC$43,'Graph Properties'!BT336,'Graph Properties'!BT337)","v":-16.419108106475448},{"$f":"IF('Steel Eurocode 3'!$L$62<>'Steel Eurocode 3'!$AC$43,'Graph Properties'!BU336,'Graph Properties'!BU337)","v":-16.590787287060859},{"$f":"IF('Steel Eurocode 3'!$L$62<>'Steel Eurocode 3'!$AC$43,'Graph Properties'!BV336,'Graph Properties'!BV337)","v":-16.759866860173187},{"$f":"IF('Steel Eurocode 3'!$L$62<>'Steel Eurocode 3'!$AC$43,'Graph Properties'!BW336,'Graph Properties'!BW337)","v":-16.926324423857594},{"$f":"IF('Steel Eurocode 3'!$L$62<>'Steel Eurocode 3'!$AC$43,'Graph Properties'!BX336,'Graph Properties'!BX337)","v":-17.090137843047248},{"$f":"IF('Steel Eurocode 3'!$L$62<>'Steel Eurocode 3'!$AC$43,'Graph Properties'!BY336,'Graph Properties'!BY337)","v":-17.251285249563303},{"$f":"IF('Steel Eurocode 3'!$L$62<>'Steel Eurocode 3'!$AC$43,'Graph Properties'!BZ336,'Graph Properties'!BZ337)","v":-17.409745042114928},{"$f":"IF('Steel Eurocode 3'!$L$62<>'Steel Eurocode 3'!$AC$43,'Graph Properties'!CA336,'Graph Properties'!CA337)","v":-17.56549588629926},{"$f":"IF('Steel Eurocode 3'!$L$62<>'Steel Eurocode 3'!$AC$43,'Graph Properties'!CB336,'Graph Properties'!CB337)","v":-17.718516714601446},{"$f":"IF('Steel Eurocode 3'!$L$62<>'Steel Eurocode 3'!$AC$43,'Graph Properties'!CC336,'Graph Properties'!CC337)","v":-17.868786726394628},{"$f":"IF('Steel Eurocode 3'!$L$62<>'Steel Eurocode 3'!$AC$43,'Graph Properties'!CD336,'Graph Properties'!CD337)","v":-18.016285387939941},{"$f":"IF('Steel Eurocode 3'!$L$62<>'Steel Eurocode 3'!$AC$43,'Graph Properties'!CE336,'Graph Properties'!CE337)","v":-18.160992432386522},{"$f":"IF('Steel Eurocode 3'!$L$62<>'Steel Eurocode 3'!$AC$43,'Graph Properties'!CF336,'Graph Properties'!CF337)","v":-18.302887859771484},{"$f":"IF('Steel Eurocode 3'!$L$62<>'Steel Eurocode 3'!$AC$43,'Graph Properties'!CG336,'Graph Properties'!CG337)","v":-18.441951937019965},{"$f":"IF('Steel Eurocode 3'!$L$62<>'Steel Eurocode 3'!$AC$43,'Graph Properties'!CH336,'Graph Properties'!CH337)","v":-18.578165197945076},{"$f":"IF('Steel Eurocode 3'!$L$62<>'Steel Eurocode 3'!$AC$43,'Graph Properties'!CI336,'Graph Properties'!CI337)","v":-18.711508443247922},{"$f":"IF('Steel Eurocode 3'!$L$62<>'Steel Eurocode 3'!$AC$43,'Graph Properties'!CJ336,'Graph Properties'!CJ337)","v":-18.841962740517623},{"$f":"IF('Steel Eurocode 3'!$L$62<>'Steel Eurocode 3'!$AC$43,'Graph Properties'!CK336,'Graph Properties'!CK337)","v":-18.969509424231266},{"$f":"IF('Steel Eurocode 3'!$L$62<>'Steel Eurocode 3'!$AC$43,'Graph Properties'!CL336,'Graph Properties'!CL337)","v":-19.094130095753968},{"$f":"IF('Steel Eurocode 3'!$L$62<>'Steel Eurocode 3'!$AC$43,'Graph Properties'!CM336,'Graph Properties'!CM337)","v":-19.215806623338811},{"$f":"IF('Steel Eurocode 3'!$L$62<>'Steel Eurocode 3'!$AC$43,'Graph Properties'!CN336,'Graph Properties'!CN337)","v":-19.334521142126889},{"$f":"IF('Steel Eurocode 3'!$L$62<>'Steel Eurocode 3'!$AC$43,'Graph Properties'!CO336,'Graph Properties'!CO337)","v":-19.450256054147289},{"$f":"IF('Steel Eurocode 3'!$L$62<>'Steel Eurocode 3'!$AC$43,'Graph Properties'!CP336,'Graph Properties'!CP337)","v":-19.562994028317075},{"$f":"IF('Steel Eurocode 3'!$L$62<>'Steel Eurocode 3'!$AC$43,'Graph Properties'!CQ336,'Graph Properties'!CQ337)","v":-19.672718000441343},{"$f":"IF('Steel Eurocode 3'!$L$62<>'Steel Eurocode 3'!$AC$43,'Graph Properties'!CR336,'Graph Properties'!CR337)","v":-19.779411173213155},{"$f":"IF('Steel Eurocode 3'!$L$62<>'Steel Eurocode 3'!$AC$43,'Graph Properties'!CS336,'Graph Properties'!CS337)","v":-19.88305701625449},{"$f":"IF('Steel Eurocode 3'!$L$62<>'Steel Eurocode 3'!$AC$43,'Graph Properties'!CT336,'Graph Properties'!CT337)","v":-19.983639291486401},{"$f":"IF('Steel Eurocode 3'!$L$62<>'Steel Eurocode 3'!$AC$43,'Graph Properties'!CU336,'Graph Properties'!CU337)","v":-20.081142194137833},{"$f":"IF('Steel Eurocode 3'!$L$62<>'Steel Eurocode 3'!$AC$43,'Graph Properties'!CV336,'Graph Properties'!CV337)","v":-20.175550434421158},{"$f":"IF('Steel Eurocode 3'!$L$62<>'Steel Eurocode 3'!$AC$43,'Graph Properties'!CW336,'Graph Properties'!CW337)","v":-20.266849240846614},{"$f":"IF('Steel Eurocode 3'!$L$62<>'Steel Eurocode 3'!$AC$43,'Graph Properties'!CX336,'Graph Properties'!CX337)","v":-20.355024360222345},{"$f":"IF('Steel Eurocode 3'!$L$62<>'Steel Eurocode 3'!$AC$43,'Graph Properties'!CY336,'Graph Properties'!CY337)","v":-20.440062057654359},{"$f":"IF('Steel Eurocode 3'!$L$62<>'Steel Eurocode 3'!$AC$43,'Graph Properties'!CZ336,'Graph Properties'!CZ337)","v":-20.521949116546566},{"$f":"IF('Steel Eurocode 3'!$L$62<>'Steel Eurocode 3'!$AC$43,'Graph Properties'!DA336,'Graph Properties'!DA337)","v":-20.600672838600754},{"$f":"IF('Steel Eurocode 3'!$L$62<>'Steel Eurocode 3'!$AC$43,'Graph Properties'!DB336,'Graph Properties'!DB337)","v":-20.6762210438166},{"$f":"IF('Steel Eurocode 3'!$L$62<>'Steel Eurocode 3'!$AC$43,'Graph Properties'!DC336,'Graph Properties'!DC337)","v":-20.748582070491675},{"$f":"IF('Steel Eurocode 3'!$L$62<>'Steel Eurocode 3'!$AC$43,'Graph Properties'!DD336,'Graph Properties'!DD337)","v":-20.817744775221424},{"$f":"IF('Steel Eurocode 3'!$L$62<>'Steel Eurocode 3'!$AC$43,'Graph Properties'!DE336,'Graph Properties'!DE337)","v":-20.883698532899174},{"$f":"IF('Steel Eurocode 3'!$L$62<>'Steel Eurocode 3'!$AC$43,'Graph Properties'!DF336,'Graph Properties'!DF337)","v":-20.946433236716157},{"$f":"IF('Steel Eurocode 3'!$L$62<>'Steel Eurocode 3'!$AC$43,'Graph Properties'!DG336,'Graph Properties'!DG337)","v":-21.005939298161476},{"$f":"IF('Steel Eurocode 3'!$L$62<>'Steel Eurocode 3'!$AC$43,'Graph Properties'!DH336,'Graph Properties'!DH337)","v":-21.062207647022127},{"$f":"IF('Steel Eurocode 3'!$L$62<>'Steel Eurocode 3'!$AC$43,'Graph Properties'!DI336,'Graph Properties'!DI337)","v":-21.115229731382982},{"$f":"IF('Steel Eurocode 3'!$L$62<>'Steel Eurocode 3'!$AC$43,'Graph Properties'!DJ336,'Graph Properties'!DJ337)","v":-21.164997517626819},{"$f":"IF('Steel Eurocode 3'!$L$62<>'Steel Eurocode 3'!$AC$43,'Graph Properties'!DK336,'Graph Properties'!DK337)","v":-21.211503490434286},{"$f":"IF('Steel Eurocode 3'!$L$62<>'Steel Eurocode 3'!$AC$43,'Graph Properties'!DL336,'Graph Properties'!DL337)","v":-21.254740652783916},{"$f":"IF('Steel Eurocode 3'!$L$62<>'Steel Eurocode 3'!$AC$43,'Graph Properties'!DM336,'Graph Properties'!DM337)","v":-21.294702525952133},{"$f":"IF('Steel Eurocode 3'!$L$62<>'Steel Eurocode 3'!$AC$43,'Graph Properties'!DN336,'Graph Properties'!DN337)","v":-21.33138314951325},{"$f":"IF('Steel Eurocode 3'!$L$62<>'Steel Eurocode 3'!$AC$43,'Graph Properties'!DO336,'Graph Properties'!DO337)","v":-21.364777081339462},{"$f":"IF('Steel Eurocode 3'!$L$62<>'Steel Eurocode 3'!$AC$43,'Graph Properties'!DP336,'Graph Properties'!DP337)","v":-21.394879397600853},{"$f":"IF('Steel Eurocode 3'!$L$62<>'Steel Eurocode 3'!$AC$43,'Graph Properties'!DQ336,'Graph Properties'!DQ337)","v":-21.421685692765394},{"$f":"IF('Steel Eurocode 3'!$L$62<>'Steel Eurocode 3'!$AC$43,'Graph Properties'!DR336,'Graph Properties'!DR337)","v":-21.445192079598932},{"$f":"IF('Steel Eurocode 3'!$L$62<>'Steel Eurocode 3'!$AC$43,'Graph Properties'!DS336,'Graph Properties'!DS337)","v":-21.465395189165211},{"$f":"IF('Steel Eurocode 3'!$L$62<>'Steel Eurocode 3'!$AC$43,'Graph Properties'!DT336,'Graph Properties'!DT337)","v":-21.482292170825858},{"$f":"IF('Steel Eurocode 3'!$L$62<>'Steel Eurocode 3'!$AC$43,'Graph Properties'!DU336,'Graph Properties'!DU337)","v":-21.49588069224038},{"$f":"IF('Steel Eurocode 3'!$L$62<>'Steel Eurocode 3'!$AC$43,'Graph Properties'!DV336,'Graph Properties'!DV337)","v":-21.506158939366191},{"$f":"IF('Steel Eurocode 3'!$L$62<>'Steel Eurocode 3'!$AC$43,'Graph Properties'!DW336,'Graph Properties'!DW337)","v":-21.513125616458559},{"$f":"IF('Steel Eurocode 3'!$L$62<>'Steel Eurocode 3'!$AC$43,'Graph Properties'!DX336,'Graph Properties'!DX337)","v":-21.516779946070663},{"$f":"IF('Steel Eurocode 3'!$L$62<>'Steel Eurocode 3'!$AC$43,'Graph Properties'!DY336,'Graph Properties'!DY337)","v":-21.517121658578148},{"$f":"IF('Steel Eurocode 3'!$L$62<>'Steel Eurocode 3'!$AC$43,'Graph Properties'!DZ336,'Graph Properties'!DZ337)","v":-21.5141508769496},{"$f":"IF('Steel Eurocode 3'!$L$62<>'Steel Eurocode 3'!$AC$43,'Graph Properties'!EA336,'Graph Properties'!EA337)","v":-21.507868001517004},{"$f":"IF('Steel Eurocode 3'!$L$62<>'Steel Eurocode 3'!$AC$43,'Graph Properties'!EB336,'Graph Properties'!EB337)","v":-21.498273699500359},{"$f":"IF('Steel Eurocode 3'!$L$62<>'Steel Eurocode 3'!$AC$43,'Graph Properties'!EC336,'Graph Properties'!EC337)","v":-21.485368905007647},{"$f":"IF('Steel Eurocode 3'!$L$62<>'Steel Eurocode 3'!$AC$43,'Graph Properties'!ED336,'Graph Properties'!ED337)","v":-21.469154819034834},{"$f":"IF('Steel Eurocode 3'!$L$62<>'Steel Eurocode 3'!$AC$43,'Graph Properties'!EE336,'Graph Properties'!EE337)","v":-21.449632909465919},{"$f":"IF('Steel Eurocode 3'!$L$62<>'Steel Eurocode 3'!$AC$43,'Graph Properties'!EF336,'Graph Properties'!EF337)","v":-21.426804911072843},{"$f":"IF('Steel Eurocode 3'!$L$62<>'Steel Eurocode 3'!$AC$43,'Graph Properties'!EG336,'Graph Properties'!EG337)","v":-21.400672825515592},{"$f":"IF('Steel Eurocode 3'!$L$62<>'Steel Eurocode 3'!$AC$43,'Graph Properties'!EH336,'Graph Properties'!EH337)","v":-21.371238921342119},{"$f":"IF('Steel Eurocode 3'!$L$62<>'Steel Eurocode 3'!$AC$43,'Graph Properties'!EI336,'Graph Properties'!EI337)","v":-21.338505733988374},{"$f":"IF('Steel Eurocode 3'!$L$62<>'Steel Eurocode 3'!$AC$43,'Graph Properties'!EJ336,'Graph Properties'!EJ337)","v":-21.302476065778322},{"$f":"IF('Steel Eurocode 3'!$L$62<>'Steel Eurocode 3'!$AC$43,'Graph Properties'!EK336,'Graph Properties'!EK337)","v":-21.263152985923895},{"$f":"IF('Steel Eurocode 3'!$L$62<>'Steel Eurocode 3'!$AC$43,'Graph Properties'!EL336,'Graph Properties'!EL337)","v":-21.220539830525041},{"$f":"IF('Steel Eurocode 3'!$L$62<>'Steel Eurocode 3'!$AC$43,'Graph Properties'!EM336,'Graph Properties'!EM337)","v":-21.174640202569702},{"$f":"IF('Steel Eurocode 3'!$L$62<>'Steel Eurocode 3'!$AC$43,'Graph Properties'!EN336,'Graph Properties'!EN337)","v":-21.125457971933802},{"$f":"IF('Steel Eurocode 3'!$L$62<>'Steel Eurocode 3'!$AC$43,'Graph Properties'!EO336,'Graph Properties'!EO337)","v":-21.072997275381269},{"$f":"IF('Steel Eurocode 3'!$L$62<>'Steel Eurocode 3'!$AC$43,'Graph Properties'!EP336,'Graph Properties'!EP337)","v":-21.017262516564035},{"$f":"IF('Steel Eurocode 3'!$L$62<>'Steel Eurocode 3'!$AC$43,'Graph Properties'!EQ336,'Graph Properties'!EQ337)","v":-20.958258366022005},{"$f":"IF('Steel Eurocode 3'!$L$62<>'Steel Eurocode 3'!$AC$43,'Graph Properties'!ER336,'Graph Properties'!ER337)","v":-20.895989761183106},{"$f":"IF('Steel Eurocode 3'!$L$62<>'Steel Eurocode 3'!$AC$43,'Graph Properties'!ES336,'Graph Properties'!ES337)","v":-20.83046190636324},{"$f":"IF('Steel Eurocode 3'!$L$62<>'Steel Eurocode 3'!$AC$43,'Graph Properties'!ET336,'Graph Properties'!ET337)","v":-20.761680272766299},{"$f":"IF('Steel Eurocode 3'!$L$62<>'Steel Eurocode 3'!$AC$43,'Graph Properties'!EU336,'Graph Properties'!EU337)","v":-20.68965059848421},{"$f":"IF('Steel Eurocode 3'!$L$62<>'Steel Eurocode 3'!$AC$43,'Graph Properties'!EV336,'Graph Properties'!EV337)","v":-20.614378888496848},{"$f":"IF('Steel Eurocode 3'!$L$62<>'Steel Eurocode 3'!$AC$43,'Graph Properties'!EW336,'Graph Properties'!EW337)","v":-20.535871414672105},{"$f":"IF('Steel Eurocode 3'!$L$62<>'Steel Eurocode 3'!$AC$43,'Graph Properties'!EX336,'Graph Properties'!EX337)","v":-20.454134715765875},{"$f":"IF('Steel Eurocode 3'!$L$62<>'Steel Eurocode 3'!$AC$43,'Graph Properties'!EY336,'Graph Properties'!EY337)","v":-20.369175597422032},{"$f":"IF('Steel Eurocode 3'!$L$62<>'Steel Eurocode 3'!$AC$43,'Graph Properties'!EZ336,'Graph Properties'!EZ337)","v":-20.281001132172452},{"$f":"IF('Steel Eurocode 3'!$L$62<>'Steel Eurocode 3'!$AC$43,'Graph Properties'!FA336,'Graph Properties'!FA337)","v":-20.189618659437016},{"$f":"IF('Steel Eurocode 3'!$L$62<>'Steel Eurocode 3'!$AC$43,'Graph Properties'!FB336,'Graph Properties'!FB337)","v":-20.095035785523578},{"$f":"IF('Steel Eurocode 3'!$L$62<>'Steel Eurocode 3'!$AC$43,'Graph Properties'!FC336,'Graph Properties'!FC337)","v":-19.997260383628003},{"$f":"IF('Steel Eurocode 3'!$L$62<>'Steel Eurocode 3'!$AC$43,'Graph Properties'!FD336,'Graph Properties'!FD337)","v":-19.896301146248469},{"$f":"IF('Steel Eurocode 3'!$L$62<>'Steel Eurocode 3'!$AC$43,'Graph Properties'!FE336,'Graph Properties'!FE337)","v":-19.792171840821613},{"$f":"IF('Steel Eurocode 3'!$L$62<>'Steel Eurocode 3'!$AC$43,'Graph Properties'!FF336,'Graph Properties'!FF337)","v":-19.684888977306578},{"$f":"IF('Steel Eurocode 3'!$L$62<>'Steel Eurocode 3'!$AC$43,'Graph Properties'!FG336,'Graph Properties'!FG337)","v":-19.574469353010301},{"$f":"IF('Steel Eurocode 3'!$L$62<>'Steel Eurocode 3'!$AC$43,'Graph Properties'!FH336,'Graph Properties'!FH337)","v":-19.460930032127703},{"$f":"IF('Steel Eurocode 3'!$L$62<>'Steel Eurocode 3'!$AC$43,'Graph Properties'!FI336,'Graph Properties'!FI337)","v":-19.344288345741703},{"$f":"IF('Steel Eurocode 3'!$L$62<>'Steel Eurocode 3'!$AC$43,'Graph Properties'!FJ336,'Graph Properties'!FJ337)","v":-19.224561891823221},{"$f":"IF('Steel Eurocode 3'!$L$62<>'Steel Eurocode 3'!$AC$43,'Graph Properties'!FK336,'Graph Properties'!FK337)","v":-19.101768535231166},{"$f":"IF('Steel Eurocode 3'!$L$62<>'Steel Eurocode 3'!$AC$43,'Graph Properties'!FL336,'Graph Properties'!FL337)","v":-18.975926407712432},{"$f":"IF('Steel Eurocode 3'!$L$62<>'Steel Eurocode 3'!$AC$43,'Graph Properties'!FM336,'Graph Properties'!FM337)","v":-18.847053907901945},{"$f":"IF('Steel Eurocode 3'!$L$62<>'Steel Eurocode 3'!$AC$43,'Graph Properties'!FN336,'Graph Properties'!FN337)","v":-18.715169701322587},{"$f":"IF('Steel Eurocode 3'!$L$62<>'Steel Eurocode 3'!$AC$43,'Graph Properties'!FO336,'Graph Properties'!FO337)","v":-18.580292720385245},{"$f":"IF('Steel Eurocode 3'!$L$62<>'Steel Eurocode 3'!$AC$43,'Graph Properties'!FP336,'Graph Properties'!FP337)","v":-18.442442164388815},{"$f":"IF('Steel Eurocode 3'!$L$62<>'Steel Eurocode 3'!$AC$43,'Graph Properties'!FQ336,'Graph Properties'!FQ337)","v":-18.301637499520183},{"$f":"IF('Steel Eurocode 3'!$L$62<>'Steel Eurocode 3'!$AC$43,'Graph Properties'!FR336,'Graph Properties'!FR337)","v":-18.157898458854213},{"$f":"IF('Steel Eurocode 3'!$L$62<>'Steel Eurocode 3'!$AC$43,'Graph Properties'!FS336,'Graph Properties'!FS337)","v":-18.011245042353792},{"$f":"IF('Steel Eurocode 3'!$L$62<>'Steel Eurocode 3'!$AC$43,'Graph Properties'!FT336,'Graph Properties'!FT337)","v":-17.861697516869786},{"$f":"IF('Steel Eurocode 3'!$L$62<>'Steel Eurocode 3'!$AC$43,'Graph Properties'!FU336,'Graph Properties'!FU337)","v":-17.709276416141059},{"$f":"IF('Steel Eurocode 3'!$L$62<>'Steel Eurocode 3'!$AC$43,'Graph Properties'!FV336,'Graph Properties'!FV337)","v":-17.554002540794464},{"$f":"IF('Steel Eurocode 3'!$L$62<>'Steel Eurocode 3'!$AC$43,'Graph Properties'!FW336,'Graph Properties'!FW337)","v":-17.395896958344867},{"$f":"IF('Steel Eurocode 3'!$L$62<>'Steel Eurocode 3'!$AC$43,'Graph Properties'!FX336,'Graph Properties'!FX337)","v":-17.234981003195109},{"$f":"IF('Steel Eurocode 3'!$L$62<>'Steel Eurocode 3'!$AC$43,'Graph Properties'!FY336,'Graph Properties'!FY337)","v":-17.071276276636041},{"$f":"IF('Steel Eurocode 3'!$L$62<>'Steel Eurocode 3'!$AC$43,'Graph Properties'!FZ336,'Graph Properties'!FZ337)","v":-16.90480464684649},{"$f":"IF('Steel Eurocode 3'!$L$62<>'Steel Eurocode 3'!$AC$43,'Graph Properties'!GA336,'Graph Properties'!GA337)","v":-16.735588248893318},{"$f":"IF('Steel Eurocode 3'!$L$62<>'Steel Eurocode 3'!$AC$43,'Graph Properties'!GB336,'Graph Properties'!GB337)","v":-16.563649484731336},{"$f":"IF('Steel Eurocode 3'!$L$62<>'Steel Eurocode 3'!$AC$43,'Graph Properties'!GC336,'Graph Properties'!GC337)","v":-16.389011023203373},{"$f":"IF('Steel Eurocode 3'!$L$62<>'Steel Eurocode 3'!$AC$43,'Graph Properties'!GD336,'Graph Properties'!GD337)","v":-16.21169580004026},{"$f":"IF('Steel Eurocode 3'!$L$62<>'Steel Eurocode 3'!$AC$43,'Graph Properties'!GE336,'Graph Properties'!GE337)","v":-16.031727017860803},{"$f":"IF('Steel Eurocode 3'!$L$62<>'Steel Eurocode 3'!$AC$43,'Graph Properties'!GF336,'Graph Properties'!GF337)","v":-15.849128146171825},{"$f":"IF('Steel Eurocode 3'!$L$62<>'Steel Eurocode 3'!$AC$43,'Graph Properties'!GG336,'Graph Properties'!GG337)","v":-15.663922921368133},{"$f":"IF('Steel Eurocode 3'!$L$62<>'Steel Eurocode 3'!$AC$43,'Graph Properties'!GH336,'Graph Properties'!GH337)","v":-15.476135346732526},{"$f":"IF('Steel Eurocode 3'!$L$62<>'Steel Eurocode 3'!$AC$43,'Graph Properties'!GI336,'Graph Properties'!GI337)","v":-15.285789856114118},{"$f":"IF('Steel Eurocode 3'!$L$62<>'Steel Eurocode 3'!$AC$43,'Graph Properties'!GJ336,'Graph Properties'!GJ337)","v":-15.092914914851244},{"$f":"IF('Steel Eurocode 3'!$L$62<>'Steel Eurocode 3'!$AC$43,'Graph Properties'!GK336,'Graph Properties'!GK337)","v":-14.897543019771465},{"$f":"IF('Steel Eurocode 3'!$L$62<>'Steel Eurocode 3'!$AC$43,'Graph Properties'!GL336,'Graph Properties'!GL337)","v":-14.699707098268663},{"$f":"IF('Steel Eurocode 3'!$L$62<>'Steel Eurocode 3'!$AC$43,'Graph Properties'!GM336,'Graph Properties'!GM337)","v":-14.499440344624693},{"$f":"IF('Steel Eurocode 3'!$L$62<>'Steel Eurocode 3'!$AC$43,'Graph Properties'!GN336,'Graph Properties'!GN337)","v":-14.29677622000942},{"$f":"IF('Steel Eurocode 3'!$L$62<>'Steel Eurocode 3'!$AC$43,'Graph Properties'!GO336,'Graph Properties'!GO337)","v":-14.09174845248069},{"$f":"IF('Steel Eurocode 3'!$L$62<>'Steel Eurocode 3'!$AC$43,'Graph Properties'!GP336,'Graph Properties'!GP337)","v":-13.884391036984372},{"$f":"IF('Steel Eurocode 3'!$L$62<>'Steel Eurocode 3'!$AC$43,'Graph Properties'!GQ336,'Graph Properties'!GQ337)","v":-13.674738235354312},{"$f":"IF('Steel Eurocode 3'!$L$62<>'Steel Eurocode 3'!$AC$43,'Graph Properties'!GR336,'Graph Properties'!GR337)","v":-13.462824576312336},{"$f":"IF('Steel Eurocode 3'!$L$62<>'Steel Eurocode 3'!$AC$43,'Graph Properties'!GS336,'Graph Properties'!GS337)","v":-13.248684855468301},{"$f":"IF('Steel Eurocode 3'!$L$62<>'Steel Eurocode 3'!$AC$43,'Graph Properties'!GT336,'Graph Properties'!GT337)","v":-13.032354135320029},{"$f":"IF('Steel Eurocode 3'!$L$62<>'Steel Eurocode 3'!$AC$43,'Graph Properties'!GU336,'Graph Properties'!GU337)","v":-12.813867745253354},{"$f":"IF('Steel Eurocode 3'!$L$62<>'Steel Eurocode 3'!$AC$43,'Graph Properties'!GV336,'Graph Properties'!GV337)","v":-12.593261281542095},{"$f":"IF('Steel Eurocode 3'!$L$62<>'Steel Eurocode 3'!$AC$43,'Graph Properties'!GW336,'Graph Properties'!GW337)","v":-12.370570607348075},{"$f":"IF('Steel Eurocode 3'!$L$62<>'Steel Eurocode 3'!$AC$43,'Graph Properties'!GX336,'Graph Properties'!GX337)","v":-12.145831852721106},{"$f":"IF('Steel Eurocode 3'!$L$62<>'Steel Eurocode 3'!$AC$43,'Graph Properties'!GY336,'Graph Properties'!GY337)","v":-11.919081414599006},{"$f":"IF('Steel Eurocode 3'!$L$62<>'Steel Eurocode 3'!$AC$43,'Graph Properties'!GZ336,'Graph Properties'!GZ337)","v":-11.690355956807572},{"$f":"IF('Steel Eurocode 3'!$L$62<>'Steel Eurocode 3'!$AC$43,'Graph Properties'!HA336,'Graph Properties'!HA337)","v":-11.459692410060605},{"$f":"IF('Steel Eurocode 3'!$L$62<>'Steel Eurocode 3'!$AC$43,'Graph Properties'!HB336,'Graph Properties'!HB337)","v":-11.227127971959902},{"$f":"IF('Steel Eurocode 3'!$L$62<>'Steel Eurocode 3'!$AC$43,'Graph Properties'!HC336,'Graph Properties'!HC337)","v":-10.99270010699526},{"$f":"IF('Steel Eurocode 3'!$L$62<>'Steel Eurocode 3'!$AC$43,'Graph Properties'!HD336,'Graph Properties'!HD337)","v":-10.75644654654446},{"$f":"IF('Steel Eurocode 3'!$L$62<>'Steel Eurocode 3'!$AC$43,'Graph Properties'!HE336,'Graph Properties'!HE337)","v":-10.518405288873282},{"$f":"IF('Steel Eurocode 3'!$L$62<>'Steel Eurocode 3'!$AC$43,'Graph Properties'!HF336,'Graph Properties'!HF337)","v":-10.278614599135512},{"$f":"IF('Steel Eurocode 3'!$L$62<>'Steel Eurocode 3'!$AC$43,'Graph Properties'!HG336,'Graph Properties'!HG337)","v":-10.037113009372913},{"$f":"IF('Steel Eurocode 3'!$L$62<>'Steel Eurocode 3'!$AC$43,'Graph Properties'!HH336,'Graph Properties'!HH337)","v":-9.7939393185152568},{"$f":"IF('Steel Eurocode 3'!$L$62<>'Steel Eurocode 3'!$AC$43,'Graph Properties'!HI336,'Graph Properties'!HI337)","v":-9.5491325923803085},{"$f":"IF('Steel Eurocode 3'!$L$62<>'Steel Eurocode 3'!$AC$43,'Graph Properties'!HJ336,'Graph Properties'!HJ337)","v":-9.3027321636738272},{"$f":"IF('Steel Eurocode 3'!$L$62<>'Steel Eurocode 3'!$AC$43,'Graph Properties'!HK336,'Graph Properties'!HK337)","v":-9.0547776319895608},{"$f":"IF('Steel Eurocode 3'!$L$62<>'Steel Eurocode 3'!$AC$43,'Graph Properties'!HL336,'Graph Properties'!HL337)","v":-8.8053088638092678},{"$f":"IF('Steel Eurocode 3'!$L$62<>'Steel Eurocode 3'!$AC$43,'Graph Properties'!HM336,'Graph Properties'!HM337)","v":-8.5543659925026834},{"$f":"IF('Steel Eurocode 3'!$L$62<>'Steel Eurocode 3'!$AC$43,'Graph Properties'!HN336,'Graph Properties'!HN337)","v":-8.3019894183275547},{"$f":"IF('Steel Eurocode 3'!$L$62<>'Steel Eurocode 3'!$AC$43,'Graph Properties'!HO336,'Graph Properties'!HO337)","v":-8.0482198084296108},{"$f":"IF('Steel Eurocode 3'!$L$62<>'Steel Eurocode 3'!$AC$43,'Graph Properties'!HP336,'Graph Properties'!HP337)","v":-7.7930980968425931},{"$f":"IF('Steel Eurocode 3'!$L$62<>'Steel Eurocode 3'!$AC$43,'Graph Properties'!HQ336,'Graph Properties'!HQ337)","v":-7.5366654844882115},{"$f":"IF('Steel Eurocode 3'!$L$62<>'Steel Eurocode 3'!$AC$43,'Graph Properties'!HR336,'Graph Properties'!HR337)","v":-7.2789634391762004},{"$f":"IF('Steel Eurocode 3'!$L$62<>'Steel Eurocode 3'!$AC$43,'Graph Properties'!HS336,'Graph Properties'!HS337)","v":-7.0200336956042753},{"$f":"IF('Steel Eurocode 3'!$L$62<>'Steel Eurocode 3'!$AC$43,'Graph Properties'!HT336,'Graph Properties'!HT337)","v":-6.7599182553581398},{"$f":"IF('Steel Eurocode 3'!$L$62<>'Steel Eurocode 3'!$AC$43,'Graph Properties'!HU336,'Graph Properties'!HU337)","v":-6.498659386911509},{"$f":"IF('Steel Eurocode 3'!$L$62<>'Steel Eurocode 3'!$AC$43,'Graph Properties'!HV336,'Graph Properties'!HV337)","v":-6.2362996256260814},{"$f":"IF('Steel Eurocode 3'!$L$62<>'Steel Eurocode 3'!$AC$43,'Graph Properties'!HW336,'Graph Properties'!HW337)","v":-5.9728817737515616},{"$f":"IF('Steel Eurocode 3'!$L$62<>'Steel Eurocode 3'!$AC$43,'Graph Properties'!HX336,'Graph Properties'!HX337)","v":-5.7084489004256316},{"$f":"IF('Steel Eurocode 3'!$L$62<>'Steel Eurocode 3'!$AC$43,'Graph Properties'!HY336,'Graph Properties'!HY337)","v":-5.4430443416739873},{"$f":"IF('Steel Eurocode 3'!$L$62<>'Steel Eurocode 3'!$AC$43,'Graph Properties'!HZ336,'Graph Properties'!HZ337)","v":-5.1767117004103111},{"$f":"IF('Steel Eurocode 3'!$L$62<>'Steel Eurocode 3'!$AC$43,'Graph Properties'!IA336,'Graph Properties'!IA337)","v":-4.9094948464362851},{"$f":"IF('Steel Eurocode 3'!$L$62<>'Steel Eurocode 3'!$AC$43,'Graph Properties'!IB336,'Graph Properties'!IB337)","v":-4.6414379164415811},{"$f":"IF('Steel Eurocode 3'!$L$62<>'Steel Eurocode 3'!$AC$43,'Graph Properties'!IC336,'Graph Properties'!IC337)","v":-4.3725853140038673},{"$f":"IF('Steel Eurocode 3'!$L$62<>'Steel Eurocode 3'!$AC$43,'Graph Properties'!ID336,'Graph Properties'!ID337)","v":-4.1029817095888097},{"$f":"IF('Steel Eurocode 3'!$L$62<>'Steel Eurocode 3'!$AC$43,'Graph Properties'!IE336,'Graph Properties'!IE337)","v":-3.8326720405500732},{"$f":"IF('Steel Eurocode 3'!$L$62<>'Steel Eurocode 3'!$AC$43,'Graph Properties'!IF336,'Graph Properties'!IF337)","v":-3.561701511129308},{"$f":"IF('Steel Eurocode 3'!$L$62<>'Steel Eurocode 3'!$AC$43,'Graph Properties'!IG336,'Graph Properties'!IG337)","v":-3.2901155924561682},{"$f":"IF('Steel Eurocode 3'!$L$62<>'Steel Eurocode 3'!$AC$43,'Graph Properties'!IH336,'Graph Properties'!IH337)","v":-3.0179600225483032},{"$f":"IF('Steel Eurocode 3'!$L$62<>'Steel Eurocode 3'!$AC$43,'Graph Properties'!II336,'Graph Properties'!II337)","v":-2.7452808063113512},{"$f":"IF('Steel Eurocode 3'!$L$62<>'Steel Eurocode 3'!$AC$43,'Graph Properties'!IJ336,'Graph Properties'!IJ337)","v":-2.4721242155389476},{"$f":"IF('Steel Eurocode 3'!$L$62<>'Steel Eurocode 3'!$AC$43,'Graph Properties'!IK336,'Graph Properties'!IK337)","v":-2.1985367889127305},{"$f":"IF('Steel Eurocode 3'!$L$62<>'Steel Eurocode 3'!$AC$43,'Graph Properties'!IL336,'Graph Properties'!IL337)","v":-1.9245653320023184},{"$f":"IF('Steel Eurocode 3'!$L$62<>'Steel Eurocode 3'!$AC$43,'Graph Properties'!IM336,'Graph Properties'!IM337)","v":-1.6502569172653501},{"$f":"IF('Steel Eurocode 3'!$L$62<>'Steel Eurocode 3'!$AC$43,'Graph Properties'!IN336,'Graph Properties'!IN337)","v":-1.375658884047428},{"$f":"IF('Steel Eurocode 3'!$L$62<>'Steel Eurocode 3'!$AC$43,'Graph Properties'!IO336,'Graph Properties'!IO337)","v":-1.1008188385821798},{"$f":"IF('Steel Eurocode 3'!$L$62<>'Steel Eurocode 3'!$AC$43,'Graph Properties'!IP336,'Graph Properties'!IP337)","v":-0.82578465399119483},{"$f":"IF('Steel Eurocode 3'!$L$62<>'Steel Eurocode 3'!$AC$43,'Graph Properties'!IQ336,'Graph Properties'!IQ337)","v":-0.55060447028410286},{"$f":"IF('Steel Eurocode 3'!$L$62<>'Steel Eurocode 3'!$AC$43,'Graph Properties'!IR336,'Graph Properties'!IR337)","v":-0.27532669435848411},{"$f":"IF('Steel Eurocode 3'!$L$62<>'Steel Eurocode 3'!$AC$43,'Graph Properties'!IS336,'Graph Properties'!IS337)","v":4.5843592514894429E-14}]

{"sheet":"Section tables new","index":2,"n_rows":513,"n_cols":22,"rows_kept":513,"cut":false,"hidden":true,"merged":[[311,3,311,7],[333,3,333,7],[444,3,444,7],[494,3,494,7],[3,3,3,7],[49,3,49,7],[165,3,165,7],[202,3,202,7],[268,3,268,7],[293,3,293,7]]}
[null,null,null,null,null,null,null,"UB","UC","PFC"]
[]
[]
[null,null,"Desig-","Dimensions",null,null,null,null,"Area","Weight","ly","Wel.y","Wpl.y","iy","lz","Wel.z","Wpl.z","iz","lt","lw","Avz"]
[null,null,"nation","h","b","tw","tf","r","A","G","mm4","mm3","mm3","mm ","mm4","mm3","mm3","mm ","mm4","mm6","mm2"]
[null,{"$f":"C6","v":"HD"},"HD","mm ","mm ","mm ","mm ","mm ","mm2","kg/m ","(x 104)","(x 103)","(x 103)","(x 10 )","(x 104)","(x 103)","(x 103)","(x 10 )","(x 104)","(x 109)","(x 102)"]
[null,{"$f":"COUNTA(C7:C48)","v":42},"260x54.1",244,260,6.5,9.5,24,6900,54.1,7981,654.1,714.5,10.76,2788,214.5,327.7,6.36,30.31,382.6,24.75]
[null,null,"260x68.2",250,260,7.5,12.5,24,8680,68.2,10450,836.4,919.8,10.97,3668,282.10000000000002,430.2,6.5,52.37,516.4,28.76]
[null,null,"260x93.0",260,260,10,17.5,24,11840,93,14920,1148,1283,11.22,5135,395,602.20000000000005,6.58,123.8,753.7,37.590000000000003]
[null,null,"260x114",268,262,12.5,21.5,24,14569.999999999998,114,18910,1411,1600,11.39,6456,492.8,752.5,6.66,222.4,979,46.08]
[null,null,"260x142",278,265,15.5,26.5,24,18030,142,24330,1750,2015,11.62,8236,621.6,950.5,6.76,406.8,1300,56.65]
[null,null,"260x172",290,268,18,32.5,24,21960,172,31310,2159,2524,11.94,10450,779.7,1192,6.9,719,1728,66.89]
[null,null,"260x225",309,271,24,42,24,28660.000000000004,225,43750,2832,3396,12.36,13970,1031,1583,6.98,1545,2483,89.18]
[null,null,"260x299",335,278,31,55,24,38050,299,64220,3834,4727,12.99,19770,1423,2190,7.21,3437,3860,118.1]
[null,null,"320x74.2",301,300,8,11,27,9460,74.2,16450,1093,1196,13.19,4959,330.6,505.7,7.24,55.87,1041,35.4]
[null,null,"320x97.6",310,300,9,15.5,27,12440,97.6,22930,1479,1628,13.58,6985,465.7,709.7,7.49,108,1512,41.13]
[null,null,"320x127",320,300,11.5,20.5,27,16130.000000000002,127,30820,1926,2149,13.82,9239,615.9,939.1,7.57,225.1,2069,51.77]
[null,null,"320x158",330,303,14.5,25.5,27,20120,158,39640,2403,2718,14.04,11840,781.7,1194,7.67,420.5,2741,64.180000000000007]
[null,null,"320x198",343,306,18,32,27,25230,198,51900,3026,3479,14.34,15310,1001,1530,7.79,805.3,3695,79.52]
[null,null,"320x245",359,309,21,40,27,31200,245,68130,3796,4435,14.78,19710,1276,1951,7.95,1501,5004,94.85]
[null,null,"320x300",375,313,27,48,27,38210,300,86900,4635,5522,15.08,24600,1572,2414,8.02,2650,6558,120.47]
[null,null,"360x134",356,369,11.2,18,15,17060,134,41510,2332,2562,15.6,15080,817.3,1237,9.4,168.8,4305,45.19]
[null,null,"360x147",360,370,12.3,19.8,15,18790,147,46290,2572,2838,15.7,16720,903.9,1369,9.43,223.7,4836,49.72]
[null,null,"360x162",364,371,13.3,21.8,15,20630,162,51540,2832,3139,15.81,18560,1001,1516,9.49,295.5,5432,53.98]
[null,null,"360x179",368,373,15,23.9,15,22830,179,57440,3122,3482,15.86,20680,1109,1683,9.52,393.8,6119,60.72]
[null,null,"360x196",372,374,16.399999999999999,26.2,15,25030,196,63630,3421,3837,15.94,22860,1222,1856,9.56,517.1,6829,66.5]
[null,null,"400x187",368,391,15,24,15,23760,187,60180,3271,3642,15.91,23920,1224,1855,10.029999999999999,414.6,7074,60.73]
[null,null,"400x216",375,394,17.3,27.7,15,27550,216,71140,3794,4262,16.07,28250,1434,2176,10.130000000000001,637.29999999999995,8515,70.319999999999993]
[null,null,"400x237",380,395,18.899999999999999,30.2,15,30089.999999999996,237,78780,4146,4686,16.18,31040,1572,2387,10.16,825.5,9489,77.099999999999994]
[null,null,"400x262",387,398,21.1,33.299999999999997,15,33460,262,89410,4620,5260,16.350000000000001,35020,1760,2676,10.23,1116,10940,86.55]
[null,null,"400x287",393,399,22.6,36.6,15,36630,287,99710,5074,5813,16.5,38780,1944,2957,10.29,1464,12300,93.46]
[null,null,"400x314",399,401,24.9,39.6,15,39920,314,110200,5525,6374,16.62,42600,2125,3236,10.33,1870,13740,103.3]
[null,null,"400x347",407,404,27.2,43.7,15,44200,347,124900,6140,7139,16.809999999999999,48090,2380,3629,10.43,2510,15850,113.9]
[null,null,"400x382",416,406,29.8,48,15,48710,382,141300,6794,7965,17.03,53620,2641,4031,10.49,3326,18130,126]
[null,null,"400x421",425,409,32.799999999999997,52.6,15,53710,421,159600,7510,8880,17.239999999999998,60080,2938,4489,10.58,4398,20800,139.9]
[null,null,"400x463",435,412,35.799999999999997,57.4,15,58950,463,180200,8283,9878,17.48,67040,3254,4978,10.66,5735,23850,154.30000000000001]
[null,null,"400x509",446,416,39.1,62.7,15,64900,509,204500,9172,11030,17.75,75400,3625,5552,10.78,7513,27630,170.6]
[null,null,"400x551",455,418,42,67.599999999999994,15,70140,551,226100,9939,12050,17.95,82490,3947,6051,10.85,9410,30870,184.9]
[null,null,"400x592",465,421,45,72.3,15,75490,592,250200,10760,13140,18.2,90170,4284,6574,10.93,11560,34670,200.3]
[null,null,"400x634",474,424,47.6,77.099999999999994,15,80800,634,274200,11570,14220,18.420000000000002,98250,4634,7117,11.03,14020,38570,214]
[null,null,"400x677",483,428,51.2,81.5,15,86340,677,299500,12400,15350,18.62,106900,4994,7680,11.13,16790,42920,231.9]
[null,null,"400x744",498,432,55.6,88.9,15,94810,744,342100,13740,17170,19,119900,5552,8549,11.25,21840,49980,256.10000000000002]
[null,null,"400x818",514,437,60.5,97,15,104300,818,392200,15260,19260,19.39,135500,6203,9561,11.4,28510,58650,283.3]
[null,null,"400x900",531,442,65.900000000000006,106,15,114900,900,450200,16960,21620,19.79,153300,6938,10710,11.55,37350,68890,313.8]
[null,null,"400x990",550,448,71.900000000000006,115,15,126200,990,518900,18870,24280,20.27,173400,7739,11960,11.72,48210,81530,349.2]
[null,null,"400x1086",569,454,78,125,15,138600,1086,595700,20940,27210,20.73,196200,8645,13380,11.9,62290,96080,385.8]
[null,null,"400x1202",580,471,95,130,15,153000,1202,663600,22880,30020,20.82,228700,9712,15150,12.22,79230,114600,469.6]
[null,null,"400x1299",600,476,100,140,15,165000,1299,754600,25150,33250,21.35,254400,10690,16670,12.4,98140,133100,505.2]
[]
[null,null,"Desig-","Dimensions",null,null,null,null,"Area","Weight","ly","Wel.y","Wpl.y","iy","lz","Wel.z","Wpl.z","iz","lt","lw","Avz"]
[null,null,"nation","h","b","tw","tf","r","A","G","mm4","mm3","mm3","mm ","mm4","mm3","mm3","mm ","mm4","mm6","mm2"]
[null,{"$f":"C52","v":"HE"},"HE","mm ","mm ","mm ","mm ","mm ","mm2","kg/m ","(x 104)","(x 103)","(x 103)","(x 10 )","(x 104)","(x 103)","(x 103)","(x 10 )","(x 104)","(x 109)","(x 102)"]
[null,{"$f":"COUNTA(C53:C164)","v":112},"100 AA",91,100,4.2,5.5,12,1560,12.2,236.5,51.98,58.36,3.89,92.06,18.41,28.44,2.4300000000000002,2.5099999999999998,1.68,6.15]
[null,null,"100 A",96,100,5,8,12,2120,16.7,349.2,72.760000000000005,83.01,4.0599999999999996,133.80000000000001,26.76,41.14,2.5099999999999998,5.24,2.58,7.56]
[null,null,"100 B",100,100,6,10,12,2600,20.399999999999999,449.5,89.91,104.2,4.16,167.3,33.450000000000003,51.42,2.5299999999999998,9.25,3.38,9.0399999999999991]
[null,null,"100 M",120,106,12,20,12,5320,41.8,1143,190.4,235.8,4.63,399.2,75.31,116.3,2.74,68.209999999999994,9.93,18.04]
[null,null,"120 AA",109,120,4.2,5.5,12,1860.0000000000002,14.6,413.4,75.849999999999994,84.12,4.72,158.80000000000001,26.47,40.619999999999997,2.93,2.78,4.24,6.9]
[null,null,"120 A",114,120,5,8,12,2530,19.899999999999999,606.20000000000005,106.3,119.5,4.8899999999999997,230.9,38.479999999999997,58.85,3.02,5.99,6.47,8.4600000000000009]
[null,null,"120 B",120,120,6.5,11,12,3400,26.7,864.4,144.1,165.2,5.04,317.5,52.92,80.97,3.06,13.84,9.41,10.96]
[null,null,"120 M",140,126,12.5,21,12,6640.0000000000009,52.1,2018,288.2,350.6,5.51,702.8,111.6,171.6,3.25,91.66,24.79,21.15]
[null,null,"140 AA",128,140,4.3,6,12,2300,18.100000000000001,719.5,112.4,123.8,5.59,274.8,39.26,59.93,3.45,3.54,10.210000000000001,7.92]
[null,null,"140 A",133,140,5.5,8.5,12,3140,24.7,1033,155.4,173.5,5.73,389.3,55.62,84.85,3.52,8.1300000000000008,15.06,10.119999999999999]
[null,null,"140 B",140,140,7,12,12,4300,33.700000000000003,1509,215.6,245.4,5.93,549.70000000000005,78.52,119.8,3.58,20.059999999999999,22.48,13.08]
[null,null,"140 M",160,146,13,22,12,8059.9999999999991,63.2,3291,411.4,493.8,6.39,1144,156.80000000000001,240.5,3.77,120,54.33,24.46]
[null,null,"160 AA",148,160,4.5,7,15,3040,23.8,1283,173.4,190.4,6.5,478.7,59.84,91.36,3.97,6.33,23.75,10.38]
[null,null,"160 A",152,160,6,9,15,3879.9999999999995,30.4,1673,220.1,245.1,6.57,615.6,76.95,117.6,3.98,12.19,31.41,13.21]
[null,null,"160 B",160,160,8,13,15,5430,42.6,2492,311.5,354,6.78,889.2,111.2,170,4.05,31.24,47.94,17.59]
[null,null,"160 M",180,166,14,23,15,9710,76.2,5098,566.5,674.6,7.25,1759,211.9,325.5,4.26,162.4,108.1,30.81]
[null,null,"180 AA",167,180,5,7.5,15,3650,28.7,1967,235.6,258.2,7.34,730,81.11,123.6,4.47,8.33,46.36,12.16]
[null,null,"180 A",171,180,6,9.5,15,4530,35.5,2510,293.60000000000002,324.89999999999998,7.45,924.6,102.7,156.5,4.5199999999999996,14.8,60.21,14.47]
[null,null,"180 B",180,180,8.5,14,15,6530,51.2,3831,425.7,481.4,7.66,1363,151.4,231,4.57,42.16,93.75,20.239999999999998]
[null,null,"180 M",200,186,14.5,24,15,11330,88.9,7483,748.3,883.4,8.1300000000000008,2580,277.39999999999998,425.2,4.7699999999999996,203.3,199.3,34.65]
[null,null,"200 AA",186,200,5.5,8,18,4410,34.6,2944,316.60000000000002,347.1,8.17,1068,106.8,163.19999999999999,4.92,12.69,84.49,15.45]
[null,null,"200 A",190,200,6.5,10,18,5380,42.3,3692,388.6,429.5,8.2799999999999994,1336,133.6,203.8,4.9800000000000004,20.98,108,18.079999999999998]
[null,null,"200 B",200,200,9,15,18,7809.9999999999991,61.3,5696,569.6,642.5,8.5399999999999991,2003,200.3,305.8,5.07,59.28,171.1,24.83]
[null,null,"200 M",220,206,15,25,18,13130.000000000002,103,10640,967.4,1135,9,3651,354.5,543.20000000000005,5.27,259.39999999999998,346.3,41.03]
[null,null,"220 AA",205,220,6,8.5,18,5150,40.4,4170,406.9,445.5,9,1510,137.30000000000001,209.3,5.42,15.93,145.6,17.63]
[null,null,"220 A",210,220,7,11,18,6430,50.5,5410,515.20000000000005,568.5,9.17,1955,177.7,270.60000000000002,5.51,28.46,193.3,20.67]
[null,null,"220 B",220,220,9.5,16,18,9100,71.5,8091,735.5,827,9.43,2843,258.5,393.9,5.59,76.569999999999993,295.39999999999998,27.92]
[null,null,"220 M",240,226,15.5,26,18,14940,117,14600,1217,1419,9.89,5012,443.5,678.6,5.79,315.3,572.70000000000005,45.31]
[null,null,"240 AA",224,240,6.5,9,21,6040,47.4,5835,521,570.6,9.83,2077,173.1,264.39999999999998,5.87,22.98,239.6,21.54]
[null,null,"240 A",230,240,7.5,12,21,7680,60.3,7763,675.1,744.6,10.050000000000001,2769,230.7,351.7,6,41.55,328.5,25.18]
[null,null,"240 B",240,240,10,17,21,10600,83.2,11260,938.3,1053,10.31,3923,326.89999999999998,498.4,6.08,102.7,486.9,33.229999999999997]
[null,null,"240 M",270,248,18,32,21,19960,157,24290,1799,2117,11.03,8153,657.5,1006,6.39,627.9,1152,60.07]
[null,null,"260 AA",244,260,6.5,9.5,24,6900,54.1,7981,654.1,714.5,10.76,2788,214.5,327.7,6.36,30.31,382.6,24.75]
[null,null,"260 A",250,260,7.5,12.5,24,8680,68.2,10450,836.4,919.8,10.97,3668,282.10000000000002,430.2,6.5,52.37,516.4,28.76]
[null,null,"260 B",260,260,10,17.5,24,11840,93,14920,1148,1283,11.22,5135,395,602.20000000000005,6.58,123.8,753.7,37.590000000000003]
[null,null,"260 M",290,268,18,32.5,24,21960,172,31310,2159,2524,11.94,10450,779.7,1192,6.9,719,1728,66.89]
[null,null,"280 AA",264,280,7,10,24,7800,61.2,10560,799.8,873.1,11.63,3664,261.7,399.4,6.85,36.22,590.1,27.52]
[null,null,"280 A",270,280,8,13,24,9730,76.400000000000006,13670,1013,1112,11.86,4763,340.2,518.1,7,62.1,785.4,31.74]
[null,null,"280 B",280,280,10.5,18,24,13140,103,19270,1376,1534,12.11,6595,471,717.6,7.09,143.69999999999999,1130,41.09]
[null,null,"280 M",310,288,18.5,33,24,24020,189,39550,2551,2966,12.83,13160,914.1,1397,7.4,807.3,2520,72.03]
[null,null,"300 AA",283,300,7.5,10.5,27,8890,69.8,13800,975.6,1065,12.46,4734,315.60000000000002,482.3,7.3,49.35,877.2,32.369999999999997]
[null,null,"300 A",290,300,8.5,14,27,11250,88.3,18260,1260,1383,12.74,6310,420.6,641.20000000000005,7.49,85.17,1200,37.28]
[null,null,"300 B",300,300,11,19,27,14910,117,25170,1678,1869,12.99,8563,570.9,870.1,7.58,185,1688,47.43]
[null,null,"300 M",340,310,21,39,27,30310.000000000004,238,59200,3482,4078,13.98,19400,1252,1913,8,1408,4386,90.53]
[null,null,"320 AA",301,300,8,11,27,9460,74.2,16450,1093,1196,13.19,4959,330.6,505.7,7.24,55.87,1041,35.4]
[null,null,"320 A",310,300,9,15.5,27,12440,97.6,22930,1479,1628,13.58,6985,465.7,709.7,7.49,108,1512,41.13]
[null,null,"320 B",320,300,11.5,20.5,27,16130.000000000002,127,30820,1926,2149,13.82,9239,615.9,939.1,7.57,225.1,2069,51.77]
[null,null,"320 M",359,309,21,40,27,31200,245,68130,3796,4435,14.78,19710,1276,1951,7.95,1501,5004,94.85]
[null,null,"340 AA",320,300,8.5,11.5,27,10050,78.900000000000006,19550,1222,1341,13.95,5185,345.6,529.29999999999995,7.18,63.07,1231,38.69]
[null,null,"340 A",330,300,9.5,16.5,27,13350,105,27690,1678,1850,14.4,7436,495.7,755.9,7.46,127.2,1824,44.95]
[null,null,"340 B",340,300,12,21.5,27,17090,134,36660,2156,2408,14.65,9690,646,985.7,7.53,257.2,2454,56.09]
[null,null,"340 M",377,309,21,40,27,31580,248,76370,4052,4718,15.55,19710,1276,1953,7.9,1506,5584,98.63]
[null,null,"360 AA",339,300,9,12,27,10660,83.7,23040,1359,1495,14.7,5410,360.7,553,7.12,70.989999999999995,1444,42.17]
[null,null,"360 A",350,300,10,17.5,27,14280.000000000002,112,33090,1891,2088,15.22,7887,525.79999999999995,802.3,7.43,148.80000000000001,2177,48.96]
[null,null,"360 B",360,300,12.5,22.5,27,18060,142,43190,2400,2683,15.46,10140,676.1,1032,7.49,292.5,2883,60.6]
[null,null,"360 M",395,308,21,40,27,31880,250,84870,4297,4989,16.32,19520,1268,1942,7.83,1507,6137,102.4]
[null,null,"400 AA",378,300,9.5,13,27,11770,92.4,31250,1654,1824,16.3,5861,390.8,599.70000000000005,7.06,84.69,1948,47.95]
[null,null,"400 A",390,300,11,19,27,15900,125,45070,2311,2562,16.84,8564,570.9,872.9,7.34,189,2942,57.33]
[null,null,"400 B",400,300,13.5,24,27,19780,155,57680,2884,3232,17.079999999999998,10820,721.3,1104,7.4,355.7,3817,69.98]
[null,null,"400 M",432,307,21,40,27,32580,256,104100,4820,5571,17.88,19340,1260,1934,7.7,1515,7410,110.2]
[null,null,"450 AA",425,300,10,13.5,27,12710,99.7,41890,1971,2183,18.16,6088,405.8,624.4,6.92,95.61,2572,54.7]
[null,null,"450 A",440,300,11.5,21,27,17800,140,63720,2896,3216,18.920000000000002,9465,631,965.5,7.29,243.8,4148,65.78]
[null,null,"450 B",450,300,14,26,27,21800,171,79890,3551,3982,19.14,11720,781.4,1198,7.33,440.5,5258,79.66]
[null,null,"450 M",478,307,21,40,27,33540,263,131500,5501,6331,19.8,19340,1260,1939,7.59,1529,9251,119.8]
[null,null,"500 AA",472,300,10.5,14,27,13690,107,54640,2315,2576,19.98,6314,420.9,649.29999999999995,6.79,107.7,3304,61.91]
[null,null,"500 A",490,300,12,23,27,19750,155,86970,3550,3949,20.98,10370,691.1,1059,7.24,309.3,5643,74.72]
[null,null,"500 B",500,300,14.5,28,27,23860,187,107200,4287,4815,21.19,12620,841.6,1292,7.27,538.4,7018,89.82]
[null,null,"500 M",524,306,21,40,27,34430,270,161900,6180,7094,21.69,19150,1252,1932,7.46,1539,11190,129.5]
[null,null,"550 AA",522,300,11.5,15,27,15280.000000000002,120,72870,2792,3128,21.84,6767,451.1,698.6,6.65,133.69999999999999,4338,72.66]
[null,null,"550 A",540,300,12.5,24,27,21180,166,111900,4146,4622,22.99,10820,721.3,1107,7.15,351.5,7189,83.72]
[null,null,"550 B",550,300,15,29,27,25410,199,136700,4971,5591,23.2,13080,871.8,1341,7.17,600.29999999999995,8856,100.1]
[null,null,"550 M",572,306,21,40,27,35440,278,198000,6923,7933,23.64,19160,1252,1937,7.35,1554,13520,139.6]
[null,null,"600 AA",571,300,12,15.5,27,16410,129,91900,3218,3623,23.66,6993,466.2,724.5,6.53,149.80000000000001,5381,81.290000000000006]
[null,null,"600 A",590,300,13,25,27,22650,178,141200,4787,5350,24.97,11270,751.4,1156,7.05,397.8,8978,93.21]
[null,null,"600 B",600,300,15.5,30,27,27000,212,171000,5701,6425,25.17,13530,902,1391,7.08,667.2,10970,110.8]
[null,null,"600 M",620,305,21,40,27,36370,285,237400,7660,8772,25.55,18980,1244,1930,7.22,1564,15910,149.69999999999999]
[null,null,"600x337",632,310,25.5,46,27,42920,337,283200,8961,10380,25.69,22940,1480,2310,7.31,2451,19610,180.5]
[null,null,"600x399",648,315,30,54,27,50850,399,344600,10640,12460,26.03,28280,1796,2814,7.46,3966,24810,213.6]
[null,null,"650 AA",620,300,12.5,16,27,17580,138,113900,3676,4160,25.46,7221,481.4,750.7,6.41,167.5,6567,90.4]
[null,null,"650 A",640,300,13.5,26,27,24160,190,175200,5474,6136,26.93,11720,781.6,1205,6.97,448.3,11030,103.2]
[null,null,"650 B",650,300,16,31,27,28630,225,210600,6480,7320,27.12,13980,932.3,1441,6.99,739.2,13360,122]
[null,null,"650 M",668,305,21,40,27,37370,293,281700,8433,9657,27.45,18980,1245,1936,7.13,1579,18650,159.69999999999999]
[null,null,"650x343",680,309,25,46,27,43750,343,333700,9815,11350,27.62,22720,1470,2300,7.21,2442,22730,189.6]
[null,null,"650x407",696,314,29.5,54,27,51879.999999999993,407,405400,11650,13620,27.95,28020,1785,2803,7.35,3958,28710,224.8]
[null,null,"700 AA",670,300,13,17,27,19090,150,142700,4260,4840,27.34,7673,511.5,799.7,6.34,195.2,8155,100.3]
[null,null,"700 A",690,300,14.5,27,27,26050,204,215300,6241,7032,28.75,12180,811.9,1257,6.84,513.9,13350,117]
[null,null,"700 B",700,300,17,32,27,30639.999999999996,241,256900,7340,8327,28.96,14440,962.7,1495,6.87,830.9,16060,137.1]
[null,null,"700 M",716,304,21,40,27,38300,301,329300,9198,10540,29.32,18800,1240,1929,7.01,1589,21400,169.8]
[null,null,"700x352",728,308,25,46,27,44860,352,389700,10710,12390,29.47,22510,1461,2293,7.08,2461,26050,201.6]
[null,null,"700x418",744,313,29.5,54,27,53190,418,472500,12700,14840,29.8,27760,1774,2797,7.22,3989,32850,239]
[null,null,"800 AA",770,300,14,18,30,21850,172,208900,5426,6225,30.92,8134,542.20000000000005,856.6,6.1,256.8,11450,123.8]
[null,null,"800 A",790,300,15,28,30,28580,224,303400,7682,8699,32.58,12640,842.6,1312,6.65,596.9,18290,138.80000000000001]
[null,null,"800 B",800,300,17.5,33,30,33420,262,359100,8977,10230,32.78,14900,993.6,1553,6.68,946,21840,161.80000000000001]
[null,null,"800 M",814,303,21,40,30,40430,317,442600,10870,12490,33.090000000000003,18630,1230,1930,6.79,1646,27780,194.3]
[null,null,"800x373",826,308,25,46,30,47460,373,523900,12690,14700,33.229999999999997,22530,1463,2311,6.89,2554,34070,230.3]
[null,null,"800x444",842,313,30,54,30,56600,444,634500,15070,17640,33.479999999999997,27800,1776,2827,7.01,4180,42840,276.5]
[null,null,"900 AA",870,300,15,20,30,25220,198,301100,6923,7999,34.549999999999997,9041,602.79999999999995,957.7,5.99,334.9,16260,147.19999999999999]
[null,null,"900 A",890,300,16,30,30,32050,252,422100,9485,10810,36.29,13550,903.2,1414,6.5,736.8,24960,163.30000000000001]
[null,null,"900 B",900,300,18.5,35,30,37130,291,494100,10980,12580,36.479999999999997,15820,1050,1658,6.53,1137,29460,188.8]
[null,null,"900 M",910,302,21,40,30,42360,333,570400,12540,14440,36.700000000000003,18450,1220,1929,6.6,1671,34750,214.4]
[null,null,"900x391",922,307,25,46,30,49770,391,674300,14630,16990,36.81,22320,1454,2312,6.7,2597,42560,254.3]
[null,null,"900x466",938,312,30,54,30,59370.000000000007,466,814900,17380,20380,37.049999999999997,27560,1767,2832,6.81,4256,53400,305.3]
[null,null,"1000 AA",970,300,16,21,30,28220,222,406500,8380,9777,37.950000000000003,9501,633.4,1016,5.8,403.4,21280,172.2]
[null,null,"1000x249",980,300,16.5,26,30,31680,249,481100,9818,11350,38.97,11750,784,1245,6.09,584.4,26620,180.7]
[null,null,"1000 A",990,300,16.5,31,30,34680,272,553800,11190,12820,39.96,14000,933.6,1470,6.35,822.4,32070,184.6]
[null,null,"1000 B",1000,300,19,36,30,40000,314,644700,12890,14860,40.15,16280,1085,1716,6.38,1254,37640,212.5]
[null,null,"1000 M",1008,302,21,40,30,44420,349,722300,14330,16570,40.32,18460,1222,1940,6.45,1701,43020,235]
[null,null,"1000x393",1016,303,24.4,43.9,30,50020,393,807700,15900,18540,40.18,20500,1353,2168,6.4,2332,48080,271.3]
[null,null,"1000x415",1020,304,26,46,30,52870.000000000007,415,853100,16728,19571,40.17,21710,1428,2298,6.41,2713,51080,288.60000000000002]
[null,null,"1000x438",1026,305,26.9,49,30,55600,438,909200,17720,20750,40.43,23360,1531,2463,6.48,3190,55290,299.89999999999998]
[null,null,"1000x494",1036,309,31,54,30,62910,494,1028000,19845,23413,40.42,26820,1736,2818,6.53,4433,64010,344.5]
[null,null,"1000x584",1056,314,36,64,30,74370,584,1246100,23600,28039,40.93,33430,2130,3475,6.7,7230,81240,403.2]
[]
[null,null,"Desig-","Dimensions",null,null,null,null,"Area","Weight","ly","Wel.y","Wpl.y","iy","lz","Wel.z","Wpl.z","iz","lt","lw","Avz"]
[null,null,"nation","h","b","tw","tf","r","A","G","mm4","mm3","mm3","mm ","mm4","mm3","mm3","mm ","mm4","mm6","mm2"]
[null,{"$f":"C168","v":"HL"},"HL","mm ","mm ","mm ","mm ","mm ","mm2","kg/m ","(x 104)","(x 103)","(x 103)","(x 10 )","(x 104)","(x 103)","(x 103)","(x 10 )","(x 104)","(x 109)","(x 102)"]
[null,{"$f":"COUNTA(C169:C201)","v":33},"920x344",927,418,19.3,32,19,43720,344,645000,13920,15700,38.409999999999997,39010,1867,2880,9.4499999999999993,1159,78120,188]
[null,null,"920x368",931,419,20.3,34.299999999999997,19,46560,368,692200,14870,16790,38.56,42120,2010,3104,9.51,1408,84670,198.2]
[null,null,"920x390",936,420,21.3,36.6,19,49430,390,741700,15850,17920,38.74,45270,2156,3331,9.57,1691,91550,208.6]
[null,null,"920x420",943,422,22.5,39.9,19,53410,420,813300,17250,19530,39.020000000000003,50070,2373,3667,9.68,2151,102100,221.5]
[null,null,"920x449",948,423,24,42.7,19,57140,449,874700,18450,20950,39.130000000000003,53970,2552,3949,9.7200000000000006,2627,110600,236.6]
[null,null,"920x491",957,422,25.9,47,19,62329.999999999993,491,966300,20200,23000,39.369999999999997,59000,2796,4335,9.73,3441,122200,256.60000000000002]
[null,null,"920x537",965,425,28.4,51.1,19,68250,537,1066000,22080,25270,39.51,65550,3085,4795,9.8000000000000007,4447,136900,282.10000000000002]
[null,null,"920x588",975,427,31,55.9,19,74810,588,1181000,24230,27840,39.74,72760,3408,5310,9.86,5860,153200,309.3]
[null,null,"920x656",987,431,34.5,62,19,83530,656,1335000,27060,31270,39.979999999999997,83040,3853,6022,9.9700000000000006,7950,177600,345.8]
[null,null,"920x725",999,434,38.1,68.099999999999994,19,92290,725,1492000,29880,34740,40.21,93200,4295,6734,10.050000000000001,10570,201900,383.6]
[null,null,"920x787",1011,437,40.9,73.900000000000006,19,100200,787,1646000,32560,38010,40.53,103300,4728,7425,10.15,13430,226800,414.5]
[null,null,"920x970",1043,446,50,89.9,19,123700,970,2100000,40270,47660,41.21,133900,6002,9490,10.4,24320,304000,513.79999999999995]
[null,null,"920x1077",1061,451,55,99.1,19,137200,1077,2377000,44790,53390,41.63,152700,6773,10740,10.55,33170,350800,570]
[null,null,"920x1194",1081,457,60.5,109,19,152200,1194,2694000,49830,59830,42.08,175000,7660,12180,10.72,44370,409700,632.70000000000005]
[null,null,"920x1269",1093,461,64,115.1,19,161700,1269,2900000,53040,63960,42.35,189900,8237,13130,10.84,52500,449700,672.9]
[null,null,"920x1377",1093,473,76.7,115.1,19,175400,1377,3034000,55500,67680,41.59,206300,8723,14160,10.85,61190,485700,797.2]
[null,null,"1000 AA",982,400,16.5,27.1,30,37760,296,620300,12630,14260,40.53,28960,1448,2243,8.76,762.6,65900,181.5]
[null,null,"1000 A",990,400,16.5,31,30,40880,321,696400,14070,15800,41.27,33120,1656,2555,9,1021,76030,184.6]
[null,null,"1000 B",1000,400,19,36.1,30,47280,371,813700,16270,18360,41.49,38580,1929,2984,9.0299999999999994,1575,89440,212.5]
[null,null,"1000 M",1008,402,21.1,40,30,52510,412,910500,18070,20460,41.64,43400,2160,3349,9.09,2134,101500,236]
[null,null,"1000x443",1012,402,23.6,41.9,30,56370.000000000007,443,966500,19100,21780,41.41,45500,2264,3529,8.98,2545,106700,261.8]
[null,null,"1000x483",1020,404,25.4,46,30,61510,483,1067000,20930,23920,41.66,50710,2510,3919,9.08,3311,119900,282.7]
[null,null,"1000x539",1030,407,28.4,51.1,30,68720,539,1203000,23350,26820,41.83,57630,2832,4436,9.16,4546,137600,316.39999999999998]
[null,null,"1000x554",1032,408,29.5,52,30,70580,554,1232000,23880,27500,41.79,59100,2897,4547,9.15,4860,141300,328]
[null,null,"1000x591",1040,409,31,55.9,30,75270,591,1331000,25600,29530,42.05,64010,3130,4916,9.2200000000000006,5927,154300,346.3]
[null,null,"1000x642",1048,412,34,60,30,81760,642,1451000,27680,32100,42.12,70280,3412,5379,9.27,7440,170700,379.6]
[null,null,"1000x748",1068,417,39,70,30,95340,748,1732000,32430,37880,42.62,85110,4082,6459,9.4499999999999993,11670,210600,438.9]
[null,null,"1000x883",1092,424,45.5,82,30,112500,883,2096000,38390,45260,43.16,105000,4952,7874,9.66,18750,265700,516.5]
[null,null,"1000x976",1108,428,50,89.9,30,124300,976,2349000,42400,50300,43.5,118500,5538,8839,9.77,24770,304400,570.70000000000005]
[null,null,"1100 A",1090,400,18,31,20,43650,343,867400,15920,18060,44.58,33120,1656,2568,8.7100000000000009,1037,92710,206.5]
[null,null,"1100 B",1100,400,20,36,20,49700,390,1005000,18280,20780,44.98,38480,1924,2988,8.8000000000000007,1564,108700,230.6]
[null,null,"1100 M",1108,402,22,40,20,55120.000000000007,433,1126000,20320,23160,45.19,43410,2160,3362,8.8699999999999992,2130,123500,254.4]
[null,null,"1100 R",1118,405,26,45,20,63520.000000000007,499,1294000,23150,26600,45.14,49980,2468,3870,8.8699999999999992,3135,143400,300.39999999999998]
[]
[null,null,"Desig-","Dimensions",null,null,null,null,"Area","Weight","ly","Wel.y","Wpl.y","iy","lz","Wel.z","Wpl.z","iz","lt","lw","Avz"]
[null,null,"nation","h","b","tw","tf","r","A","G","mm4","mm3","mm3","mm ","mm4","mm3","mm3","mm ","mm4","mm6","mm2"]
[null,{"$f":"C205","v":"IPE"},"IPE","mm ","mm ","mm ","mm ","mm ","mm2","kg/m ","(x 104)","(x 103)","(x 103)","(x 10 )","(x 104)","(x 103)","(x 103)","(x 10 )","(x 104)","(x 109)","(x 102)"]
[null,{"$f":"COUNTA(C206:C267)","v":62},"AA 80",78,46,3.2,4.2,5,631,4.9000000000000004,64.099999999999994,16.399999999999999,18.899999999999999,3.19,6.85,2.98,4.7,1.04,0.4,0.09,3]
[null,null,"A 80",78,46,3.3,4.2,5,638,5,64.400000000000006,16.5,19,3.18,6.85,2.98,4.7,1.04,0.42,0.09,3.07]
[null,null,"80",80,46,3.8,5.2,5,764,6,80.099999999999994,20,23.2,3.24,8.49,3.69,5.8,1.05,0.7,0.12,3.58]
[null,null,"AA 100",97.6,55,3.6,4.5,7,856,6.7,136,27.9,31.9,3.98,12.6,4.57,7.2,1.21,0.73,0.27,4.4000000000000004]
[null,null,"A 100",98,55,3.6,4.7,7,880.00000000000011,6.9,141,28.8,33,4.01,13.1,4.7699999999999996,7.5,1.22,0.77,0.28000000000000003,4.4400000000000004]
[null,null,"100",100,55,4.0999999999999996,5.7,7,1030,8.1,171,34.200000000000003,39.4,4.07,15.9,5.79,9.1999999999999993,1.24,1.2,0.35,5.08]
[null,null,"AA 120",117,64,3.8,4.8,7,1070,8.4,244,41.7,47.6,4.79,21.1,6.59,10.4,1.41,0.95,0.66,5.36]
[null,null,"A 120",117.6,64,3.8,5.0999999999999996,7,1100,8.6999999999999993,257,43.8,49.9,4.83,22.4,7,11,1.42,1.04,0.71,5.41]
[null,null,"120",120,64,4.4000000000000004,6.3,7,1320,10.4,318,53,60.7,4.9000000000000004,27.7,8.65,13.6,1.45,1.74,0.89,6.31]
[null,null,"AA 140",136.6,73,3.8,5.2,7,1280,10.1,407,59.7,67.599999999999994,5.64,33.799999999999997,9.27,14.5,1.63,1.19,1.46,6.14]
[null,null,"A 140",137.4,73,3.8,5.6,7,1340,10.5,435,63.3,71.599999999999994,5.7,36.4,10,15.5,1.65,1.36,1.58,6.21]
[null,null,"140",140,73,4.7,6.9,7,1639.9999999999998,12.9,541,77.3,88.3,5.74,44.9,12.3,19.3,1.65,2.4500000000000002,1.98,7.64]
[null,null,"AA 160",156.4,82,4,5.6,7,1540,12.1,646,82.6,93.3,6.47,51.6,12.6,19.600000000000001,1.83,1.57,2.93,7.24]
[null,null,"A 160",157,82,4,5.9,9,1620,12.7,689,87.8,99.1,6.53,54.4,13.3,20.7,1.83,1.96,3.09,7.8]
[null,null,"160",160,82,5,7.4,9,2010.0000000000002,15.8,869,109,124,6.58,68.3,16.7,26.1,1.84,3.6,3.96,9.66]
[null,null,"AA 180",176.4,91,4.3,6.2,9,1900,14.9,1020,116,131,7.32,78.099999999999994,17.2,26.7,2.0299999999999998,2.48,5.64,9.1300000000000008]
[null,null,"A 180",177,91,4.3,6.5,9,1960.0000000000002,15.4,1063,120,135,7.37,81.900000000000006,18,28,2.0499999999999998,2.7,5.93,9.1999999999999993]
[null,null,"180",180,91,5.3,8,9,2390,18.8,1317,146,166,7.42,101,22.2,34.6,2.0499999999999998,4.79,7.43,11.3]
[null,null,"O 180",182,92,6,9,9,2710,21.3,1505,165,189,7.45,117,25.5,39.9,2.08,6.76,8.74,12.7]
[null,null,"AA 200",196.4,100,4.5,6.7,12,2290,18,1533,156,176,8.19,112,22.4,35,2.21,3.84,10.1,11.4]
[null,null,"A 200",197,100,4.5,7,12,2350,18.399999999999999,1591,162,182,8.23,117,23.4,36.5,2.23,4.1100000000000003,10.5,11.5]
[null,null,"200",200,100,5.6,8.5,12,2850,22.4,1943,194,221,8.26,142,28.5,44.6,2.2400000000000002,6.98,13,14]
[null,null,"O 200",202,102,6.2,9.5,12,3200,25.1,2211,219,249,8.32,169,33.1,51.9,2.2999999999999998,9.4499999999999993,15.6,15.5]
[null,null,"AA 220",216.4,110,4.7,7.4,12,2700,21.2,2219,205,230,9.07,165,29.9,46.5,2.4700000000000002,5.0199999999999996,17.899999999999999,12.8]
[null,null,"A 220",217,110,5,7.7,12,2830,22.2,2317,214,240,9.0500000000000007,171,31.2,48.5,2.46,5.69,18.7,13.6]
[null,null,"220",220,110,5.9,9.1999999999999993,12,3340,26.2,2772,252,285,9.11,205,37.299999999999997,58.1,2.48,9.07,22.7,15.9]
[null,null,"O 220",222,112,6.6,10.199999999999999,12,3740,29.4,3134,282,321,9.16,240,42.8,66.900000000000006,2.5299999999999998,12.3,26.8,17.7]
[null,null,"AA 240",236.4,120,4.8,8,15,3170,24.9,3154,267,298,9.9700000000000006,231,38.6,60,2.7,7.33,30.1,15.3]
[null,null,"A 240",237,120,5.2,8.3000000000000007,15,3329.9999999999995,26.2,3290,278,312,9.94,240,40,62.4,2.68,8.35,31.3,16.3]
[null,null,"240",240,120,6.2,9.8000000000000007,15,3910,30.7,3892,324,367,9.9700000000000006,284,47.3,73.900000000000006,2.69,12.9,37.4,19.100000000000001]
[null,null,"O 240",242,122,7,10.8,15,4370,34.299999999999997,4369,361,410,10,329,53.9,84.4,2.74,17.2,43.7,21.4]
[null,null,"A 270",267,135,5.5,8.6999999999999993,15,3920.0000000000005,30.7,4917,368,413,11.2,358,53,82.3,3.02,10.3,59.5,18.8]
[null,null,"270",270,135,6.6,10.199999999999999,15,4590,36.1,5790,429,484,11.2,420,62.2,97,3.02,15.9,70.599999999999994,22.1]
[null,null,"O 270",274,136,7.5,12.2,15,5380,42.3,6947,507,575,11.4,514,75.5,118,3.09,24.9,87.6,25.2]
[null,null,"A 300",297,150,6.1,9.1999999999999993,15,4650,36.5,7173,483,542,12.4,519,69.2,107,3.34,13.4,107,22.3]
[null,null,"300",300,150,7.1,10.7,15,5380,42.2,8356,557,628,12.5,604,80.5,125,3.35,20.100000000000001,126,25.7]
[null,null,"O 300",304,152,8,12.7,15,6280,49.3,9994,658,744,12.6,746,98.1,153,3.45,31.1,158,29.1]
[null,null,"A 330",327,160,6.5,10,18,5470,43,10230,626,702,13.7,685,85.6,133,3.54,19.600000000000001,172,27]
[null,null,"330",330,160,7.5,11.5,18,6260,49.1,11770,713,804,13.7,788,98.5,154,3.55,28.2,199,30.8]
[null,null,"O 330",334,162,8.5,13.5,18,7259.9999999999991,57,13910,833,943,13.8,960,119,185,3.64,42.2,246,34.9]
[null,null,"A 360",357.6,170,6.6,11.5,18,6400,50.2,14520,812,907,15.1,944,111,172,3.84,26.5,282,29.8]
[null,null,"360",360,170,8,12.7,18,7270,57.1,16270,904,1019,15,1043,123,191,3.79,37.299999999999997,314,35.1]
[null,null,"O 360",364,172,9.1999999999999993,14.7,18,8410,66,19050,1047,1186,15.1,1251,146,227,3.86,55.8,380,40.200000000000003]
[null,null,"A 400",397,180,7,12,21,7309.9999999999991,57.4,20290,1022,1144,16.7,1171,130,202,4,34.799999999999997,432,35.799999999999997]
[null,null,"400",400,180,8.6,13.5,21,8450,66.3,23130,1160,1307,16.600000000000001,1318,146,229,3.95,51.1,490,42.7]
[null,null,"O 400",404,182,9.6999999999999993,15.5,21,9640,75.7,26750,1324,1502,16.7,1564,172,269,4.03,73.099999999999994,588,48]
[null,null,"A 450",447,190,7.6,13.1,21,8560,67.2,29760,1331,1494,18.7,1502,158,246,4.1900000000000004,45.7,705,42.3]
[null,null,"450",450,190,9.4,14.6,21,9880,77.599999999999994,33740,1500,1702,18.5,1676,176,276,4.12,66.900000000000006,791,50.9]
[null,null,"O 450",456,192,11,17.600000000000001,21,11800,92.4,40920,1795,2046,18.7,2085,217,341,4.21,109,998,59.4]
[null,null,"A 500",497,200,8.4,14.5,21,10100,79.400000000000006,42930,1728,1946,20.6,1939,194,302,4.38,62.8,1125,50.4]
[null,null,"500",500,200,10.199999999999999,16,21,11600,90.7,48200,1930,2194,20.399999999999999,2142,214,336,4.3099999999999996,89.3,1249,59.9]
[null,null,"O 500",506,202,12,19,21,13700,107,57780,2284,2613,20.6,2622,260,409,4.38,144,1548,70.2]
[null,null,"A 550",547,210,9,15.7,24,11700,92.1,59980,2193,2475,22.6,2432,232,362,4.55,86.5,1710,60.3]
[null,null,"550",550,210,11.1,17.2,24,13400,106,67120,2440,2787,22.4,2668,254,401,4.45,123,1884,72.3]
[null,null,"O 550",556,212,12.7,20.2,24,15600,123,79160,2847,3263,22.5,3224,304,481,4.55,188,2302,82.7]
[null,null,"A 600",597,220,9.8000000000000007,17.5,24,13700,108,82920,2778,3141,24.6,3116,283,442,4.7699999999999996,119,2607,70.099999999999994]
[null,null,"600",600,220,12,19,24,15600,122,92080,3070,3512,24.3,3387,308,486,4.66,165,2846,83.8]
[null,null,"O 600",610,224,15,24,24,19700,154,118300,3879,4471,24.5,4521,404,640,4.79,318,3860,104]
[null,null,"750x134",750,264,12,15.5,17,17100,134,150700,4018,4644,29.7,4788,362,570,5.3,122,6440,95.6]
[null,null,"750x147",753,265,13.2,17,17,18800,147,166100,4411,5110,29.8,5289,399,631,5.31,162,7141,105]
[null,null,"750x173",762,267,14.4,21.6,17,22100,173,205800,5402,6218,30.5,6873,515,810,5.57,274,9391,116]
[null,null,"750x196",770,268,15.6,25.4,17,25100,196,240300,6241,7174,31,8175,610,959,5.71,409,11290,127]
[]
[null,null,"Desig-","Dimensions",null,null,null,null,"Area","Weight","ly","Wel.y","Wpl.y","iy","lz","Wel.z","Wpl.z","iz","lt","lw","Avz"]
[null,null,"nation","h","b","tw","tf","r","A","G","mm4","mm3","mm3","mm ","mm4","mm3","mm3","mm ","mm4","mm6","mm2"]
[null,{"$f":"C271","v":"IPN"},"IPN","mm ","mm ","mm ","mm ","mm ","mm2","kg/m ","(x 104)","(x 103)","(x 103)","(x 10 )","(x 104)","(x 103)","(x 103)","(x 10 )","(x 104)","(x 109)","(x 102)"]
[null,{"$f":"COUNTA(C272:C292)","v":21},"80",80,42,3.9,5.9,3.9,758,{"$f":"I272/1000^2*7850","v":5.9503000000000004},77.8,19.5,22.8,3.2,6.29,3,5,0.91,0.87,0.09,3.41]
[null,null,"100",100,50,4.5,6.8,4.5,1060,8.3209999999999997,171,34.200000000000003,39.799999999999997,4.01,12.2,4.88,8.1,1.07,1.6,0.27,4.8499999999999996]
[null,null,"120",120,58,5.0999999999999996,7.7,5.0999999999999996,1420,11.147,328,54.7,63.6,4.8099999999999996,21.5,7.41,12.4,1.23,2.71,0.69,6.63]
[null,null,"140",140,66,5.7,8.6,5.7,1830,14.365500000000001,573,81.900000000000006,95.4,5.61,35.200000000000003,10.7,17.899999999999999,1.4,4.32,1.54,8.65]
[null,null,"160",160,74,6.3,9.5,6.3,2280,17.898,935,117,136,6.4,54.7,14.8,24.9,1.55,6.57,3.14,10.83]
[null,null,"180",180,82,6.9,10.4,6.9,2790,21.901499999999999,1450,161,187,7.2,81.3,19.8,33.200000000000003,1.71,9.58,5.92,13.35]
[null,null,"200",200,90,7.5,11.3,7.5,3340,26.219000000000001,2140,214,250,8,117,26,43.5,1.87,13.5,10.5,16.03]
[null,null,"220",220,98,8.1,12.2,8.1,3950,31.007500000000004,3060,278,324,8.8000000000000007,162,33.1,55.7,2.02,18.600000000000001,17.8,19.059999999999999]
[null,null,"240",240,106,8.6999999999999993,13.1,8.6999999999999993,4610,36.188500000000005,4250,354,412,9.59,221,41.7,70,2.2000000000000002,25,28.7,22.33]
[null,null,"260",260,113,9.4,14.1,9.4,5330,41.840499999999999,5740,442,514,10.4,288,51,85.9,2.3199999999999998,33.5,44.1,26.08]
[null,null,"280",280,119,10.1,15.2,10.1,6100,47.885000000000005,7590,542,632,11.1,364,61.2,103,2.4500000000000002,44.2,64.599999999999994,30.18]
[null,null,"300",300,125,10.8,16.2,10.8,6900,54.164999999999999,9800,653,762,11.9,451,72.2,121,2.56,56.8,91.8,34.58]
[null,null,"320",320,131,11.5,17.3,11.5,7770,60.994500000000002,12510,782,914,12.7,555,84.7,143,2.67,72.5,129,39.26]
[null,null,"340",340,137,12.2,18.3,12.2,8670,68.0595,15700,923,1080,13.5,674,98.4,166,2.8,90.4,176,44.27]
[null,null,"360",360,143,13,19.5,13,9700,76.144999999999996,19610,1090,1276,14.2,818,114,194,2.9,115,240,49.95]
[null,null,"380",380,149,13.7,20.5,13.7,10700,83.99499999999999,24010,1260,1482,15,975,131,221,3.02,141,319,55.55]
[null,null,"400",400,155,14.4,21.6,14.4,11800,92.63,29210,1460,1714,15.7,1160,149,253,3.13,170,420,61.69]
[null,null,"450",450,170,16.2,24.3,16.2,14700,115.395,45850,2040,2400,17.7,1730,203,345,3.43,267,791,77.790000000000006]
[null,null,"500",500,185,18,27,18,17900,140.51499999999999,68740,2750,3240,19.600000000000001,2480,268,456,3.72,402,1400,95.6]
[null,null,"550",550,200,19,30,19,21200,166.42,99180,3610,4240,21.6,3490,349,592,4.0199999999999996,544,2390,111.3]
[null,null,"600",600,215,21.6,32.4,21.6,25400,199.39,138800,4627,5452,23.39,4674,435,752,4.29,787,3814,138]
[]
[null,null,"Desig-","Dimensions",null,null,null,null,"Area","Weight","ly","Wel.y","Wpl.y","iy","lz","Wel.z","Wpl.z","iz","lt","lw","Avz"]
[null,null,"nation","h","b","tw","tf","r","A","G","mm4","mm3","mm3","mm ","mm4","mm3","mm3","mm ","mm4","mm6","mm2"]
[null,{"$f":"C296","v":"UPE"},"UPE","mm ","mm ","mm ","mm ","mm ","mm2","kg/m ","(x 104)","(x 103)","(x 103)","(x 10 )","(x 104)","(x 103)","(x 103)","(x 10 )","(x 104)","(x 109)","(x 102)"]
[null,{"$f":"COUNTA(C297:C310)","v":14},"80",80,50,4,7,10,1010,7.9,107.2,26.8,31.23,32.6,25.41,7.98,14.28,15.9,1.47,0.22,{"$f":"V297/100","v":4.08},{"$f":"I297-2*E297*G297+(F297+H297)*G297","v":408}]
[null,null,"100",100,55,4.5,7.5,10,1250,9.82,206.9,41.37,48.01,40.700000000000003,38.21,10.63,19.34,17.5,2.0099999999999998,0.53,5.3375000000000004,533.75]
[null,null,"120",120,60,5,8,12,1540,12.1,363.5,60.58,70.33,48.6,55.4,13.79,25.28,19,2.9,1.1200000000000001,7.16,716]
[null,null,"140",140,65,5,9,12,1840,14.5,599.5,85.64,98.84,57.1,78.7,18.190000000000001,33.22,20.7,4.05,2.2000000000000002,8.23,823]
[null,null,"160",160,70,5.5,9.5,12,2170,17,911.1,113.9,131.6,64.8,106.8,22.58,41.49,22.2,5.2,3.96,10.0625,1006.25]
[null,null,"180",180,75,5.5,10.5,12,2510,19.7,1353,150.4,173,73.400000000000006,143.69999999999999,28.56,52.3,23.9,6.99,6.81,11.1875,1118.75]
[null,null,"200",200,80,6,11,13,2900,22.8,1909,190.9,220.1,81.099999999999994,187.3,34.43,63.28,25.4,8.89,11,13.49,1349]
[null,null,"220",220,85,6.5,12,13,3390,26.6,2682,243.9,281.5,89,246.4,42.51,78.25,27,12.05,17.61,15.84,1584]
[null,null,"240",240,90,7,12.5,15,3850,30.2,3599,299.89999999999998,346.9,96.7,310.89999999999998,50.08,92.18,28.4,15.14,26.42,18.75,1875]
[null,null,"270",270,95,7.5,13.5,15,4480,35.200000000000003,5255,389.2,451.1,108.3,401,60.69,111.6,29.9,19.91,43.55,22.1875,2218.75]
[null,null,"300",300,100,9.5,15,15,5660,44.4,7823,521.5,613.4,117.6,537.70000000000005,75.58,136.6,30.8,31.52,72.66,30.274999999999999,3027.5]
[null,null,"330",330,105,11,16,18,6780,53.2,11010,667.1,791.9,127.4,681.5,89.66,156.19999999999999,31.7,45.18,111.8,38.840000000000003,3884]
[null,null,"360",360,110,12,17,18,7790,61.2,14830,823.6,982.3,137.9,843.7,105.1,177.8,32.9,58.49,166.4,45.6,4560]
[null,null,"400",400,115,13.5,18,18,9190,72.2,20980,1049,1263,151.1,1045,122.6,191.4,33.700000000000003,79.14,259,56.17,5617]
[]
[null,null,"Desig-","Dimensions",null,null,null,null,"Area","Weight","ly","Wel.y","Wpl.y","iy","lz","Wel.z","Wpl.z","iz","lt","lw","Avz"]
[null,null,"nation","h","b","tw","tf","r","A","G","mm4","mm3","mm3","mm ","mm4","mm3","mm3","mm ","mm4","mm6","mm2"]
[null,{"$f":"C314","v":"UPN"},"UPN","mm ","mm ","mm ","mm ","mm ","mm2","kg/m ","(x 104)","(x 103)","(x 103)","(x 10 )","(x 104)","(x 103)","(x 103)","(x 10 )","(x 104)","(x 109)","(x 102)"]
[null,{"$f":"COUNTA(C315:C332)","v":18},"50",50,38,5,7,7,350,5.59,26.4,10.6,13.1,1.92,9.1199999999999992,3.75,6.78,1.1299999999999999,1.1200000000000001,0.03,2.77]
[null,null,"65",65,42,5.5,7.5,7.5,400,7.09,57.5,17.7,21.7,2.52,14.1,5.07,9.3800000000000008,1.25,1.61,0.08,3.68]
[null,null,"80",80,45,6,8,8,400,8.64,106,26.5,32.299999999999997,3.1,19.399999999999999,6.36,11.9,1.33,2.2000000000000002,0.18,4.9000000000000004]
[null,null,"100",100,50,6,8.5,8.5,450,10.6,206,41.2,49,3.91,29.3,8.49,16.2,1.47,2.81,0.41,6.46]
[null,null,"120",120,55,7,9,9,450,13.4,364,60.7,72.599999999999994,4.62,43.2,11.1,21.2,1.59,4.1500000000000004,0.9,8.8000000000000007]
[null,null,"140",140,60,7,10,10,500,16,605,86.4,103,5.45,62.7,14.8,28.3,1.75,5.68,1.8,10.4]
[null,null,"160",160,65,7.5,10.5,10.5,550,18.8,925,116,138,6.21,85.3,18.3,35.200000000000003,1.89,7.39,3.26,12.6]
[null,null,"180",180,70,8,11,11,550,22,1350,150,179,6.95,114,22.4,42.9,2.02,9.5500000000000007,5.57,15.1]
[null,null,"200",200,75,8.5,11.5,11.5,600,25.3,1910,191,228,7.7,148,27,51.8,2.14,11.9,9.07,17.7]
[null,null,"220",220,80,9,12.5,12.5,650,29.4,2690,245,292,8.48,197,33.6,64.099999999999994,2.2999999999999998,16,14.6,20.6]
[null,null,"240",240,85,9.5,13,13,650,33.200000000000003,3600,300,358,9.2200000000000006,248,39.6,75.7,2.42,19.7,22.1,23.7]
[null,null,"260",260,90,10,14,14,700,37.9,4820,371,442,9.99,317,47.7,91.6,2.56,25.5,33.299999999999997,27.1]
[null,null,"280",280,95,10,15,15,750,41.8,6280,448,532,10.9,399,57.2,109,2.74,31,48.5,29.3]
[null,null,"300",300,100,10,16,16,800,46.2,8030,535,632,11.7,495,67.8,130,2.9,37.4,69.099999999999994,31.8]
[null,null,"320",320,100,14,17.5,17.5,880.00000000000011,59.5,10870,679,826,12.1,597,80.599999999999994,152,2.81,66.7,96.1,47.1]
[null,null,"350",350,100,14,16,16,800,60.6,12840,734,918,12.9,570,75,143,2.72,61.2,114,50.8]
[null,null,"380",380,102,13.5,16,16,800,63.1,15760,829,1010,14,615,78.7,148,2.77,59.1,146,53.2]
[null,null,"400",400,110,14,18,18,900,71.8,20350,1020,1240,14.9,846,102,190,3.04,81.599999999999994,221,58.6]
[]
[null,null,"Desig-","Dimensions",null,null,null,null,"Area","Weight","ly","Wel.y","Wpl.y","iy","lz","Wel.z","Wpl.z","iz","lt","lw","Avz"]
[null,null,"nation","h","b","tw","tf","r","A","G","mm4","mm3","mm3","mm ","mm4","mm3","mm3","mm ","mm4","mm6","mm2"]
[null,{"$f":"C336","v":"UB"},"UB","mm ","mm ","mm ","mm ","mm ","mm2","kg/m ","(x 104)","(x 103)","(x 103)","(x 10 )","(x 104)","(x 103)","(x 103)","(x 10 )","(x 104)","(x 109)","(x 102)"]
[null,{"$f":"COUNTA(C337:C443)","v":107},"127x76x13",127,76,4,7.6,7.6,1650,13,473,74.599999999999994,84.2,5.35,55.7,14.7,22.6,1.84,2.85,2,{"$f":"(I337-2*E337*G337+(F337+2*H337)*G337)/100","v":6.4071999999999996}]
[null,null,"152x89x16",152.4,88.7,4.5,7.7,7.6,2030,16,834,109,123,6.41,89.8,20.2,31.2,2.1,3.56,4.7,{"$f":"(I338-2*E338*G338+(F338+2*H338)*G338)/100","v":8.1570999999999998}]
[null,null,"178x102x19",177.8,101.2,4.8,7.9,7.6,2430,19,1360,153,171,7.48,137,27,41.6,2.37,4.41,9.9,9.8903999999999996]
[null,null,"203x102x23",203.2,101.8,5.4,9.3000000000000007,7.6,2940,23.1,2100,207,234,8.4600000000000009,164,32.200000000000003,49.7,2.36,7.02,15.4,12.380999999999998]
[null,null,"203x133x25",203.2,133.19999999999999,5.7,7.8,7.6,3200,25.1,2340,230,258,8.56,308,46.2,70.900000000000006,3.1,5.96,29.4,12.851000000000004]
[null,null,"203x133x30",206.8,133.9,6.4,9.6,7.6,3820.0000000000005,30,2900,280,314,8.7100000000000009,385,57.5,88.2,3.17,10.3,37.400000000000006,14.564800000000005]
[null,null,"254x102x22",254,101.6,5.7,6.8,7.6,2800,22,2840,224,259,10.1,119,23.5,37.299999999999997,2.06,4.1500000000000004,18.2,15.603599999999998]
[null,null,"254x102x25",257.2,101.9,6,8.4,7.6,3200,25.2,3410,266,306,10.3,149,29.2,46,2.15,6.42,23,16.6616]
[null,null,"254x102x28",260.39999999999998,102.2,6.3,10,7.6,3610,28.3,4000,308,353,10.5,179,34.9,54.8,2.2200000000000002,9.57,28,17.809999999999999]
[null,null,"254x146x31",251.4,146.1,6,8.6,7.6,3970.0000000000005,31.1,4410,351,393,10.5,448,61.3,94.1,3.36,8.5500000000000007,66,16.394000000000009]
[null,null,"254x146x37",256,146.4,6.3,10.9,7.6,4720,37,5540,433,483,10.8,571,78,119,3.48,15.3,85.7,17.628299999999996]
[null,null,"254x146x43",259.60000000000002,147.30000000000001,7.2,12.7,7.6,5480,43,6540,504,566,10.9,677,92,141,3.52,23.9,103,20.230599999999999]
[null,null,"305x102x25",305.10000000000002,101.6,5.8,7,7.6,3160,24.8,4460,292,342,11.9,123,24.2,38.799999999999997,1.97,4.7699999999999996,27,18.846]
[null,null,"305x102x28",308.7,101.8,6,8.8000000000000007,7.6,3590,28.2,5370,348,403,12.2,155,30.5,48.4,2.08,7.4,34.9,19.848799999999997]
[null,null,"305x102x33",312.7,102.4,6.6,10.8,7.6,4180,32.799999999999997,6500,416,481,12.5,194,37.9,60,2.15,12.2,44.2,22.035999999999998]
[null,null,"305x127x37",304.39999999999998,123.4,7.1,10.7,8.9,4720,37,7170,471,539,12.3,336,54.5,85.4,2.67,14.8,72.5,23.456700000000001]
[null,null,"305x127x42",307.2,124.3,8,12.1,8.9,5340,41.9,8200,534,614,12.4,389,62.6,98.4,2.7,21.1,84.6,26.441199999999998]
[null,null,"305x127x48",311,125.3,9,14,8.9,6120,48.1,9570,616,711,12.5,461,73.599999999999994,116,2.74,31.8,102,29.867999999999999]
[null,null,"305x165x40",303.39999999999998,165,6,10.199999999999999,8.9,5130,40.299999999999997,8500,560,623,12.9,764,92.6,142,3.86,14.7,164,20.067600000000006]
[null,null,"305x165x46",306.60000000000002,165.7,6.7,11.8,8.9,5870,46.1,9900,646,720,13,896,108,166,3.9,22.2,195,22.485799999999998]
[null,null,"305x165x54",310.39999999999998,166.9,7.9,13.7,8.9,6880,54,11700,754,846,13,1060,127,196,3.93,34.799999999999997,234,26.590300000000006]
[null,null,"356x127x33",349,125.4,6,8.5,10.199999999999999,4210,33.1,8250,473,543,14,280,44.7,70.2,2.58,8.7899999999999991,81,23.026]
[null,null,"356x127x39",353.4,126,6.6,10.7,10.199999999999999,4980,39.1,10200,576,659,14.3,358,56.8,89,2.68,15.1,105,25.725000000000005]
[null,null,"356x171x45",351.4,171.1,7,9.6999999999999993,10.199999999999999,5730,45,12100,687,775,14.5,811,94.8,147,3.76,15.8,237,26.764400000000006]
[null,null,"356x171x51",355,171.5,7.4,11.5,10.199999999999999,6490.0000000000009,51,14100,796,896,14.8,968,113,174,3.86,23.8,286,28.652000000000008]
[null,null,"356x171x57",358,172.2,8.1,13,10.199999999999999,7259.9999999999991,57,16000,896,1010,14.9,1110,129,199,3.91,33.4,330,31.532999999999994]
[null,null,"356x171x67",363.4,173.2,9.1,15.7,10.199999999999999,8550,67.099999999999994,19500,1070,1210,15.1,1360,157,243,3.99,55.7,412,35.746700000000004]
[null,null,"406x140x39",398,141.80000000000001,6.4,8.6,10.199999999999999,4970,39,12500,629,724,15.9,410,57.8,90.8,2.87,10.7,155,27.615200000000002]
[null,null,"406x140x46",403.2,142.19999999999999,6.8,11.2,10.199999999999999,5860,46,15700,778,888,16.399999999999999,538,75.7,118,3.03,19,207,29.793600000000001]
[null,null,"406x140x53",406.6,143.30000000000001,7.9,12.9,10.199999999999999,6790.0000000000009,53.3,18300,899,1030,16.399999999999999,635,88.6,139,3.06,29,246,34.579300000000011]
[null,null,"406x178x54",402.6,177.7,7.7,10.9,10.199999999999999,6900,54.1,18700,930,1050,16.5,1020,115,178,3.85,23.1,392,33.324300000000001]
[null,null,"406x178x60",406.4,177.9,7.9,12.8,10.199999999999999,7650,60.1,21600,1060,1200,16.8,1200,135,209,3.97,33.299999999999997,466,34.579999999999991]
[null,null,"406x178x67",409.4,178.8,8.8000000000000007,14.3,10.199999999999999,8550,67.099999999999994,24300,1190,1350,16.899999999999999,1360,153,237,3.99,46.1,533,38.538799999999995]
[null,null,"406x178x74",412.8,179.5,9.5,16,10.199999999999999,9450,74.2,27300,1320,1500,17,1550,172,267,4.04,62.8,608,41.843999999999994]
[null,null,"406x178x85",417.2,181.9,10.9,18.2,10.199999999999999,10900,85.3,31700,1520,1730,17.100000000000001,1830,201,313,4.1100000000000003,93,728,48.484999999999999]
[null,null,"457x152x52",449.8,152.4,7.6,10.9,10.199999999999999,6659.9999999999991,52.3,21400,950,1100,17.899999999999999,645,84.6,133,3.11,21.4,311,36.428799999999988]
[null,null,"457x152x60",454.6,152.9,8.1,13.3,10.199999999999999,7620,59.8,25500,1120,1290,18.3,795,104,163,3.23,33.799999999999997,387,39.319099999999999]
[null,null,"457x152x67",458,153.80000000000001,9,15,10.199999999999999,8560,67.2,28900,1260,1450,18.399999999999999,913,119,187,3.27,47.7,448,43.87]
[null,null,"457x152x74",462,154.4,9.6,17,10.199999999999999,9450,74.2,32700,1410,1630,18.600000000000001,1050,136,213,3.33,65.900000000000006,518,47.103999999999999]
[null,null,"457x152x82",465.8,155.30000000000001,10.5,18.899999999999999,10.199999999999999,10500,82.1,36600,1570,1810,18.7,1180,153,240,3.37,89.2,591,52.136699999999998]
[null,null,"457x191x67",453.4,189.9,8.5,12.7,10.199999999999999,8550,67.099999999999994,29400,1300,1470,18.5,1450,153,237,4.12,37.1,705,40.935699999999997]
[null,null,"457x191x74",457,190.4,9,14.5,10.199999999999999,9460,74.3,33300,1460,1650,18.8,1670,176,272,4.2,51.8,818,43.646999999999998]
[null,null,"457x191x82",460,191.3,9.9,16,10.199999999999999,10400,82,37100,1610,1830,18.8,1870,196,304,4.2300000000000004,69.2,922,47.631999999999998]
[null,null,"457x191x89",463.4,191.9,10.5,17.7,10.199999999999999,11400,89.3,41000,1770,2010,19,2090,218,338,4.29,90.7,1040,51.536700000000003]
[null,null,"457x191x98",467.2,192.8,11.4,19.600000000000001,10.199999999999999,12500,98.3,45700,1960,2230,19.100000000000001,2350,243,379,4.33,121,1180,55.655199999999986]
[null,null,"457x191x106",469.2,194,12.6,20.6,10.199999999999999,13500,105.8,48900,2080,2390,19,2510,259,405,4.32,146,1270,61.87]
[null,null,"457x191x133",480.6,196.7,15.3,26.3,10.199999999999999,17000,133.30000000000001,63800,2660,3070,19.399999999999999,3350,341,535,4.4400000000000004,292,1730,75.924899999999994]
[null,null,"457x191x161",492,199.4,18,32,10.199999999999999,20600,161.4,79800,3240,3780,19.7,4250,426,672,4.55,515,2250,90.671999999999983]
[null,null,"533x165x66",524.70000000000005,165.1,8.9,11.4,12.7,8370,65.7,35000,1340,1560,20.5,859,104,166,3.2,32,566,49.967399999999998]
[null,null,"533x165x75",529.1,165.9,9.6999999999999993,13.6,12.7,9520,74.7,41100,1550,1810,20.8,1040,125,200,3.3,47.9,691,54.84879999999999]
[null,null,"533x165x85",534.9,166.5,10.3,16.5,12.7,10800,84.8,48500,1820,2100,21.2,1270,153,243,3.44,73.8,857,58.945500000000003]
[null,null,"533x210x82",528.29999999999995,208.8,9.6,13.2,12.7,10500,82.2,47500,1800,2060,21.3,2010,192,300,4.38,51.5,1330,54.4968]
[null,null,"533x210x92",533.1,209.3,10.1,15.6,12.7,11700,92.1,55200,2070,2360,21.7,2390,228,355,4.51,75.7,1600,57.236400000000003]
[null,null,"533x210x101",536.70000000000005,210,10.8,17.399999999999999,12.7,12900,101,61500,2290,2610,21.9,2690,256,399,4.57,101,1810,62.218800000000009]
[null,null,"533x210x109",539.5,210.8,11.6,18.8,12.7,13900,109,66800,2480,2830,21.9,2940,279,436,4.5999999999999996,126,1990,66.6952]
[null,null,"533x210x122",544.5,211.9,12.7,21.3,12.7,15500,122,76000,2790,3200,22.1,3390,320,500,4.67,178,2320,72.845899999999986]
[null,null,"533x210x138",549.1,213.9,14.7,23.6,12.7,17600,138.30000000000001,86100,3140,3610,22.1,3860,361,568,4.68,250,2670,84.502799999999993]
[null,null,"533x312x151",542.5,312,12.7,20.3,12.7,19200,150.6,101000,3710,4150,22.9,10300,659,1010,7.32,216,7010,73.062299999999993]
[null,null,"533x312x182",550.70000000000005,314.5,15.2,24.4,12.7,23100,181.5,123000,4480,5040,23.1,12700,806,1240,7.4,373,8770,87.430400000000006]
[null,null,"533x312x219",560.29999999999995,317.39999999999998,18.3,29.2,12.7,27900,218.8,151000,5400,6120,23.3,15600,982,1510,7.48,642,11000,106.39880000000001]
[null,null,"533x312x273",577.1,320.2,21.1,37.6,12.7,34800,273.3,199000,6890,7870,23.9,20600,1290,1990,7.69,1290,15000,124.69359999999999]
[null,null,"610x178x82",598.6,177.9,10,12.8,12.7,10400,81.8,55900,1870,2190,23.2,1210,136,218,3.4,48.8,1040,62.988799999999991]
[null,null,"610x178x92",603,178.8,10.9,15,12.7,11700,92.2,64600,2140,2510,23.4,1440,161,258,3.5,71,1240,68.805000000000007]
[null,null,"610x178x100",607.4,179.2,11.3,17.2,12.7,12800,100.3,72500,2390,2790,23.8,1660,185,296,3.6,95,1440,72.667600000000007]
[null,null,"610x229x101",602.6,227.6,10.5,14.8,12.7,12900,101.2,75800,2520,2880,24.2,2910,256,400,4.75,77,2520,66.943600000000004]
[null,null,"610x229x113",607.6,228.2,11.1,17.3,12.7,14400,113,87300,2870,3280,24.6,3430,301,469,4.88,111,2990,71.357299999999995]
[null,null,"610x229x125",612.20000000000005,229,11.9,19.600000000000001,12.7,15900,125.1,98600,3220,3680,24.9,3930,343,535,4.97,154,3450,76.542799999999986]
[null,null,"610x229x140",617.20000000000005,230.2,13.1,22.1,12.7,17800,139.9,112000,3620,4140,25,4510,391,611,5.03,216,3990,84.760100000000008]
[null,null,"610x305x149",612.4,304.8,11.8,19.7,16.5,19000,149.19999999999999,126000,4110,4590,25.7,9310,611,937,7,200,8170,78.734399999999994]
[null,null,"610x305x179",620.20000000000005,307.10000000000002,14.1,23.6,16.5,22800,179,153000,4930,5550,25.9,11400,743,1140,7.07,340,10200,94.164399999999972]
[null,null,"610x305x238",635.79999999999995,311.39999999999998,18.399999999999999,31.4,16.5,30300,238.1,209000,6590,7490,26.3,15800,1020,1570,7.23,785,14500,123.58040000000001]
[null,null,"686x254x125",677.9,253,11.7,16.2,15.2,15900,125.2,118000,3480,3990,27.2,4380,346,542,5.24,116,4800,83.84820000000002]
[null,null,"686x254x140",683.5,253.7,12.4,19,15.2,17800,140.1,136000,3990,4560,27.6,5180,409,638,5.39,169,5720,89.725999999999999]
[null,null,"686x254x152",687.5,254.5,13.2,21,15.2,19400,152.4,150000,4370,5000,27.8,5780,455,710,5.46,220,6420,96.266000000000005]
[null,null,"686x254x170",692.9,255.8,14.5,23.7,15.2,21700,170.2,170000,4920,5630,28,6630,518,811,5.53,308,7420,106.39209999999999]
[null,null,"762x267x134",750,264.39999999999998,12,15.5,16.5,17100,133.9,151000,4020,4640,29.7,4790,362,570,5.3,119,6460,96.01100000000001]
[null,null,"762x267x147",754,265.2,12.8,17.5,16.5,18700,146.9,169000,4470,5160,30,5460,411,647,5.4,159,7400,{"$f":"(I413-2*E413*G413+(F413+2*H413)*G413)/100","v":102.19499999999999}]
[null,null,"762x267x173",762.2,266.7,14.3,21.6,16.5,22000,173,205000,5390,6200,30.5,6850,514,807,5.58,267,9390,115.00239999999999]
[null,null,"762x267x197",769.8,268,15.6,25.4,16.5,25100,196.8,240000,6230,7170,30.9,8170,610,958,5.71,404,11300,127.2004]
[null,null,"838x292x176",834.9,291.7,14,18.8,17.8,22400,175.9,246000,5890,6810,33.1,7800,535,842,5.9,221,13000,123.6456]
[null,null,"838x292x194",840.7,292.39999999999998,14.7,21.7,17.8,24700,193.8,279000,6640,7640,33.6,9070,620,974,6.06,306,15200,131.01350000000002]
[null,null,"838x292x226",850.9,293.8,16.100000000000001,26.8,17.8,28900,226.5,340000,7980,9160,34.299999999999997,11400,773,1210,6.27,514,19300,145.37879999999998]
[null,null,"914x305x201",903,303.3,15.1,20.2,19.100000000000001,25600,200.9,325000,7200,8350,35.700000000000003,9420,621,982,6.07,291,18400,144.23339999999999]
[null,null,"914x305x224",910.4,304.10000000000002,15.9,23.9,19.100000000000001,28600,224.2,376000,8270,9530,36.299999999999997,11200,739,1160,6.27,422,22100,153.5701]
[null,null,"914x305x238",915,305,16.5,25.9,19,30400,238,406000,8880,10200,36.6,12300,806,1270,6.36,514,24200,160.12549999999999]
[null,null,"914x305x253",918.4,305.5,17.3,27.9,19.100000000000001,32300,253.4,436000,9500,10900,36.799999999999997,13300,871,1370,6.42,626,26400,168.01550000000003]
[null,null,"914x305x271",923,307,18.399999999999999,30,19,34600,271,472000,10200,11800,36.9,14500,946,1490,6.48,769,28800,178.72]
[null,null,"914x305x289",926.6,307.7,19.5,32,19.100000000000001,36800,289.10000000000002,504000,10900,12600,37,15600,1010,1600,6.51,926,31200,189.53600000000003]
[null,null,"914x305x313",932,309,21.1,34.5,19,39800,313,548000,11800,13600,37.1,17000,1100,1750,6.54,1160,34200,205.17950000000002]
[null,null,"914x305x345",943,308,22.1,39.9,19,44000,345,626000,13300,15400,37.700000000000003,19500,1270,2000,6.66,1650,39600,218.19590000000005]
[null,null,"914x305x381",951,310,24.4,43.9,19,48600,381,697000,14600,17000,37.9,21900,1410,2240,6.72,2200,44800,241.21360000000001]
[null,null,"914x305x425",961,313,26.9,49,19,54200,425,788000,16400,19100,38.1,25200,1610,2560,6.82,3030,52100,267.06099999999998]
[null,null,"914x305x474",971,316,30,54.1,19,60400,474,886000,18200,21400,38.299999999999997,28700,1810,2900,6.89,4100,59800,298.87599999999998]
[null,null,"914x305x521",981,319,33,58.9,19,66400,521,982000,20000,23600,38.5,32100,2020,3240,6.96,5340,67700,330.03700000000003]
[null,null,"914x305x576",993,322,36.1,65,19,73300,576,1102000,22200,26300,38.799999999999997,36500,2270,3660,7.06,7130,77900,362.565]
[null,null,"914x419x343",911.8,418.5,19.399999999999999,32,24.1,43700,343.3,626000,13700,15500,37.799999999999997,39200,1870,2890,9.4600000000000009,1190,75800,190.792]
[null,null,"914x419x388",921,420.5,21.4,36.6,24.1,49400,388,720000,15600,17700,38.200000000000003,45400,2160,3340,9.59,1730,88900,211.66759999999999]
[null,null,"1016x305x222",970.3,300,16,21.1,30,28300,222,408000,8410,9810,38,9550,636,1020,5.81,390,21500,172.43599999999998]
[null,null,"1016x305x249",980.1,300,16.5,26,30,31700,248.7,481000,9820,11300,39,11800,784,1240,6.09,582,26800,180.89]
[null,null,"1016x305x272",990.1,300,16.5,31,30,34700,272.3,554000,11200,12800,40,14000,934,1470,6.35,835,32200.000000000004,184.715]
[null,null,"1016x305x314",999.9,300,19.100000000000001,35.9,30,40000,314.3,644000,12900,14800,40.1,16200,1080,1710,6.37,1260,37700,212.99689999999998]
[null,null,"1016x305x350",1008,302,21.1,40,30,44500,350,723000,14300,16600,40.299999999999997,18500,1220,1940,6.44,1720,43300,235.84]
[null,null,"1016x305x393",1015.9,303,24.4,43.9,30,50000,392.7,808000,15900,18500,40.200000000000003,20500,1350,2170,6.4,2330,48400,271.01760000000002]
[null,null,"1016x305x415",1020,304,26,46,30,52900,415,853000,16700,19600,40.200000000000003,21700,1430,2300,6.41,2700,51100,288.88]
[null,null,"1016x305x438",1026,305,26.9,49,30,55600,438,910000,17700,20800,40.4,23400,1540,2470,6.49,3190,56000,299.68099999999998]
[null,null,"1016x305x494",1036,309,31,54,30,62900,494,1028000,19800,23400,40.4,26800,1740,2820,6.53,4400,64000,344.42]
[null,null,"1016x305x584",1056,314,36,64,30,74400,584,1246000,23600,28000,40.9,33400,2130,3480,6.7,7150,81200,403.52]
[]
[null,null,"Desig-","Dimensions",null,null,null,null,"Area","Weight","ly","Wel.y","Wpl.y","iy","lz","Wel.z","Wpl.z","iz","lt","lw","Avz"]
[null,null,"nation","h","b","tw","tf","r","A","G","mm4","mm3","mm3","mm ","mm4","mm3","mm3","mm ","mm4","mm6","mm2"]
[null,{"$f":"C447","v":"UC"},"UC","mm ","mm ","mm ","mm ","mm ","mm2","kg/m ","(x 104)","(x 103)","(x 103)","(x 10 )","(x 104)","(x 103)","(x 103)","(x 10 )","(x 104)","(x 109)","(x 102)"]
[null,{"$f":"COUNTA(C448:C493)","v":46},"152x152x23",152.4,152.19999999999999,5.8,6.8,7.6,2920,23,1250,164,182,6.54,400,52.6,80.099999999999994,3.7,4.63,21,{"$f":"(I448-2*E448*G448+(F448+2*H448)*G448)/100","v":9.9288000000000025}]
[null,null,"152x152x30",157.6,152.9,6.5,9.4,7.6,3829.9999999999995,30,1750,222,248,6.76,560,73.3,112,3.83,10.5,31,11.594599999999991]
[null,null,"152x152x37",161.80000000000001,154.4,8,11.5,7.6,4710,37,2210,273,309,6.85,706,91.5,140,3.87,19.2,40,14.255999999999997]
[null,null,"152x152x44",166,155.9,9.5,13.6,7.6,5610,44,2700,326,372,6.94,860,110,169,3.92,31.7,50,17.054399999999998]
[null,null,"152x152x51",170.2,157.4,11,15.7,7.6,6520,51.2,3230,379,438,7.04,1020,130,199,3.96,48.8,61,19.889800000000001]
[null,null,"203x203x46",203.2,203.6,7.2,11,10.199999999999999,5870,46.1,4570,450,497,8.82,1550,152,231,5.13,22.2,143,16.944000000000003]
[null,null,"203x203x52",206.2,204.3,7.9,12.5,10.199999999999999,6630,52,5260,510,567,8.91,1780,174,264,5.18,31.8,167,18.762499999999999]
[null,null,"203x203x60",209.6,205.8,9.4,14.2,10.199999999999999,7640.0000000000009,60,6120,584,656,8.9600000000000009,2060,201,305,5.2,47.2,197,22.184400000000004]
[null,null,"203x203x71",215.8,206.4,10,17.3,10.199999999999999,9040,71,7620,706,799,9.18,2540,246,374,5.3,80.2,250,24.244799999999994]
[null,null,"203x203x86",222.2,209.1,12.7,20.5,10.199999999999999,11000,86.1,9450,850,977,9.2799999999999994,3130,299,456,5.34,137,318,31.054499999999994]
[null,null,"203x203x100",228.6,210.3,14.5,23.7,10.199999999999999,12700,99.6,11300,988,1150,9.44,3680,350,534,5.39,210,386,35.589100000000009]
[null,null,"203x203x113",235,212.1,16.3,26.9,10.199999999999999,14500,113.5,13300,1130,1330,9.59,4290,404,618,5.45,305,464,40.762500000000003]
[null,null,"203x203x127",241.4,213.9,18.100000000000001,30.1,10.199999999999999,16200,127.5,15400,1280,1520,9.75,4920,460,704,5.5,427,549,44.820699999999995]
[null,null,"254x254x73",254.1,254.6,8.6,14.2,12.7,9310,73.099999999999994,11400,898,992,11.1,3910,307,465,6.48,57.6,562,25.621600000000008]
[null,null,"254x254x89",260.3,256.3,10.3,17.3,12.7,11300,88.9,14300,1100,1220,11.2,4860,379,575,6.55,102,717,30.496299999999987]
[null,null,"254x254x107",266.7,258.8,12.8,20.5,12.7,13600,107.1,17500,1310,1480,11.3,5930,458,697,6.59,172,898,37.722999999999985]
[null,null,"254x254x132",276.3,261.3,15.3,25.3,12.7,16800,132,22500,1630,1870,11.6,7530,576,878,6.69,319,1190,46.079299999999996]
[null,null,"254x254x167",289.10000000000002,265.2,19.2,31.7,12.7,21300,167.1,30000,2080,2420,11.9,9870,744,1140,6.81,626,1630,59.001399999999997]
[null,null,"305x305x97",307.89999999999998,305.3,9.9,15.4,15.2,12300,96.9,22200,1450,1590,13.4,7310,479,726,7.69,91.2,1560,35.1738]
[null,null,"305x305x118",314.5,307.39999999999998,12,18.7,15.2,15000,117.9,27700,1760,1960,13.6,9060,589,895,7.77,161,1980,42.961200000000019]
[null,null,"305x305x137",320.5,309.2,13.8,21.7,15.2,17400,136.9,32800,2050,2300,13.7,10700,692,1050,7.83,249,2390,49.398600000000016]
[null,null,"305x305x158",327.10000000000002,311.2,15.8,25,15.2,20100,158.1,38700,2370,2680,13.9,12600,808,1230,7.9,378,2870,56.95]
[null,null,"305x305x198",339.9,314.5,19.100000000000001,31.4,15.2,25200,198.1,50900,3000,3440,14.2,16300,1040,1580,8.0399999999999991,734,3880,70.03700000000002]
[null,null,"305x305x240",352.5,318.39999999999998,23,37.700000000000003,15.2,30600,240,64200,3640,4250,14.5,20300,1280,1950,8.15,1270,5030,86.058199999999999]
[null,null,"305x305x283",365.3,322.2,26.8,44.1,15.2,36000,282.89999999999998,78900,4320,5110,14.8,24600,1530,2340,8.27,2030,6350,101.0448]
[null,null,"356x368x129",355.6,368.6,10.4,17.5,15.2,16400,129,40200,2260,2480,15.6,14600,793,1200,9.43,153,4180,42.13]
[null,null,"356x368x153",362,370.5,12.3,20.7,15.2,19500,152.9,48600,2680,2960,15.8,17600,948,1430,9.49,251,5110,50.451900000000016]
[null,null,"356x368x177",368.2,372.6,14.4,23.8,15.2,22600,177,57100,3100,3460,15.9,20500,1100,1670,9.5399999999999991,381,6090,59.304799999999979]
[null,null,"356x368x202",374.6,374.7,16.5,27,15.2,25700,201.9,66300,3540,3970,16.100000000000001,23700,1260,1920,9.6,558,7160,67.325000000000003]
[null,null,"356x406x235",381,394.8,18.399999999999999,30.2,15.2,29900,235.1,79100,4150,4690,16.3,31000,1570,2380,10.199999999999999,812,9540,75.278399999999976]
[null,null,"356x406x287",393.6,399,22.6,36.5,15.2,36600,287.10000000000002,99900,5070,5810,16.5,38700,1940,2950,10.3,1440,12300,94.075000000000003]
[null,null,"356x406x340",406.4,403,26.6,42.9,15.2,43300,339.9,123000,6030,7000,16.8,46900,2330,3540,10.4,2340,15500,111.67899999999997]
[null,null,"356x406x393",419,407,30.6,49.2,15.2,50100,393,147000,7000,8220,17.100000000000001,55400,2720,4150,10.5,3550,18900,130.52399999999997]
[null,null,"356x406x467",436.6,412.2,35.799999999999997,58,15.2,59500,467,183000,8380,10000,17.5,67800,3290,5030,10.7,5810,24300,155.24400000000003]
[null,null,"356x406x509",446,416,39.1,62.7,15,64900,509,204000,9170,11000,17.8,75400,3620,5550,10.8,7390,27600,170.6617]
[null,null,"356x406x551",455.6,418.5,42.1,67.5,15.2,70200,551,227000,9960,12100,18,82700,3950,6060,10.9,9240,31100,185.96250000000001]
[null,null,"356x406x592",465,421,45,72.3,15,75500,592,250000,10800,13100,18.2,90200,4280,6570,10.9,11400,34700,200.459]
[null,null,"356x406x634",474.6,424,47.6,77,15.2,80800,633.9,275000,11600,14200,18.399999999999999,98100,4630,7110,11,13700,38800,215.1]
[null,null,"356x406x677",483,428,51.2,81.5,15,86300,677,300000,12400,15400,18.600000000000001,107000,4990,7680,11.1,16400,42900,231.53799999999998]
[null,null,"356x406x744",498,432,55.6,88.9,15,94800,744,342000,13700,17200,19,120000,5550,8550,11.3,21400,50000,256.00239999999997]
[null,null,"356x406x818",514,437,60.5,97,15,104300,818,392000,15300,19300,19.399999999999999,136000,6200,9560,11.4,27800,58600,283.005]
[null,null,"356x406x900",531,442,65.900000000000006,106,15,114900,900,450000,17000,21600,19.8,153000,6940,10700,11.6,36400,68900,313.61400000000003]
[null,null,"356x406x990",550,448,71.900000000000006,115,15,126200,990,519000,18900,24300,20.3,173000,7740,12000,11.7,46900,81500,348.78500000000003]
[null,null,"356x406x1086",569,454,78,125,15,138600,1086,596000,20900,27200,20.7,196000,8640,13400,11.9,60500,96100,386]
[null,null,"356x406x1202",580,471,95,130,15.4,153100,1202,664000,22900,30000,20.8,229000,9710,15200,12.2,76300,114600,469.94]
[null,null,"356x406x1299",600,476,100,140,15.4,165500,1299,755000,25200,33200,21.4,254000,10700,16700,12.4,94500,133100,505.32]
[]
[null,null,"Desig-","Dimensions",null,null,null,null,"Area","Weight","ly","Wel.y","Wpl.y","iy","lz","Wel.z","Wpl.z","iz","lt","lw","Avz"]
[null,null,"nation","h","b","tw","tf","r","A","G","mm4","mm3","mm3","mm ","mm4","mm3","mm3","mm ","mm4","mm6","mm2"]
[null,{"$f":"C497","v":"PFC"},"PFC","mm ","mm ","mm ","mm ","mm ","mm2","kg/m ","(x 104)","(x 103)","(x 103)","(x 10 )","(x 104)","(x 103)","(x 103)","(x 10 )","(x 104)","(x 109)","(x 102)"]
[null,{"$f":"COUNTA(C498:C513)","v":16},"100x50x10",100,50,5,8.5,9,1300,10.199999999999999,207.7,41.54,48.87,4,32.299999999999997,9.89,18.239999999999998,1.58,2.5299999999999998,0.44,{"$f":"(I498-2*E498*G498+(F498+H498)*G498)/100","v":5.69}]
[null,null,"125x65x15",125,65,5.5,9.5,12,1880,14.8,483.1,77.290000000000006,89.88,5.07,80.02,18.82,34.33,2.06,4.72,1.74,{"$f":"(I499-2*E499*G499+(F499+H499)*G499)/100","v":8.1125000000000007}]
[null,null,"150x75x18",150,75,5.5,10,12,2277,17.899999999999999,861,114.8,132.1,6.15,131,26.61,48.31,2.4,6.1,4.24,9.52]
[null,null,"150x90x24",150,90,6.5,12,12,3041,23.9,1162,154.9,178.6,6.18,253.2,44.45,79.5,2.89,11.8,8.15,11.03]
[null,null,"180x75x20",180,75,6,10.5,12,2591,20.3,1370,152.19999999999999,176.2,7.27,146.4,28.76,52.95,2.38,7.34,6.92,12.05]
[null,null,"180x90x26",180,90,6.5,12.5,12,3319,26.1,1817,201.9,232.1,7.4,276.7,47.44,85.88,2.89,13.31,13.03,13.0025]
[null,null,"200x75x23",200,75,6,12.5,12,2987,23.4,1963,196.3,227,8.11,170,33.840000000000003,62.23,2.39,11.09,9.89,13.37]
[null,null,"200x90x30",200,90,7,14,12,3786,29.7,2523,252.3,291.3,8.16,313.89999999999998,53.4,97.46,2.88,18.29,18.190000000000001,15.32]
[null,null,"230x75x26",230,75,6.5,12.5,12,3269,25.7,2748,239,278.39999999999998,9.17,181,34.81,64.11,2.35,11.82,14.16,16.252500000000001]
[null,null,"230x90x32",230,90,7.5,14,12,4097,32.200000000000003,3518,305.89999999999998,354.7,9.27,334.1,54.97,101.5,2.86,19.309999999999999,25.95,18.5]
[null,null,"260x75x28",260,75,7,12,12,3514,27.6,3619,278.39999999999998,327.8,"10.15  1",185.5,34.36,61.24,2.2999999999999998,11.73,19.03,19.420000000000002]
[null,null,"260x90x35",260,90,8,14,12,4438,34.799999999999997,4728,363.7,424.6,"10.32  2",352.5,56.29,103.6,2.82,20.57,35.549999999999997,21.98]
[null,null,"300x90x41",300,90,9,15.5,12,5273,41.4,7218,481.2,567.79999999999995,"11.70  2",403.9,63.12,113.7,2.77,28.77,54.8,28.085000000000001]
[null,null,"300x100x46",300,100,9,16.5,15,5800,45.5,8229,548.6,640.70000000000005,"11.91  2",567.79999999999995,81.72,150.4,3.13,36.840000000000003,75.7,28.96]
[null,null,"380x100x54",380,100,9.5,17.5,15,6873.9999999999991,54,15030,791.3,933.4,"14.79  3",643,89.18,158.19999999999999,3.06,45.66,141.80000000000001,38.027499999999989]
[null,null,"430x100x64",430,100,11,19,15,8209,64.400000000000006,21940,1020,1222,"16.35  4",722.5,97.9,159,2.97,63,207.8,49.03]

{"sheet":"from author","index":3,"n_rows":39,"n_cols":11,"rows_kept":39,"cut":false,"hidden":false,"merged":[[6,2,9,9],[38,2,43,9],[12,2,22,9],[23,2,23,7],[24,2,27,9],[31,2,34,9],[2,2,2,5],[2,6,2,9],[3,2,3,5],[3,6,3,9],[4,12,4,13]]}
[null,"Version: 1.1. - FREE LITE VERSION",null,null,null,null,null,null,null,null,"© 2013-2019 Damian Janicki"]
[]
[null,null,"For latest updates and news visit:",null,null,null,"Contact me at:"]
[null,null,"www.YourSpreadsheets.co.uk",null,null,null,"info@yourspreadsheets.co.uk"]
[]
[]
[null,null,"General information:\nNote: This spreadsheet contains macros.\nTo change company logo: right click it and select 'change picture'."]
[]
[]
[]
[]
[]
[null,null,"The Author takes no liability for use of this spreadsheet and gives no guarantee that it is error free. \n\nIn no event shall the Author be responsible for any special, incidental or consequential damages whatsoever arising from the use of this spreadsheet, even if the Author has been advised of the possibility of such damage.\n\nThis spreadsheet is a freeware and can be distributed freely but only in its original form.\n\nReverse-engineering, decompiling or disassembling of this spreadsheet is not allowable.\n\nA full list of terms and conditions can be found here:"]
[]
[]
[]
[]
[]
[]
[]
[]
[]
[]
[null,null,"www.yourspreadsheets.co.uk/checkout.html"]
[null,null,"\nBy using this spreadsheet you understand and agree with the terms and conditions. You also acknowledge that you do not become an owner of this spreadsheet.\n\nDamian Janicki"]
[]
[]
[]
[]
[]
[]
[null,null,"This is a Free Lite Version. The full version of the spreadsheet allows to:\n- Input your company information and change logo;\n- Change beam span.\n- Change loading."]
[]
[]
[]
[]
[]
[]
[null,null,"This spreadsheet is based on Eurocode 3 (EN 1993-1-1: 2005)\n\nChangelog:\n25.08.2019 - v.1.1. - corrected error when effective length was greater than actual length. Updated steel section sizes database. Added more options for deflection limits.\n13.05.2013 - v.1.0. - official release of the spreadsheet."]