{"text_format":"1","workbook":"xlsx","n_sheets":4,"sheets":["Steel Eurocode 3","Graph Properties","Section tables new","from author"],"not_rendered":{"charts":4,"images":3,"macros":1,"external_links":0,"defined_names":25,"comments":1,"pivot_tables":0},"unopened":[],"bounds":{"document_bytes":16777216,"sheet_cells":100000,"rows_first":2000,"rows_last":500,"rows_between":2000,"halvings":0,"cell_chars":16384,"cell_head_chars":4096},"cells_cut":0,"cells_raw":0,"read":"whole","date_system":"1900"}

{"sheet":"Steel Eurocode 3","index":0,"n_rows":64,"n_cols":33,"rows_kept":64,"cut":false,"hidden":false,"merged":[[60,21,60,22],[61,21,61,22],[53,2,53,13],[57,2,57,10],[57,11,57,13],[61,2,61,10],[61,11,61,13],[60,15,61,17],[16,9,16,10],[29,21,29,22],[31,12,31,13],[17,12,17,13],[22,7,22,8],[33,21,33,22],[29,15,29,18],[30,15,30,18],[31,15,31,18],[32,15,32,18],[25,7,25,8],[23,7,23,8],[24,7,24,8],[29,2,29,13],[26,5,26,6],[27,5,27,6],[25,5,25,6],[9,2,9,3],[9,4,9,5],[11,2,12,3],[11,4,12,5],[11,7,12,13],[14,2,15,3],[14,4,15,5],[14,7,14,13],[9,11,9,13],[9,7,9,10],[15,9,15,10],[17,9,17,10],[21,2,21,13],[22,3,22,4],[23,3,23,4],[22,10,23,11],[22,12,23,13],[22,5,22,6],[23,5,23,6],[24,3,24,4],[25,3,25,4],[24,5,24,6],[0,1,0,15],[0,16,0,25],[1,16,2,20],[2,21,2,22],[2,23,2,25],[3,16,3,18],[3,19,3,20],[3,21,3,22],[3,23,3,25],[1,3,3,15],[6,31,6,32],[7,2,7,3],[7,4,7,5],[7,11,8,12],[8,2,8,3],[8,4,8,5],[4,3,4,15],[4,16,4,18],[4,19,4,20],[4,21,4,22],[4,23,4,25],[6,2,6,5],[6,7,6,13],[6,15,6,24],[32,2,32,5],[32,6,32,8],[32,12,32,13],[27,3,27,4],[27,7,27,8],[26,3,26,4],[26,7,26,8],[32,21,32,22],[31,21,31,22],[30,21,30,22],[30,9,30,11],[31,9,31,11],[32,9,32,11],[30,12,30,13],[31,2,31,5],[31,6,31,8],[30,2,30,5],[30,6,30,8],[26,12,26,13],[27,12,27,13],[28,2,28,13],[33,6,33,8],[33,12,33,13],[36,8,36,13],[37,8,37,9],[39,8,39,9],[36,2,36,7],[37,2,37,7],[39,2,39,7],[33,9,33,11],[38,2,38,7],[38,8,38,9],[30,24,31,24],[52,2,52,7],[55,2,55,7],[59,8,59,9],[46,8,46,9],[48,8,48,9],[47,8,47,9],[59,11,59,13],[45,2,45,7],[46,2,46,7],[47,2,47,7],[56,2,56,7],[48,2,48,7],[52,8,52,13],[45,8,45,9],[33,15,33,18],[32,24,33,24],[40,8,40,9],[41,8,41,9],[44,8,44,13],[40,2,40,7],[41,2,41,7],[44,2,44,7],[33,2,33,5],[60,8,60,9],[56,8,56,9],[58,2,58,7],[58,8,58,9],[58,11,58,13],[59,2,59,7],[54,8,54,9],[54,11,54,13],[55,8,55,9],[55,11,55,13],[54,2,54,7],[60,2,60,7]]}
[null,"version: 1.1. - FREE LITE VERSION",null,null,null,null,null,null,null,null,null,null,null,null,null,null,"© 2013-2019 Damian Janicki"]
[null,null,null,"YourSpreadsheets™\nYour Office Address Goes Here\nwww.YourSpreadsheets.co.uk\nTel: 010 1234 567890 (example only)",null,null,null,null,null,null,null,null,null,null,null,null,"TEST PROJECT NAME"]
[null,null,null,null,null,null,null,null,null,null,null,null,null,null,null,null,null,null,null,null,null,"Revision",null,"A"]
[null,null,null,null,null,null,null,null,null,null,null,null,null,null,null,null,"Job No:",null,null,123,null,"Page:",null,1]
[null,null,"Member: ","test member (this is unlicensed version of the spreadsheet)",null,null,null,null,null,null,null,null,null,null,null,null,"Prepared By:",null,null,"DJ",null,"Date:",null,{"$f":"TODAY()","v":"2019-08-26"}]
[]
[null,null,"GENERAL DATA",null,null,null,null,"SELECTED SECTION",null,null,null,null,null,null,null,"SECTION PROPERTIES",null,null,null,null,null,null,null,null,null,null,null,null,null,null,null,"SUMMARY:"]
[null,null,"Steel Grade:",null,"S450",null,null,null,null,null,null,null,null,null,null,null,null,null,"h =",{"$f":"OFFSET('Section tables new'!$C$1,$AE$34-1,1)","v":368.2},"mm",null,"Iyy =",{"$f":"OFFSET('Section tables new'!$C$1,$AE$34-1,8)","v":57100},"cm4",null,null,null,null,null,null,{"$f":"I42","v":0.42013065256420723},"moment"]
[null,null,"fy [MPa] =",null,{"$f":"AD16","v":440},null,null,null,null,null,null,null,null,null,null,null,null,null,"b =",{"$f":"OFFSET('Section tables new'!$C$1,$AE$34-1,2)","v":372.6},"mm",null,"Wel,y =",{"$f":"OFFSET('Section tables new'!$C$1,$AE$34-1,9)","v":3100},"cm3",null,null,null,null,null,null,{"$f":"I49","v":0.16913409514568306},"shear"]
[null,null,"E [GPa] =",null,210,null,null,"Classification: ",null,null,null,{"$f":"\"Class \"&MAX(IF((T9-T10-2*T12)/2/T11<9*SQRT(235/E9),1,IF((T9-T10-2*T12)/2/T11<10*SQRT(235/E9),2,IF((T9-T10-2*T12)/2/T11<14*SQRT(235/E9),3,4))),IF((T8-2*T11-2*T12)/T10<72*SQRT(235/E9),1,IF((T8-2*T11-2*T12)/T10<83*SQRT(235/E9),2,IF((T8-2*T11-2*T12)/T10<124*SQRT(235/E9),3,4))))","v":"Class 2"},null,null,null,null,null,null,"tw =",{"$f":"OFFSET('Section tables new'!$C$1,$AE$34-1,3)","v":14.4},"mm",null,"Wpl,y =",{"$f":"OFFSET('Section tables new'!$C$1,$AE$34-1,10)","v":3460},"cm3",null,null,null,null,null,null,{"$f":"I57","v":0.32446839145743311},"wLL only"]
[null,null,null,null,null,null,null,null,null,null,null,null,null,null,null,null,null,null,"tf =",{"$f":"OFFSET('Section tables new'!$C$1,$AE$34-1,4)","v":23.8},"mm",null,"iy =",{"$f":"OFFSET('Section tables new'!$C$1,$AE$34-1,11)","v":15.9},"cm",null,null,null,null,null,null,{"$f":"I61","v":0.86068486634312591},"wDL + LL +  SL"]
[null,null,"SPAN [m] =",null,8,null,null,"INCLUDE S/W    ",null,null,null,null,null,null,null,null,null,null,"r =",{"$f":"OFFSET('Section tables new'!$C$1,$AE$34-1,5)","v":15.2},"mm",null,"Izz =",{"$f":"OFFSET('Section tables new'!$C$1,$AE$34-1,12)","v":20500},"cm4",null,null,"thickness",{"$f":"MAX(T10:T11)","v":23.8}]
[null,null,null,null,null,null,null,null,null,null,null,null,null,null,null,null,null,null,"A =",{"$f":"OFFSET('Section tables new'!$C$1,$AE$34-1,6)","v":22600},"mm2",null,"Wel,z =",{"$f":"OFFSET('Section tables new'!$C$1,$AE$34-1,13)","v":1100},"cm3",null,null,"steel grade","S235",{"$f":"IF($AC$12<=40,235,215)","v":235}]
[null,null,null,null,null,null,null,null,null,null,null,null,null,null,null,null,null,null,"Av =",{"$f":"OFFSET('Section tables new'!$C$1,$AE$34-1,18)*100","v":5930.4799999999977},"mm2",null,"Wpl,z =",{"$f":"OFFSET('Section tables new'!$C$1,$AE$34-1,14)","v":1670},"cm3",null,null,null,"S275",{"$f":"IF($AC$12<=16,275,IF($AC$12<=40,265,IF($AC$12<=63,255,245)))","v":265}]
[null,null,"EFFECTIVE \nLENGTH [m] =",null,8,null,null,"SAFETY FACTORS",null,null,null,null,null,null,null,null,null,null,"It =",{"$f":"OFFSET('Section tables new'!$C$1,$AE$34-1,16)","v":381},"cm4",null,"iz =",{"$f":"OFFSET('Section tables new'!$C$1,$AE$34-1,15)","v":9.5399999999999991},"cm",null,null,null,"S355",{"$f":"IF($AC$12<=16,355,IF($AC$12<=40,345,IF($AC$12<=63,335,325)))","v":345}]
[null,null,null,null,null,null,null,null,"γg =",1.35,null,null,null,null,null,null,null,null,"weight =",{"$f":"OFFSET('Section tables new'!$C$1,$AE$34-1,7)","v":177},"kg/m",null,"Iw (x10-3) =",{"$f":"OFFSET('Section tables new'!$C$1,$AE$34-1,17)","v":6090},"cm6",null,null,null,"S450",{"$f":"IF($AC$12<=40,440,410)","v":440}]
[null,null,null,null,null,null,null,null,"γq =",1.5]
[null,null,null,null,null,null,null,null,"γs =",1.5,null,"ψ0,s =",0.75]
[null,null,null,null,null,null,null,null,null,null,null,null,null,null,null,null,null,null,null,null,null,null,null,null,null,null,null,"steel type","- EU sections -"]
[null,null,null,null,null,null,null,null,null,null,null,null,null,null,null,null,null,null,null,null,null,null,null,null,null,null,null,null,"HD"]
[null,null,null,null,null,null,null,null,null,null,null,null,null,null,null,null,null,null,null,null,null,null,null,null,null,null,null,null,"HE"]
[null,null,"LOADING",null,null,null,null,null,null,null,null,null,null,null,null,null,null,null,null,null,null,null,null,null,null,null,null,null,"HL"]
[null,null,null,"Perm.",null,"Variable",null,"Snow",null,null,"position from left",null,"length",null,null,null,null,null,null,null,null,null,null,null,null,null,null,null,"IPE"]
[null,null,"UDL =",15,null,10,null,5,null,"kN/m",null,null,null,null,null,null,null,null,null,null,null,null,null,null,null,null,null,null,"IPN"]
[null,null,"PUDLa =",15,null,10,null,5,null,"kN/m",1,"m",1,"m",null,null,null,null,null,null,null,null,null,null,null,null,null,null,"UPE"]
[null,null,"PUDLb =",15,null,10,null,5,null,"kN/m",3,"m",1,"m",null,null,null,null,null,null,null,null,null,null,null,null,null,null,"UPN"]
[null,null,"PLa =",15,null,10,null,5,null,"kN",5,"m","~~~~",null,null,null,null,null,null,null,null,null,null,null,null,null,null,null,"- UK sections -"]
[null,null,"PLb =",15,null,10,null,5,null,"kN",6,"m","~~~~",null,null,null,null,null,null,null,null,null,null,null,null,null,null,null,"UB"]
[null,null,"Note: all loads assumed to be non-destabilizing.",null,null,null,null,null,null,null,null,null,null,null,null,null,null,null,null,null,null,null,null,null,null,null,null,null,"UC"]
[null,null,"SUMMARY OF RESULTS",null,null,null,null,null,null,null,null,null,null,null,null,"REACTIONS",null,null,null,"Perm.","Variable","Snow",null,"Total","[kN]",null,null,null,"PFC"]
{"$rows_left_out":35}
{"sheet":"Graph Properties","index":1,"n_rows":338,"n_cols":253,"rows_kept":338,"cut":false,"hidden":true,"merged":[]}
[null,null,"p,P","a","b","c","R1","R2","a'","Drawing Max:",{"$f":"MAX(1,15+10+5+C2+MAX('Steel Eurocode 3'!D27+'Steel Eurocode 3'!F27+'Steel Eurocode 3'!H27,'Steel Eurocode 3'!D28+'Steel Eurocode 3'!F28+'Steel Eurocode 3'!H28,'Steel Eurocode 3'!D25+'Steel Eurocode 3'!F25+'Steel Eurocode 3'!H25,'Steel Eurocode 3'!D26+'Steel Eurocode 3'!F26+'Steel Eurocode 3'!H26))","v":61.769999999999996}]
[null,"self weight",{"$f":"'Steel Eurocode 3'!AD36","v":1.77},"-","-","-","-","-","-","Length:",{"$f":"8","v":8}]
[null,"pudl",{"$f":"(C2+15)*'Steel Eurocode 3'!J16+'Steel Eurocode 3'!J17*10+'Steel Eurocode 3'!J18*'Steel Eurocode 3'!M18*5","v":43.264499999999998},"-","-","-","-","-","-","EI",{"$f":"'Steel Eurocode 3'!X8*'Steel Eurocode 3'!E10","v":11991000}]
[null,"pudl,a",{"$f":"'Steel Eurocode 3'!J16*'Steel Eurocode 3'!D25+'Steel Eurocode 3'!J17*'Steel Eurocode 3'!F25+'Steel Eurocode 3'!J18*'Steel Eurocode 3'!M18*'Steel Eurocode 3'!H25","v":40.875},{"$f":"'Steel Eurocode 3'!K25","v":1},{"$f":"1","v":1},{"$f":"8-'Graph Properties'!D4-'Graph Properties'!E4","v":6},{"$f":"C4*E4/(2*8)*(2*F4+E4)","v":33.2109375},{"$f":"-C4*E4/(2*8)*(2*D4+E4)","v":-7.6640625},{"$f":"D4+E4","v":2}]
[null,"pudl,b",{"$f":"'Steel Eurocode 3'!J16*'Steel Eurocode 3'!D26+'Steel Eurocode 3'!J17*'Steel Eurocode 3'!F26+'Steel Eurocode 3'!J18*'Steel Eurocode 3'!M18*'Steel Eurocode 3'!H26","v":40.875},3,{"$f":"'Steel Eurocode 3'!M26","v":1},{"$f":"8-'Graph Properties'!D5-'Graph Properties'!E5","v":4},{"$f":"C5*E5/(2*8)*(2*F5+E5)","v":22.9921875},{"$f":"-C5*E5/(2*8)*(2*D5+E5)","v":-17.8828125},{"$f":"D5+E5","v":4}]
[null,"P,a",{"$f":"'Steel Eurocode 3'!J$16*'Steel Eurocode 3'!D27+'Steel Eurocode 3'!J$17*'Steel Eurocode 3'!F27+'Steel Eurocode 3'!J18*'Steel Eurocode 3'!M18*'Steel Eurocode 3'!H27","v":40.875},{"$f":"'Steel Eurocode 3'!K27","v":5},{"$f":"8-D6","v":3},"-",{"$f":"C6*E6/8","v":15.328125},{"$f":"C6*D6/8","v":25.546875},"-"]
[null,"P,b",{"$f":"'Steel Eurocode 3'!J$16*'Steel Eurocode 3'!D28+'Steel Eurocode 3'!J$17*'Steel Eurocode 3'!F28+'Steel Eurocode 3'!J18*'Steel Eurocode 3'!M18*'Steel Eurocode 3'!H28","v":40.875},{"$f":"'Steel Eurocode 3'!K28","v":6},{"$f":"8-D7","v":2},"-",{"$f":"C7*E7/8","v":10.21875},{"$f":"C7*D7/8","v":30.65625},"-"]
[]
[null,null,null,"Section type:","IPE"]
[null,null,null,"δ type:",{"$f":"IF('Steel Eurocode 3'!L62='Steel Eurocode 3'!AC42,\"max\",2)","v":"max"}]
[]
[]
[null,"G","Q","G+Ψ*Q+Ψ*S","γgG+γqΨqQ+γsΨsQ","GR1","GR2","QR1","QR2","SR1","SR2"]
["pudl",{"$f":"C2+15","v":16.77},{"$f":"10","v":10},{"$f":"B14+C14+B20*'Steel Eurocode 3'!M$18","v":30.52},{"$f":"'Steel Eurocode 3'!J$16*'Graph Properties'!B14+'Steel Eurocode 3'!J$17*'Graph Properties'!C14","v":37.639499999999998},{"$f":"B14*8/2","v":67.08},{"$f":"B14*8/2","v":67.08},{"$f":"C14*8/2","v":40},{"$f":"C14*8/2","v":40},{"$f":"B20*8/2","v":20},{"$f":"B20*8/2","v":20}]
["pudl,a",{"$f":"'Steel Eurocode 3'!D25","v":15},{"$f":"'Steel Eurocode 3'!F25","v":10},{"$f":"B15+C15+B21*'Steel Eurocode 3'!M$18","v":28.75},{"$f":"'Steel Eurocode 3'!J$16*'Graph Properties'!B15+'Steel Eurocode 3'!J$17*'Graph Properties'!C15","v":35.25},{"$f":"B15*$E4/(2*8)*(2*$F4+$E4)","v":12.1875},{"$f":"B15*E4/(2*8)*(2*D4+E4)","v":2.8125},{"$f":"C15*$E4/(2*8)*(2*$F4+$E4)","v":8.125},{"$f":"C15*E4/(2*8)*(2*D4+E4)","v":1.875},{"$f":"B21*$E4/(2*8)*(2*$F4+$E4)","v":4.0625},{"$f":"B21*E4/(2*8)*(2*D4+E4)","v":0.9375}]
["pudl,b",{"$f":"'Steel Eurocode 3'!D26","v":15},{"$f":"'Steel Eurocode 3'!F26","v":10},{"$f":"B16+C16+B22*'Steel Eurocode 3'!M$18","v":28.75},{"$f":"'Steel Eurocode 3'!J$16*'Graph Properties'!B16+'Steel Eurocode 3'!J$17*'Graph Properties'!C16","v":35.25},{"$f":"B16*$E5/(2*8)*(2*$F5+$E5)","v":8.4375},{"$f":"B16*E5/(2*8)*(2*D5+E5)","v":6.5625},{"$f":"C16*$E5/(2*8)*(2*$F5+$E5)","v":5.625},{"$f":"C16*E5/(2*8)*(2*D5+E5)","v":4.375},{"$f":"B22*$E5/(2*8)*(2*$F5+$E5)","v":2.8125},{"$f":"B22*E5/(2*8)*(2*D5+E5)","v":2.1875}]
["P,a",{"$f":"'Steel Eurocode 3'!D27","v":15},{"$f":"'Steel Eurocode 3'!F27","v":10},{"$f":"B17+C17+B23*'Steel Eurocode 3'!M$18","v":28.75},{"$f":"'Steel Eurocode 3'!J$16*'Graph Properties'!B17+'Steel Eurocode 3'!J$17*'Graph Properties'!C17","v":35.25},{"$f":"B17*E6/8","v":5.625},{"$f":"B17*D6/8","v":9.375},{"$f":"C17*E6/8","v":3.75},{"$f":"C17*D6/8","v":6.25},{"$f":"B23*E6/8","v":1.875},{"$f":"B23*D6/8","v":3.125}]
["P,b",{"$f":"'Steel Eurocode 3'!D28","v":15},{"$f":"'Steel Eurocode 3'!F28","v":10},{"$f":"B18+C18+B24*'Steel Eurocode 3'!M$18","v":28.75},{"$f":"'Steel Eurocode 3'!J$16*'Graph Properties'!B18+'Steel Eurocode 3'!J$17*'Graph Properties'!C18","v":35.25},{"$f":"B18*E7/8","v":3.75},{"$f":"B18*D7/8","v":11.25},{"$f":"C18*E7/8","v":2.5},{"$f":"C18*D7/8","v":7.5},{"$f":"B24*E7/8","v":1.25},{"$f":"B24*D7/8","v":3.75}]
[null,"S","Q+S",null,null,{"$f":"SUM(F14:F18)","v":97.08},97.08,60,60,30,30]
["pudl",{"$f":"5","v":5},{"$f":"C14+'Steel Eurocode 3'!M$18*'Graph Properties'!B20","v":13.75}]
["pudl,a",{"$f":"'Steel Eurocode 3'!H25","v":5},{"$f":"C15+'Steel Eurocode 3'!M$18*'Graph Properties'!B21","v":13.75}]
["pudl,b",{"$f":"'Steel Eurocode 3'!H26","v":5},{"$f":"C16+'Steel Eurocode 3'!M$18*'Graph Properties'!B22","v":13.75}]
["P,a",{"$f":"'Steel Eurocode 3'!H27","v":5},{"$f":"C17+'Steel Eurocode 3'!M$18*'Graph Properties'!B23","v":13.75}]
["P,b",{"$f":"'Steel Eurocode 3'!H28","v":5},{"$f":"C18+'Steel Eurocode 3'!M$18*'Graph Properties'!B24","v":13.75}]
[]
[null,"g",{"$f":"SQRT(1-('Steel Eurocode 3'!X12/'Steel Eurocode 3'!X8))","v":0.80061272507477899}]
[null,"Lcr",{"$f":"'Steel Eurocode 3'!$E$15","v":8}]
[null,"C1",{"$f":"1/C44^2","v":1.1317338162064283}]
[null,"C2",0.45900000000000002]
[null,"C3",0.55300000000000005]
{"$rows_left_out":309}
{"sheet":"Section tables new","index":2,"n_rows":513,"n_cols":22,"rows_kept":513,"cut":false,"hidden":true,"merged":[[311,3,311,7],[333,3,333,7],[444,3,444,7],[494,3,494,7],[3,3,3,7],[49,3,49,7],[165,3,165,7],[202,3,202,7],[268,3,268,7],[293,3,293,7]]}
[null,null,null,null,null,null,null,"UB","UC","PFC"]
[]
[]
[null,null,"Desig-","Dimensions",null,null,null,null,"Area","Weight","ly","Wel.y","Wpl.y","iy","lz","Wel.z","Wpl.z","iz","lt","lw","Avz"]
[null,null,"nation","h","b","tw","tf","r","A","G","mm4","mm3","mm3","mm ","mm4","mm3","mm3","mm ","mm4","mm6","mm2"]
[null,{"$f":"C6","v":"HD"},"HD","mm ","mm ","mm ","mm ","mm ","mm2","kg/m ","(x 104)","(x 103)","(x 103)","(x 10 )","(x 104)","(x 103)","(x 103)","(x 10 )","(x 104)","(x 109)","(x 102)"]
[null,{"$f":"COUNTA(C7:C48)","v":42},"260x54.1",244,260,6.5,9.5,24,6900,54.1,7981,654.1,714.5,10.76,2788,214.5,327.7,6.36,30.31,382.6,24.75]
[null,null,"260x68.2",250,260,7.5,12.5,24,8680,68.2,10450,836.4,919.8,10.97,3668,282.10000000000002,430.2,6.5,52.37,516.4,28.76]
[null,null,"260x93.0",260,260,10,17.5,24,11840,93,14920,1148,1283,11.22,5135,395,602.20000000000005,6.58,123.8,753.7,37.590000000000003]
[null,null,"260x114",268,262,12.5,21.5,24,14569.999999999998,114,18910,1411,1600,11.39,6456,492.8,752.5,6.66,222.4,979,46.08]
[null,null,"260x142",278,265,15.5,26.5,24,18030,142,24330,1750,2015,11.62,8236,621.6,950.5,6.76,406.8,1300,56.65]
[null,null,"260x172",290,268,18,32.5,24,21960,172,31310,2159,2524,11.94,10450,779.7,1192,6.9,719,1728,66.89]
[null,null,"260x225",309,271,24,42,24,28660.000000000004,225,43750,2832,3396,12.36,13970,1031,1583,6.98,1545,2483,89.18]
[null,null,"260x299",335,278,31,55,24,38050,299,64220,3834,4727,12.99,19770,1423,2190,7.21,3437,3860,118.1]
[null,null,"320x74.2",301,300,8,11,27,9460,74.2,16450,1093,1196,13.19,4959,330.6,505.7,7.24,55.87,1041,35.4]
[null,null,"320x97.6",310,300,9,15.5,27,12440,97.6,22930,1479,1628,13.58,6985,465.7,709.7,7.49,108,1512,41.13]
[null,null,"320x127",320,300,11.5,20.5,27,16130.000000000002,127,30820,1926,2149,13.82,9239,615.9,939.1,7.57,225.1,2069,51.77]
[null,null,"320x158",330,303,14.5,25.5,27,20120,158,39640,2403,2718,14.04,11840,781.7,1194,7.67,420.5,2741,64.180000000000007]
[null,null,"320x198",343,306,18,32,27,25230,198,51900,3026,3479,14.34,15310,1001,1530,7.79,805.3,3695,79.52]
[null,null,"320x245",359,309,21,40,27,31200,245,68130,3796,4435,14.78,19710,1276,1951,7.95,1501,5004,94.85]
[null,null,"320x300",375,313,27,48,27,38210,300,86900,4635,5522,15.08,24600,1572,2414,8.02,2650,6558,120.47]
[null,null,"360x134",356,369,11.2,18,15,17060,134,41510,2332,2562,15.6,15080,817.3,1237,9.4,168.8,4305,45.19]
[null,null,"360x147",360,370,12.3,19.8,15,18790,147,46290,2572,2838,15.7,16720,903.9,1369,9.43,223.7,4836,49.72]
[null,null,"360x162",364,371,13.3,21.8,15,20630,162,51540,2832,3139,15.81,18560,1001,1516,9.49,295.5,5432,53.98]
[null,null,"360x179",368,373,15,23.9,15,22830,179,57440,3122,3482,15.86,20680,1109,1683,9.52,393.8,6119,60.72]
[null,null,"360x196",372,374,16.399999999999999,26.2,15,25030,196,63630,3421,3837,15.94,22860,1222,1856,9.56,517.1,6829,66.5]
[null,null,"400x187",368,391,15,24,15,23760,187,60180,3271,3642,15.91,23920,1224,1855,10.029999999999999,414.6,7074,60.73]
[null,null,"400x216",375,394,17.3,27.7,15,27550,216,71140,3794,4262,16.07,28250,1434,2176,10.130000000000001,637.29999999999995,8515,70.319999999999993]
[null,null,"400x237",380,395,18.899999999999999,30.2,15,30089.999999999996,237,78780,4146,4686,16.18,31040,1572,2387,10.16,825.5,9489,77.099999999999994]
[null,null,"400x262",387,398,21.1,33.299999999999997,15,33460,262,89410,4620,5260,16.350000000000001,35020,1760,2676,10.23,1116,10940,86.55]
{"$rows_left_out":484}
{"sheet":"from author","index":3,"n_rows":39,"n_cols":11,"rows_kept":39,"cut":false,"hidden":false,"merged":[[6,2,9,9],[38,2,43,9],[12,2,22,9],[23,2,23,7],[24,2,27,9],[31,2,34,9],[2,2,2,5],[2,6,2,9],[3,2,3,5],[3,6,3,9],[4,12,4,13]]}
[null,"Version: 1.1. - FREE LITE VERSION",null,null,null,null,null,null,null,null,"© 2013-2019 Damian Janicki"]
[]
[null,null,"For latest updates and news visit:",null,null,null,"Contact me at:"]
[null,null,"www.YourSpreadsheets.co.uk",null,null,null,"info@yourspreadsheets.co.uk"]
[]
[]
[null,null,"General information:\nNote: This spreadsheet contains macros.\nTo change company logo: right click it and select 'change picture'."]
[]
[]
[]
[]
[]
[null,null,"The Author takes no liability for use of this spreadsheet and gives no guarantee that it is error free. \n\nIn no event shall the Author be responsible for any special, incidental or consequential damages whatsoever arising from the use of this spreadsheet, even if the Author has been advised of the possibility of such damage.\n\nThis spreadsheet is a freeware and can be distributed freely but only in its original form.\n\nReverse-engineering, decompiling or disassembling of this spreadsheet is not allowable.\n\nA full list of terms and conditions can be found here:"]
[]
[]
[]
[]
[]
[]
[]
[]
[]
[]
[null,null,"www.yourspreadsheets.co.uk/checkout.html"]
[null,null,"\nBy using this spreadsheet you understand and agree with the terms and conditions. You also acknowledge that you do not become an owner of this spreadsheet.\n\nDamian Janicki"]
[]
[]
[]
[]
[]
{"$rows_left_out":9}