{"text_format":"3","workbook":"xlsx","n_sheets":3,"sheets":["steel","calculations","from author"],"not_rendered":{"charts":4,"images":2,"macros":1,"defined_names":47,"comments":1},"read":"whole","date_system":"1900"}

{"sheet":"steel","index":0,"n_rows":71,"n_cols":38,"rows_kept":71,"merged":[[0,1,0,15],[0,16,0,24],[1,3,3,15],[1,16,2,19],[2,20,2,21],[2,22,2,24],[3,16,3,17],[3,18,3,19],[3,20,3,21],[3,22,3,24],[4,3,4,15],[4,16,4,17],[4,18,4,19],[4,20,4,21],[4,22,4,24],[6,2,6,5],[6,7,6,13],[6,17,6,23],[6,26,6,27],[7,2,7,3],[7,4,7,5],[7,8,8,9],[7,10,8,13],[8,2,8,3],[8,4,8,5],[9,2,9,3],[9,4,9,5],[9,7,9,13],[11,2,12,3],[11,4,12,5],[11,7,12,11],[14,2,15,3],[14,4,15,5],[14,7,14,13],[15,8,15,9],[15,10,15,11],[16,8,16,9],[16,10,16,11],[21,2,21,13],[22,4,22,5],[22,6,22,7],[22,10,23,11],[22,12,23,13],[23,2,23,3],[23,4,23,5],[23,6,23,7],[23,8,23,9],[24,2,24,3],[24,4,24,5],[24,6,24,7],[24,8,24,9],[25,2,25,3],[25,4,25,5],[25,6,25,7],[25,8,25,9],[26,2,26,3],[26,4,26,5],[26,6,26,7],[26,8,26,9],[26,12,26,13],[27,2,27,3],[27,4,27,5],[27,6,27,7],[27,8,27,9],[27,12,27,13],[33,2,33,13],[33,15,33,17],[33,20,33,21],[34,2,34,5],[34,6,34,8],[34,9,34,11],[34,12,34,13],[34,15,34,17],[34,20,34,21],[35,2,35,5],[35,6,35,8],[35,9,35,11],[35,12,35,13],[35,15,35,17],[35,20,35,21],[36,2,36,5],[36,6,36,8],[36,9,36,11],[36,12,36,13],[36,15,36,17],[36,20,36,21],[37,2,37,5],[37,6,37,8],[37,9,37,11],[37,12,37,13],[37,15,37,17],[37,20,37,21],[40,15,40,23],[41,20,41,21],[42,15,42,17],[42,20,42,21],[43,15,43,17],[43,20,43,21],[44,2,44,7],[44,8,44,13],[45,2,45,7],[45,8,45,9],[46,2,46,7],[46,8,46,9],[47,2,47,13],[48,2,48,7],[48,8,48,9],[49,2,49,7],[49,8,49,9],[50,2,50,7],[50,8,50,9],[52,2,52,7],[52,8,52,13],[53,2,53,7],[53,8,53,9],[54,2,54,7],[54,8,54,9],[55,2,55,13],[56,2,56,7],[56,8,56,9],[60,2,60,7],[60,8,60,13],[61,2,61,7],[61,8,61,9],[61,11,61,12],[62,2,62,7],[62,8,62,9],[63,2,63,7],[63,8,63,9],[65,2,65,7],[65,8,65,13],[66,2,66,7],[66,8,66,9],[66,11,66,12],[67,2,67,7],[67,8,67,9],[67,11,67,13],[68,2,68,7],[68,8,68,9]]}
[null,"version: 2.2. - FREE LITE VERSION",{"$nulls":14},"© 2010-2019 Damian Janicki"]
[{"$nulls":3},"YourSpreadsheets™\nYour Office Address Goes Here\nwww.YourSpreadsheets.co.uk\nTel: 010 1234 567890 (example only)",{"$nulls":12},"TEST PROJECT NAME",{"$nulls":15},123459,1]
[{"$nulls":20},"Revision",null,"A",{"$nulls":9},123458,2]
[{"$nulls":16},"Job No:",null,22190,null,"Page:",null,{"v":1,"d":"01"}]
[null,null,"Member: ","test member (this is unlicensed version of the spreadsheet)",{"$nulls":12},"Prepared By:",null,"DJ",null,"Date:",null,{"$f":"TODAY()","v":"2019-08-26"},{"$nulls":9},"fy"]
[{"$nulls":30},"Steel grade:","S275",{"$f":"IF(OR(tw>100,Tf>100),225,IF(OR(tw>80,Tf>80),235,IF(OR(tw>63,Tf>63),245,IF(OR(tw>40,Tf>40),255,IF(OR(tw>16,Tf>16),265,275)))))","v":275},null,"Reaction:",{"$f":"(UDL1d*8+PUDL1d*3+PUDL2d*LePUDL2+PLa1d+PLb1d)-AK6","v":{"v":19.415,"d":"19.42"}},{"$f":"(UDL1d*8^2/2+PUDL1d*3*(PosPUDL1+3/2)+PUDL2d*LePUDL2*(PosPUDL2+LePUDL2/2)+PLa1d*PosPLa1+PLb1d*PosPLb1)/8","v":{"v":16.665,"d":"16.67"}}]
[null,null,"GENERAL DATA",{"$nulls":4},"SELECTED SECTION",{"$nulls":9},"SECTION PROPERTIES",{"$nulls":8},"SUMMARY:",{"$nulls":4},"S355",{"$f":"IF(OR(tw>100,Tf>100),295,IF(OR(tw>80,Tf>80),315,IF(OR(tw>63,Tf>63),325,IF(OR(tw>40,Tf>40),335,IF(OR(tw>16,Tf>16),345,355)))))","v":355},null,null,{"$f":"(2*8+PUDL1l*3+PUDL2l*LePUDL2+PLa1l+PLb1l)-AK7","v":{"v":11.3125,"d":"11.31"}},{"$f":"(2*8^2/2+PUDL1l*3*(PosPUDL1+3/2)+PUDL2l*LePUDL2*(PosPUDL2+LePUDL2/2)+PLa1l*PosPLa1+PLb1l*PosPLb1)/8","v":{"v":9.6875,"d":"9.69"}}]
[null,null,"Steel Grade:",null,"S460",{"$nulls":3},{"$f":"IF(AF12>155,\"PFC\",IF(AF12>107,\"UC\",\"UB\"))","v":"UB"},{"$nulls":8},"D =",{"$f":"VLOOKUP(AF12,calculations!B92:Y262,4)","v":{"v":355,"d":"355.0"}},"mm",null,"rx =",{"$f":"VLOOKUP(AF12,calculations!B92:Y262,14)","v":14.8},"cm",null,null,{"$f":"I51","v":{"v":0.828743660402278,"d":"0.83"}},"moment",{"$nulls":3},"S460",{"$f":"IF(OR(tw>80,Tf>80),400,IF(OR(tw>63,Tf>63),410,IF(OR(tw>40,Tf>40),430,IF(OR(tw>16,Tf>16),440,460))))","v":460}]
[null,null,"py [MPa] =",null,{"$f":"AG10","v":460},{"$nulls":12},"B =",{"$f":"VLOOKUP(AF12,calculations!B92:Y262,5)","v":171.5},"mm",null,"ry =",{"$f":"VLOOKUP(AF12,calculations!B92:Y262,15)","v":{"v":3.86,"d":"3.9"}},"cm",null,null,{"$f":"I57","v":{"v":0.06245069319166074,"d":"0.06"}},"shear"]
[null,null,"E [GPa] =",null,205,null,null,{"$f":"\"Classification: \"&IF(AL20=1,\"plastic\",IF(AL20=2,\"compact\",IF(AL20=3,\"semi-compact\",\"slender\")))","v":"Classification: compact"},{"$nulls":9},"t =",{"$f":"VLOOKUP(AF12,calculations!B92:Y262,6)","v":7.4},"mm",null,"Ixx =",{"$f":"VLOOKUP(AF12,calculations!B92:Y262,12)","v":14100},"cm4",null,null,{"$f":"I64","v":{"v":0.2349,"d":"0.23"}},"LL",null,null,"Selected:",null,{"$f":"$AG$8","v":460}]
[{"$nulls":17},"T =",{"$f":"VLOOKUP(AF12,calculations!B92:Y262,7)","v":11.5},"mm",null,"Iyy =",{"$f":"VLOOKUP(AF12,calculations!B92:Y262,13)","v":968},"cm4",null,null,{"$f":"I69","v":{"v":0.5636,"d":"0.56"}},"DL+LL"]
[null,null,"SPAN [m] =",null,{"v":8,"d":"8.00"},null,null,"         INCLUDE S/W",{"$nulls":9},"r =",{"$f":"VLOOKUP(AF12,calculations!B92:Y262,8)","v":10.2},"mm",null,"Zx =",{"$f":"VLOOKUP(AF12,calculations!B92:Y262,16)","v":{"v":796,"d":"796.0"}},"cm3",{"$nulls":6},"Selected Section:",83]
[{"$nulls":17},"d =",{"$f":"VLOOKUP(AF12,calculations!B92:Y262,9)","v":311.6},"mm",null,"Zy =",{"$f":"VLOOKUP(AF12,calculations!B92:Y262,17)","v":{"v":113,"d":"113.0"}},"cm3"]
[{"$nulls":17},"A =",{"$f":"VLOOKUP(AF12,calculations!B92:Y262,24)","v":64.9},"cm2",null,"Sx =",{"$f":"VLOOKUP(AF12,calculations!B92:Y262,18)","v":{"v":896,"d":"896.0"}},"cm3",{"$nulls":6},"Destabilizing load:",true,{"$f":"IF(AF14=TRUE,1,0.925)","v":1},null,"UDL1d",{"$f":"3+IF(AG15=1,0.01*VLOOKUP(AF12,calculations!B92:Y262,3),0)","v":3.51}]
[null,null,"EFFECTIVE \nLENGTH [m] =",null,{"v":6,"d":"6.00"},null,null,"SAFETY FACTORS",{"$nulls":9},"weight =",{"$f":"VLOOKUP(AF12,calculations!B92:Y262,3)","v":{"v":51,"d":"51.0"}},"kg/m",null,"Sy =",{"$f":"VLOOKUP(AF12,calculations!B92:Y262,19)","v":{"v":174,"d":"174.0"}},"cm3",{"$nulls":6},"Include s/w:",true,{"$f":"IF(AF15=TRUE,1,0)","v":1}]
[{"$nulls":8},"γLL =",null,{"v":1.6,"d":"1.60"},{"$nulls":22},1,2,3,4]
[null,null,"Destabilizing load:",{"$nulls":5},"γDL =",null,{"v":1.4,"d":"1.40"},{"$nulls":19},"Classification:","ε",{"$f":"(275/fy)^0.5","v":{"v":0.7731921410338582,"d":"0.77"}},"plastic","compact","semi-compact","slender"]
[{"$nulls":31},"b/T",{"$f":"B/2/Tf","v":{"v":7.456521739130435,"d":"7.46"}},{"$f":"9*AG17","v":6.958729269304724},{"$f":"10*AG17","v":7.7319214103385825},{"$f":"15*AG17","v":11.597882115507874},null,{"$f":"IF(AG18>AJ18,4,IF(AG18>AI18,3,IF(AG18>AH18,2,1)))","v":2}]
[{"$nulls":31},"d/t",{"$f":"de/tw","v":{"v":42.10810810810811,"d":"42.11"}},{"$f":"IF(I8=\"PFC\",40,80)*AG17","v":61.85537128270866},{"$f":"IF(I8=\"PFC\",40,100)*AG17","v":77.31921410338583},{"$f":"IF(I8=\"PFC\",40,120)*AG17","v":92.78305692406299},null,{"$f":"IF(AG19>AJ19,4,IF(AG19>AI19,3,IF(AG19>AH19,2,1)))","v":1}]
[{"$nulls":31},"b/T","checks are in the hidden row!",{"$nulls":3},"Selected:",{"$f":"MAX(AL18,AL19)","v":2}]
[{"$nulls":30},"Applied shear:",{"$f":"AF60","v":45.28}]
[null,null,"LOADING",{"$nulls":27},"Shear capacity:",{"$f":"0.6*fy*tw*D/1000","v":{"v":725.052,"d":"725.05"}}]
[{"$nulls":4},"Dead",null,"Imposed",{"$nulls":3},"position from left",null,"length"]
[null,null,"UDL =",null,{"v":3,"d":"3.00"},null,{"v":2,"d":"2.00"},null,"kN/m"]
[null,null,"Partial UDL 'a' =",null,{"v":2,"d":"2.00"},null,{"v":1,"d":"1.00"},null,"kN/m",null,{"v":1,"d":"1.00"},"m",{"v":3,"d":"3.00"},"m",{"$nulls":16},"Applied moment:",{"$f":"AF59","v":92.03}]
[null,null,"Partial UDL 'b' =",{"$nulls":5},"kN/m",null,null,"m",null,"m",{"$nulls":17},1,2,3,4]
[null,null,"Point Load 'a' =",null,{"v":2,"d":"2.00"},null,{"v":2,"d":"2.00"},null,"kN",null,{"v":3,"d":"3.00"},"m","~~~~",{"$nulls":17},"Moment Capacity:","plastic","compact","semi-compact","slender"]
[null,null,"Point Load 'b' =",{"$nulls":5},"kN",null,null,"m","~~~~",{"$nulls":17},"Low shear",{"$f":"IF(AF21<(AF22*0.6),fy*Sx/1000,\"\")","v":412.16},{"$f":"AF28","v":412.16},{"$f":"IF(AF21<(AF22*0.6),fy*Zx/1000,\"\")","v":366.16},"ERROR",{"$f":"HLOOKUP(AL20,AF26:AI29,3)","v":412.16}]
[{"$nulls":30},"High shear",{"$f":"IF(AF21>(AF22*0.6),fy*(Sx-AF30*tw*D^2/4000)/1000,\"\")","v":""},{"$f":"AF29","v":""},{"$f":"IF(AF21>(AF22*0.6),fy*(Zx-AF30*tw*D^2/4000/1.5)/1000,\"\")","v":""},"ERROR",{"$f":"HLOOKUP(AL20,AF26:AI29,4)","v":""}]
[{"$nulls":30},"ρ",{"$f":"IF(AF21<0.6*AF22,\"\",IF(((2*AF21/AF22)-1)^2>1,1,((2*AF21/AF22)-1)^2))","v":""},null,null,"limiting Mc:",{"$f":"1.2*fy*Zx/1000","v":439.392}]
[{"$nulls":34},"selected:",{"$f":"MIN(AJ30,AJ28:AJ29)","v":412.16}]
[]
[]
[null,null,"SUMMARY OF RESULTS",{"$nulls":12},"REACTIONS",null,null,"Dead","Imposed","Total"]
[null,null,"Max Applied Moment =",{"$nulls":3},{"$f":"ROUND(AF59,2)&\" kNm\"","v":"92.03 kNm"},null,null,{"$f":"IF(AF59>I50,\"> \"&ROUND(I50,2),\"< \"&ROUND(I50,2))&\" kNm\"","v":"< 111.05 kNm"},null,null,{"$f":"IF(I50>AF59,\"OK\",\"NOT OK\")","v":"OK"},null,null,"Left Reaction =",null,null,{"$f":"RL1d","v":{"v":19.415,"d":"19.42"}},{"$f":"RL1l","v":{"v":11.3125,"d":"11.31"}},{"$f":"S35+T35","v":{"v":30.7275,"d":"30.73"}},null,"kN",{"$nulls":7},"Laterl torsional buckling"]
[null,null,"Max Applied Shear =",{"$nulls":3},{"$f":"AF60&\" kN\"","v":"45.28 kN"},null,null,{"$f":"IF(AF60>AF22,\"> \"&ROUND(AF22,2),\"< \"&ROUND(AF22,2))&\" kN\"","v":"< 725.05 kN"},null,null,{"$f":"IF(AF22>AF21,\"OK\",\"NOT OK\")","v":"OK"},null,null,"Right Reaction =",null,null,{"$f":"RR1d","v":{"v":16.665,"d":"16.67"}},{"$f":"RR1l","v":{"v":9.6875,"d":"9.69"}},{"$f":"S36+T36","v":{"v":26.3525,"d":"26.35"}},null,"kN"]
[null,null,"Max Deflection LL =",{"$nulls":3},{"$f":"AF61&\" mm\"","v":"5.22 mm"},null,null,{"$f":"IF(AF61>I63,\"> \"&ROUND(I63,2),\"< \"&ROUND(I63,2))&\" mm\"","v":"< 22.22 mm"},null,null,{"$f":"IF(AF61<I63,\"OK\",\"NOT OK\")","v":"OK"},null,null,"Left Reaction =",null,null,{"$f":"RL1d*K17","v":{"v":27.180999999999997,"d":"27.18"}},{"$f":"RL1l*K16","v":{"v":18.1,"d":"18.10"}},{"$f":"S37+T37","v":{"v":45.281,"d":"45.28"}},null,"kN",{"$nulls":7},"constants:"]
[null,null,"Max Deflection LL + DL=",{"$nulls":3},{"$f":"AF62&\" mm\"","v":"14.09 mm"},null,null,{"$f":"IF(AF62>I68,\"> \"&ROUND(I68,2),\"< \"&ROUND(I68,2))&\" mm\"","v":"< 25 mm"},null,null,{"$f":"IF(AF62<I68,\"OK\",\"NOT OK\")","v":"OK"},null,null,"Right Reaction =",null,null,{"$f":"RR1d*K17","v":{"v":23.330999999999996,"d":"23.33"}},{"$f":"RR1l*K16","v":{"v":15.5,"d":"15.50"}},{"$f":"S38+T38","v":{"v":38.830999999999996,"d":"38.83"}},null,"kN",{"$nulls":7},"J",{"$f":"VLOOKUP(AF12,calculations!B92:Y262,23)","v":{"v":23.8,"d":"23.80"}},"not used"]
[{"$nulls":30},"H",{"$f":"VLOOKUP(AF12,calculations!B92:Y262,22)","v":{"v":0.286,"d":"0.29"}},"not used"]
[{"$nulls":30},"x",{"$f":"VLOOKUP(AF12,calculations!B92:Y262,21)","v":{"v":32.1,"d":"32.10"}},"calcs for u and βw are in the hidden rows!"]
[{"$nulls":30},"u",{"$f":"VLOOKUP(AF12,calculations!B92:Y262,20)","v":0.88}]
[]
[{"$nulls":30},"βw",{"$f":"IF(OR(AL20=1,AL20=2),1,Zx/Sx)","v":{"v":1,"d":"1.00"}}]
[{"$nulls":30},"λ",{"$f":"_Le1*100/ry","v":{"v":155.44041450777203,"d":"155.44"}}]
[null,null,"DETAILED RESULTS: ",{"$nulls":5},"MOMENT (ULS)",{"$nulls":21},"v",{"$f":"1/((1+0.05*(AF44/x)^2)^(0.25))","v":{"v":0.8236893098113466,"d":"0.82"}}]
[null,null,"Maximum applied moment Mmax =",{"$nulls":5},{"$f":"AF59","v":92.03},null,"kNm",{"$nulls":19},"λLT",{"$f":"u*v*AF44*(AF43^0.5)","v":{"v":112.6704548135728,"d":"112.67"}}]
[null,null,"Moment capacity Mc =",{"$nulls":5},{"$f":"$AJ$31","v":412.16},null,"kNm",{"$nulls":19},"λ0",{"$f":"0.4*(PI()^2*E*1000/fy)^0.5","v":{"v":26.52820584059831,"d":"26.53"}}]
[null,null,{"$f":"IF(AND(_Le1>0,AF46>AF47),\"-- LTB considered as λLT > λ0 --\",IF(AND(_Le1>0,AF46<=AF47),\"-- LTB not considered as λLT < λ0 --\",\"-- LTB not considered --\"))","v":"-- LTB considered as λLT > λ0 --"},{"$nulls":27},"pE",{"$f":"PI()^2*E*1000/(AF46^2)","v":{"v":159.37988590611914,"d":"159.38"}}]
[null,null,"Buckling resistance moment Mb =",{"$nulls":5},{"$f":"IF(AND(_Le1>0,AF46>AF47),$AJ$56,IF(AND(_Le1>0,AF46<=AF47),\"N/A\",\"N/A\"))","v":{"v":111.04760663306672,"d":"111.05"}},null,{"$f":"IF(I49=\"N/A\",\"\",\"kNm\")","v":"kNm"},{"$nulls":19},"ŋLT",{"$f":"IF(7*(AF46-AF47)/1000<0,0,7*(AF46-AF47)/1000)","v":{"v":0.6029957428108216,"d":"0.60"}}]
[null,null,"Allowable moment =",{"$nulls":5},{"$f":"IF(AND(_Le1>0,AF46>AF47),AJ56,AJ31)","v":{"v":111.04760663306672,"d":"111.05"}},null,"kNm",{"$nulls":19},"ΦLT",{"$f":"(fy+(AF49+1)*AF48)/2","v":{"v":357.7426392985917,"d":"357.74"}}]
[null,null,"Usage factor =",{"$nulls":5},{"$f":"I46/I50","v":{"v":0.828743660402278,"d":"0.83"}},{"$nulls":21},"pb",{"$f":"AF48*fy/(AF50+(AF50^2-AF48*fy)^(0.5))","v":{"v":123.93706097440483,"d":"123.94"}}]
[{"$nulls":30},"mLT",{"$f":"AG14","v":{"v":1,"d":"1.000"}},"for destabilizing load"]
[null,null,"DETAILED RESULTS: ",{"$nulls":5},"SHEAR (ULS)"]
[null,null,"Maximum applied shear force Fv =",{"$nulls":5},{"$f":"AF60","v":45.28},null,"kN",{"$nulls":20},1,2,3,4]
[null,null,"Shear capacity Pv =",{"$nulls":5},{"$f":"AF22","v":{"v":725.052,"d":"725.05"}},null,"kN",{"$nulls":20},"plastic","compact","semi-compact","slender"]
[null,null,{"$f":"IF(I57<0.6,\"-- Low shear present --\",\"-- High shear present --\")","v":"-- Low shear present --"},{"$nulls":27},"Mb:",{"$f":"AF51*Sx/(1000*mLT)","v":{"v":111.04760663306672,"d":"111.05"}},{"$f":"AF56","v":{"v":111.04760663306672,"d":"111.05"}},{"$f":"AF51*Zx/(1000*mLT)","v":{"v":98.65390053562625,"d":"98.65"}},"ERROR",{"$f":"HLOOKUP(AL20,AF54:AI56,3)","v":{"v":111.04760663306672,"d":"111.05"}}]
[null,null,"Usage factor =",{"$nulls":5},{"$f":"I54/I55","v":{"v":0.06245069319166074,"d":"0.06"}}]
[]
[{"$nulls":30},"Max Moment:",{"$f":"ROUND(-MIN(calculations!C81:CY81),2)","v":92.03}]
[{"$nulls":30},"Max Shear:",{"$f":"ABS(ROUND(IF(MAX(calculations!C83:CY83)>ABS(MIN(calculations!C83:CY83)),MAX(calculations!C83:CY83),MIN(calculations!C83:CY83)),2))","v":45.28}]
[null,null,"DETAILED RESULTS: ",{"$nulls":5},"DEFLECTION (SLS)",{"$nulls":21},"Max Deflection LL:",{"$f":"ROUND(-MIN(calculations!C84:CY84),2)","v":5.22}]
[null,null,"Actual deflection LL =",{"$nulls":5},{"$f":"AF61","v":5.22},null,"mm",{"$f":"\"(L/\"&ROUND(8*1000/I62,0)&\")\"","v":"(L/1533)"},{"$nulls":18},"Max Deflection LL + DL:",{"$f":"ROUND(-MIN(calculations!C85:CY85),2)","v":14.09}]
[null,null,"Allowable deflection LL =",{"$nulls":5},{"$f":"8*1000/360","v":{"v":22.22222222222222,"d":"22.22"}},null,"mm","(L/360)",{"$nulls":20},"Selected:"]
[null,null,"Usage factor =",{"$nulls":5},{"$f":"I62/I63","v":{"v":0.2349,"d":"0.23"}},{"$nulls":21},"deflection diagram:","LL",{"$f":"S68","v":"LL+DL"},{"$f":"IF(AG64=\"LL+DL\",1,0)","v":1}]
[{"$nulls":31},"LL+DL"]
[null,null,"DETAILED RESULTS:",{"$nulls":5},"DEFLECTION (SLS)"]
[null,null,"Actual deflection LL+DL= ",{"$nulls":5},{"$f":"AF62","v":14.09},null,"mm",{"$f":"\"(L/\"&ROUND(8*1000/I67,0)&\")\"","v":"(L/568)"}]
[null,null,"Allowable deflection LL+DL =",{"$nulls":5},{"$f":"IF(L68=\"(L/200)\",8*1000/200,IF(L68=\"(L/250)\",8*1000/250,IF(L68=\"(L/200) or 25\",MIN((8*1000/200),25),MIN((8*1000/250),25))))","v":{"v":25,"d":"25.00"}},null,"mm","(L/250) or 25",{"$nulls":5},"show","LL+DL","deflection diagram"]
[null,null,"Usage factor =",{"$nulls":5},{"$f":"I67/I68","v":{"v":0.5636,"d":"0.56"}}]
[]
[null,null,"Spreadsheet provided by: www.YourSpreadsheets.co.uk",{"$nulls":20},"calculations are based on BS5950:1-2000"]

{"sheet":"calculations","index":1,"n_rows":262,"n_cols":105,"rows_kept":262,"hidden":true,"merged":[[41,1,43,1]]}
[]
[null,null,"LOADING DIAGRAM"]
[]
[null,"Beam",0.1,{"$f":"0.1+8","v":8.1}]
[null,null,0,0]
[]
[null,"Supports",0.1,{"$f":"C7","v":0.1},{"$f":"0.1+8","v":8.1},{"$f":"E7","v":8.1}]
[null,null,{"$f":"C9","v":-1.9020000000000001},0,{"$f":"C8","v":-1.9020000000000001},0]
[null,null,{"$f":"-0.2*MAX(SUM(UDL1d,2,PUDL1d,PUDL1l),SUM(UDL1d,2,PLa1d,PLa1l),SUM(UDL1d,2,PLb1d,PLb1l))","v":-1.9020000000000001}]
[null,"UDL",0.1,0.1,{"$f":"IF(OR(UDL1d>0,2>0),0.1+8,0)","v":8.1},{"$f":"IF(OR(UDL1d>0,2>0),0.1+8,0)","v":8.1}]
[null,"Dead",0,{"$f":"UDL1d","v":3.51},{"$f":"UDL1d","v":3.51},0]
[null,"Live",{"$f":"IF(2>0,UDL1d,0)","v":3.51},{"$f":"IF(2>0,UDL1d+2,0)","v":5.51},{"$f":"IF(2>0,UDL1d+2,0)","v":5.51},{"$f":"IF(2>0,UDL1d,0)","v":3.51}]
[]
[null,"PUDL a",{"$f":"IF(OR(PUDL1d>0,PUDL1l>0),0.1+PosPUDL1,0)","v":1.1},{"$f":"IF(OR(PUDL1d>0,PUDL1l>0),0.1+PosPUDL1,0)","v":1.1},{"$f":"IF(OR(PUDL1d>0,PUDL1l>0),0.1+PosPUDL1+3,0)","v":4.1},{"$f":"IF(OR(PUDL1d>0,PUDL1l>0),0.1+PosPUDL1+3,0)","v":4.1}]
[null,"Dead",{"$f":"UDL1d+2","v":5.51},{"$f":"UDL1d+2+PUDL1d","v":7.51},{"$f":"UDL1d+2+PUDL1d","v":7.51},{"$f":"UDL1d+2","v":5.51}]
[null,"Live",{"$f":"UDL1d+2+PUDL1d","v":7.51},{"$f":"UDL1d+2+PUDL1d+PUDL1l","v":8.51},{"$f":"UDL1d+2+PUDL1d+PUDL1l","v":8.51},{"$f":"UDL1d+2+PUDL1d","v":7.51}]
[]
[null,"PUDL b",{"$f":"IF(OR(PUDL2d>0,PUDL2l>0),0.1+PosPUDL2,0)","v":0},{"$f":"IF(OR(PUDL2d>0,PUDL2l>0),0.1+PosPUDL2,0)","v":0},{"$f":"IF(OR(PUDL2d>0,PUDL2l>0),0.1+PosPUDL2+LePUDL2,0)","v":0},{"$f":"IF(OR(PUDL2d>0,PUDL2l>0),0.1+PosPUDL2+LePUDL2,0)","v":0}]
[null,"Dead",{"$f":"UDL1d+2","v":5.51},{"$f":"UDL1d+2+PUDL2d","v":5.51},{"$f":"UDL1d+2+PUDL2d","v":5.51},{"$f":"UDL1d+2","v":5.51}]
[null,"Live",{"$f":"UDL1d+2+PUDL2d","v":5.51},{"$f":"UDL1d+2+PUDL2d+PUDL2l","v":5.51},{"$f":"UDL1d+2+PUDL2d+PUDL2l","v":5.51},{"$f":"UDL1d+2+PUDL2d","v":5.51}]
[]
[null,"LL a",{"$f":"IF(OR(PLa1d>0,PLa1l>0),0.1+PosPLa1,0)","v":3.1},{"$f":"IF(OR(PLa1d>0,PLa1l>0),0.1+PosPLa1,0)","v":3.1}]
[null,"Dead",{"$f":"IF(PLa1d>0,UDL1d+2,0)","v":5.51},{"$f":"IF(PLa1d>0,UDL1d+2+PLa1d,0)","v":7.51}]
[null,"Live",{"$f":"IF(PLa1l>0,UDL1d+2+PLa1d,0)","v":7.51},{"$f":"IF(PLa1l>0,UDL1d+2+PLa1d+PLa1l,0)","v":9.51}]
[]
[null,"LL b",{"$f":"IF(OR(PLb1d>0,PLb1l>0),0.1+PosPLb1,0)","v":0},{"$f":"IF(OR(PLb1d>0,PLb1l>0),0.1+PosPLb1,0)","v":0}]
[null,"Dead",{"$f":"IF(PLb1d>0,UDL1d+2,0)","v":0},{"$f":"IF(PLb1d>0,UDL1d+2+PLb1d,0)","v":0}]
[null,"Live",{"$f":"IF(PLb1l>0,UDL1d+2+PLb1d,0)","v":0},{"$f":"IF(PLb1l>0,UDL1d+2+PLb1d+PLb1l,0)","v":0}]
[]
[]
[null,null,"MOMENT AND SHEAR CALCULATIONS"]
[]
[null,"Step",{"v":0,"d":"0.0"},{"$f":"8/100","v":{"v":0.08,"d":"0.1"}},{"$f":"D33+8/100","v":{"v":0.16,"d":"0.2"}},{"$f":"E33+8/100","v":{"v":0.24,"d":"0.2"}},{"$f":"F33+8/100","v":{"v":0.32,"d":"0.3"}},{"$f":"G33+8/100","v":0.4},{"$f":"H33+8/100","v":{"v":0.48000000000000004,"d":"0.5"}},{"$f":"I33+8/100","v":{"v":0.56,"d":"0.6"}},{"$f":"J33+8/100","v":{"v":0.64,"d":"0.6"}},{"$f":"K33+8/100","v":{"v":0.72,"d":"0.7"}},{"$f":"L33+8/100","v":{"v":0.7999999999999999,"d":"0.8"}},{"$f":"M33+8/100","v":{"v":0.8799999999999999,"d":"0.9"}},{"$f":"N33+8/100","v":{"v":0.9599999999999999,"d":"1.0"}},{"$f":"O33+8/100","v":{"v":1.0399999999999998,"d":"1.0"}},{"$f":"P33+8/100","v":{"v":1.1199999999999999,"d":"1.1"}},{"$f":"Q33+8/100","v":1.2},{"$f":"R33+8/100","v":{"v":1.28,"d":"1.3"}},{"$f":"S33+8/100","v":{"v":1.36,"d":"1.4"}},{"$f":"T33+8/100","v":{"v":1.4400000000000002,"d":"1.4"}},{"$f":"U33+8/100","v":{"v":1.5200000000000002,"d":"1.5"}},{"$f":"V33+8/100","v":{"v":1.6000000000000003,"d":"1.6"}},{"$f":"W33+8/100","v":{"v":1.6800000000000004,"d":"1.7"}},{"$f":"X33+8/100","v":{"v":1.7600000000000005,"d":"1.8"}},{"$f":"Y33+8/100","v":{"v":1.8400000000000005,"d":"1.8"}},{"$f":"Z33+8/100","v":{"v":1.9200000000000006,"d":"1.9"}},{"$f":"AA33+8/100","v":{"v":2.0000000000000004,"d":"2.0"}},{"$f":"AB33+8/100","v":{"v":2.0800000000000005,"d":"2.1"}},{"$f":"AC33+8/100","v":{"v":2.1600000000000006,"d":"2.2"}},{"$f":"AD33+8/100","v":{"v":2.2400000000000007,"d":"2.2"}},{"$f":"AE33+8/100","v":{"v":2.3200000000000007,"d":"2.3"}},{"$f":"AF33+8/100","v":{"v":2.400000000000001,"d":"2.4"}},{"$f":"AG33+8/100","v":{"v":2.480000000000001,"d":"2.5"}},{"$f":"AH33+8/100","v":{"v":2.560000000000001,"d":"2.6"}},{"$f":"AI33+8/100","v":{"v":2.640000000000001,"d":"2.6"}},{"$f":"AJ33+8/100","v":{"v":2.720000000000001,"d":"2.7"}},{"$f":"AK33+8/100","v":{"v":2.800000000000001,"d":"2.8"}},{"$f":"AL33+8/100","v":{"v":2.8800000000000012,"d":"2.9"}},{"$f":"AM33+8/100","v":{"v":2.9600000000000013,"d":"3.0"}},{"$f":"AN33+8/100","v":{"v":3.0400000000000014,"d":"3.0"}},{"$f":"AO33+8/100","v":{"v":3.1200000000000014,"d":"3.1"}},{"$f":"AP33+8/100","v":{"v":3.2000000000000015,"d":"3.2"}},{"$f":"AQ33+8/100","v":{"v":3.2800000000000016,"d":"3.3"}},{"$f":"AR33+8/100","v":{"v":3.3600000000000017,"d":"3.4"}},{"$f":"AS33+8/100","v":{"v":3.4400000000000017,"d":"3.4"}},{"$f":"AT33+8/100","v":{"v":3.520000000000002,"d":"3.5"}},{"$f":"AU33+8/100","v":{"v":3.600000000000002,"d":"3.6"}},{"$f":"AV33+8/100","v":{"v":3.680000000000002,"d":"3.7"}},{"$f":"AW33+8/100","v":{"v":3.760000000000002,"d":"3.8"}},{"$f":"AX33+8/100","v":{"v":3.840000000000002,"d":"3.8"}},{"$f":"AY33+8/100","v":{"v":3.920000000000002,"d":"3.9"}},{"$f":"AZ33+8/100","v":{"v":4.000000000000002,"d":"4.0"}},{"$f":"BA33+8/100","v":{"v":4.080000000000002,"d":"4.1"}},{"$f":"BB33+8/100","v":{"v":4.160000000000002,"d":"4.2"}},{"$f":"BC33+8/100","v":{"v":4.240000000000002,"d":"4.2"}},{"$f":"BD33+8/100","v":{"v":4.320000000000002,"d":"4.3"}},{"$f":"BE33+8/100","v":{"v":4.400000000000002,"d":"4.4"}},{"$f":"BF33+8/100","v":{"v":4.480000000000002,"d":"4.5"}},{"$f":"BG33+8/100","v":{"v":4.560000000000002,"d":"4.6"}},{"$f":"BH33+8/100","v":{"v":4.640000000000002,"d":"4.6"}},{"$f":"BI33+8/100","v":{"v":4.720000000000002,"d":"4.7"}},{"$f":"BJ33+8/100","v":{"v":4.8000000000000025,"d":"4.8"}},{"$f":"BK33+8/100","v":{"v":4.880000000000003,"d":"4.9"}},{"$f":"BL33+8/100","v":{"v":4.960000000000003,"d":"5.0"}},{"$f":"BM33+8/100","v":{"v":5.040000000000003,"d":"5.0"}},{"$f":"BN33+8/100","v":{"v":5.120000000000003,"d":"5.1"}},{"$f":"BO33+8/100","v":{"v":5.200000000000003,"d":"5.2"}},{"$f":"BP33+8/100","v":{"v":5.280000000000003,"d":"5.3"}},{"$f":"BQ33+8/100","v":{"v":5.360000000000003,"d":"5.4"}},{"$f":"BR33+8/100","v":{"v":5.440000000000003,"d":"5.4"}},{"$f":"BS33+8/100","v":{"v":5.520000000000003,"d":"5.5"}},{"$f":"BT33+8/100","v":{"v":5.600000000000003,"d":"5.6"}},{"$f":"BU33+8/100","v":{"v":5.680000000000003,"d":"5.7"}},{"$f":"BV33+8/100","v":{"v":5.760000000000003,"d":"5.8"}},{"$f":"BW33+8/100","v":{"v":5.840000000000003,"d":"5.8"}},{"$f":"BX33+8/100","v":{"v":5.9200000000000035,"d":"5.9"}},{"$f":"BY33+8/100","v":{"v":6.0000000000000036,"d":"6.0"}},{"$f":"BZ33+8/100","v":{"v":6.080000000000004,"d":"6.1"}},{"$f":"CA33+8/100","v":{"v":6.160000000000004,"d":"6.2"}},{"$f":"CB33+8/100","v":{"v":6.240000000000004,"d":"6.2"}},{"$f":"CC33+8/100","v":{"v":6.320000000000004,"d":"6.3"}},{"$f":"CD33+8/100","v":{"v":6.400000000000004,"d":"6.4"}},{"$f":"CE33+8/100","v":{"v":6.480000000000004,"d":"6.5"}},{"$f":"CF33+8/100","v":{"v":6.560000000000004,"d":"6.6"}},{"$f":"CG33+8/100","v":{"v":6.640000000000004,"d":"6.6"}},{"$f":"CH33+8/100","v":{"v":6.720000000000004,"d":"6.7"}},{"$f":"CI33+8/100","v":{"v":6.800000000000004,"d":"6.8"}},{"$f":"CJ33+8/100","v":{"v":6.880000000000004,"d":"6.9"}},{"$f":"CK33+8/100","v":{"v":6.960000000000004,"d":"7.0"}},{"$f":"CL33+8/100","v":{"v":7.0400000000000045,"d":"7.0"}},{"$f":"CM33+8/100","v":{"v":7.1200000000000045,"d":"7.1"}},{"$f":"CN33+8/100","v":{"v":7.200000000000005,"d":"7.2"}},{"$f":"CO33+8/100","v":{"v":7.280000000000005,"d":"7.3"}},{"$f":"CP33+8/100","v":{"v":7.360000000000005,"d":"7.4"}},{"$f":"CQ33+8/100","v":{"v":7.440000000000005,"d":"7.4"}},{"$f":"CR33+8/100","v":{"v":7.520000000000005,"d":"7.5"}},{"$f":"CS33+8/100","v":{"v":7.600000000000005,"d":"7.6"}},{"$f":"CT33+8/100","v":{"v":7.680000000000005,"d":"7.7"}},{"$f":"CU33+8/100","v":{"v":7.760000000000005,"d":"7.8"}},{"$f":"CV33+8/100","v":{"v":7.840000000000005,"d":"7.8"}},{"$f":"CW33+8/100","v":{"v":7.920000000000005,"d":"7.9"}},{"$f":"CX33+8/100","v":{"v":8.000000000000005,"d":"8.0"}}]
[null,"Moment dead [kNm]",{"v":0,"d":"0.00"},{"$f":"-RL1d*D33+UDL1d*D33^2/2+IF(D33>PosPUDL1,PUDL1d*(D33-PosPUDL1)^2/2,0)+IF(D33>(PosPUDL1+3),-PUDL1d*(D33-PosPUDL1-3)^2/2,0)+IF(D33>PosPUDL2,PUDL2d*(D33-PosPUDL2)^2/2,0)+IF(D33>(PosPUDL2+LePUDL2),-PUDL2d*(D33-PosPUDL2-LePUDL2)^2/2,0)+IF(D33>PosPLa1,PLa1d*(D33-PosPLa1),0)+IF(D33>PosPLb1,PLb1d*(D33-PosPLb1),0)","v":{"v":-1.541968,"d":"-1.54"}},{"$f":"-RL1d*E33+UDL1d*E33^2/2+IF(E33>PosPUDL1,PUDL1d*(E33-PosPUDL1)^2/2,0)+IF(E33>(PosPUDL1+3),-PUDL1d*(E33-PosPUDL1-3)^2/2,0)+IF(E33>PosPUDL2,PUDL2d*(E33-PosPUDL2)^2/2,0)+IF(E33>(PosPUDL2+LePUDL2),-PUDL2d*(E33-PosPUDL2-LePUDL2)^2/2,0)+IF(E33>PosPLa1,PLa1d*(E33-PosPLa1),0)+IF(E33>PosPLb1,PLb1d*(E33-PosPLb1),0)","v":{"v":-3.0614719999999997,"d":"-3.06"}},{"$f":"-RL1d*F33+UDL1d*F33^2/2+IF(F33>PosPUDL1,PUDL1d*(F33-PosPUDL1)^2/2,0)+IF(F33>(PosPUDL1+3),-PUDL1d*(F33-PosPUDL1-3)^2/2,0)+IF(F33>PosPUDL2,PUDL2d*(F33-PosPUDL2)^2/2,0)+IF(F33>(PosPUDL2+LePUDL2),-PUDL2d*(F33-PosPUDL2-LePUDL2)^2/2,0)+IF(F33>PosPLa1,PLa1d*(F33-PosPLa1),0)+IF(F33>PosPLb1,PLb1d*(F33-PosPLb1),0)","v":{"v":-4.5585119999999995,"d":"-4.56"}},{"$f":"-RL1d*G33+UDL1d*G33^2/2+IF(G33>PosPUDL1,PUDL1d*(G33-PosPUDL1)^2/2,0)+IF(G33>(PosPUDL1+3),-PUDL1d*(G33-PosPUDL1-3)^2/2,0)+IF(G33>PosPUDL2,PUDL2d*(G33-PosPUDL2)^2/2,0)+IF(G33>(PosPUDL2+LePUDL2),-PUDL2d*(G33-PosPUDL2-LePUDL2)^2/2,0)+IF(G33>PosPLa1,PLa1d*(G33-PosPLa1),0)+IF(G33>PosPLb1,PLb1d*(G33-PosPLb1),0)","v":{"v":-6.033087999999999,"d":"-6.03"}},{"$f":"-RL1d*H33+UDL1d*H33^2/2+IF(H33>PosPUDL1,PUDL1d*(H33-PosPUDL1)^2/2,0)+IF(H33>(PosPUDL1+3),-PUDL1d*(H33-PosPUDL1-3)^2/2,0)+IF(H33>PosPUDL2,PUDL2d*(H33-PosPUDL2)^2/2,0)+IF(H33>(PosPUDL2+LePUDL2),-PUDL2d*(H33-PosPUDL2-LePUDL2)^2/2,0)+IF(H33>PosPLa1,PLa1d*(H33-PosPLa1),0)+IF(H33>PosPLb1,PLb1d*(H33-PosPLb1),0)","v":{"v":-7.4852,"d":"-7.49"}},{"$f":"-RL1d*I33+UDL1d*I33^2/2+IF(I33>PosPUDL1,PUDL1d*(I33-PosPUDL1)^2/2,0)+IF(I33>(PosPUDL1+3),-PUDL1d*(I33-PosPUDL1-3)^2/2,0)+IF(I33>PosPUDL2,PUDL2d*(I33-PosPUDL2)^2/2,0)+IF(I33>(PosPUDL2+LePUDL2),-PUDL2d*(I33-PosPUDL2-LePUDL2)^2/2,0)+IF(I33>PosPLa1,PLa1d*(I33-PosPLa1),0)+IF(I33>PosPLb1,PLb1d*(I33-PosPLb1),0)","v":{"v":-8.914848000000001,"d":"-8.91"}},{"$f":"-RL1d*J33+UDL1d*J33^2/2+IF(J33>PosPUDL1,PUDL1d*(J33-PosPUDL1)^2/2,0)+IF(J33>(PosPUDL1+3),-PUDL1d*(J33-PosPUDL1-3)^2/2,0)+IF(J33>PosPUDL2,PUDL2d*(J33-PosPUDL2)^2/2,0)+IF(J33>(PosPUDL2+LePUDL2),-PUDL2d*(J33-PosPUDL2-LePUDL2)^2/2,0)+IF(J33>PosPLa1,PLa1d*(J33-PosPLa1),0)+IF(J33>PosPLb1,PLb1d*(J33-PosPLb1),0)","v":{"v":-10.322032,"d":"-10.32"}},{"$f":"-RL1d*K33+UDL1d*K33^2/2+IF(K33>PosPUDL1,PUDL1d*(K33-PosPUDL1)^2/2,0)+IF(K33>(PosPUDL1+3),-PUDL1d*(K33-PosPUDL1-3)^2/2,0)+IF(K33>PosPUDL2,PUDL2d*(K33-PosPUDL2)^2/2,0)+IF(K33>(PosPUDL2+LePUDL2),-PUDL2d*(K33-PosPUDL2-LePUDL2)^2/2,0)+IF(K33>PosPLa1,PLa1d*(K33-PosPLa1),0)+IF(K33>PosPLb1,PLb1d*(K33-PosPLb1),0)","v":{"v":-11.706752,"d":"-11.71"}},{"$f":"-RL1d*L33+UDL1d*L33^2/2+IF(L33>PosPUDL1,PUDL1d*(L33-PosPUDL1)^2/2,0)+IF(L33>(PosPUDL1+3),-PUDL1d*(L33-PosPUDL1-3)^2/2,0)+IF(L33>PosPUDL2,PUDL2d*(L33-PosPUDL2)^2/2,0)+IF(L33>(PosPUDL2+LePUDL2),-PUDL2d*(L33-PosPUDL2-LePUDL2)^2/2,0)+IF(L33>PosPLa1,PLa1d*(L33-PosPLa1),0)+IF(L33>PosPLb1,PLb1d*(L33-PosPLb1),0)","v":{"v":-13.069008,"d":"-13.07"}},{"$f":"-RL1d*M33+UDL1d*M33^2/2+IF(M33>PosPUDL1,PUDL1d*(M33-PosPUDL1)^2/2,0)+IF(M33>(PosPUDL1+3),-PUDL1d*(M33-PosPUDL1-3)^2/2,0)+IF(M33>PosPUDL2,PUDL2d*(M33-PosPUDL2)^2/2,0)+IF(M33>(PosPUDL2+LePUDL2),-PUDL2d*(M33-PosPUDL2-LePUDL2)^2/2,0)+IF(M33>PosPLa1,PLa1d*(M33-PosPLa1),0)+IF(M33>PosPLb1,PLb1d*(M33-PosPLb1),0)","v":{"v":-14.4088,"d":"-14.41"}},{"$f":"-RL1d*N33+UDL1d*N33^2/2+IF(N33>PosPUDL1,PUDL1d*(N33-PosPUDL1)^2/2,0)+IF(N33>(PosPUDL1+3),-PUDL1d*(N33-PosPUDL1-3)^2/2,0)+IF(N33>PosPUDL2,PUDL2d*(N33-PosPUDL2)^2/2,0)+IF(N33>(PosPUDL2+LePUDL2),-PUDL2d*(N33-PosPUDL2-LePUDL2)^2/2,0)+IF(N33>PosPLa1,PLa1d*(N33-PosPLa1),0)+IF(N33>PosPLb1,PLb1d*(N33-PosPLb1),0)","v":{"v":-15.726127999999997,"d":"-15.73"}},{"$f":"-RL1d*O33+UDL1d*O33^2/2+IF(O33>PosPUDL1,PUDL1d*(O33-PosPUDL1)^2/2,0)+IF(O33>(PosPUDL1+3),-PUDL1d*(O33-PosPUDL1-3)^2/2,0)+IF(O33>PosPUDL2,PUDL2d*(O33-PosPUDL2)^2/2,0)+IF(O33>(PosPUDL2+LePUDL2),-PUDL2d*(O33-PosPUDL2-LePUDL2)^2/2,0)+IF(O33>PosPLa1,PLa1d*(O33-PosPLa1),0)+IF(O33>PosPLb1,PLb1d*(O33-PosPLb1),0)","v":{"v":-17.020991999999996,"d":"-17.02"}},{"$f":"-RL1d*P33+UDL1d*P33^2/2+IF(P33>PosPUDL1,PUDL1d*(P33-PosPUDL1)^2/2,0)+IF(P33>(PosPUDL1+3),-PUDL1d*(P33-PosPUDL1-3)^2/2,0)+IF(P33>PosPUDL2,PUDL2d*(P33-PosPUDL2)^2/2,0)+IF(P33>(PosPUDL2+LePUDL2),-PUDL2d*(P33-PosPUDL2-LePUDL2)^2/2,0)+IF(P33>PosPLa1,PLa1d*(P33-PosPLa1),0)+IF(P33>PosPLb1,PLb1d*(P33-PosPLb1),0)","v":{"v":-18.291791999999994,"d":"-18.29"}},{"$f":"-RL1d*Q33+UDL1d*Q33^2/2+IF(Q33>PosPUDL1,PUDL1d*(Q33-PosPUDL1)^2/2,0)+IF(Q33>(PosPUDL1+3),-PUDL1d*(Q33-PosPUDL1-3)^2/2,0)+IF(Q33>PosPUDL2,PUDL2d*(Q33-PosPUDL2)^2/2,0)+IF(Q33>(PosPUDL2+LePUDL2),-PUDL2d*(Q33-PosPUDL2-LePUDL2)^2/2,0)+IF(Q33>PosPLa1,PLa1d*(Q33-PosPLa1),0)+IF(Q33>PosPLb1,PLb1d*(Q33-PosPLb1),0)","v":{"v":-19.528928,"d":"-19.53"}},{"$f":"-RL1d*R33+UDL1d*R33^2/2+IF(R33>PosPUDL1,PUDL1d*(R33-PosPUDL1)^2/2,0)+IF(R33>(PosPUDL1+3),-PUDL1d*(R33-PosPUDL1-3)^2/2,0)+IF(R33>PosPUDL2,PUDL2d*(R33-PosPUDL2)^2/2,0)+IF(R33>(PosPUDL2+LePUDL2),-PUDL2d*(R33-PosPUDL2-LePUDL2)^2/2,0)+IF(R33>PosPLa1,PLa1d*(R33-PosPLa1),0)+IF(R33>PosPLb1,PLb1d*(R33-PosPLb1),0)","v":{"v":-20.7308,"d":"-20.73"}},{"$f":"-RL1d*S33+UDL1d*S33^2/2+IF(S33>PosPUDL1,PUDL1d*(S33-PosPUDL1)^2/2,0)+IF(S33>(PosPUDL1+3),-PUDL1d*(S33-PosPUDL1-3)^2/2,0)+IF(S33>PosPUDL2,PUDL2d*(S33-PosPUDL2)^2/2,0)+IF(S33>(PosPUDL2+LePUDL2),-PUDL2d*(S33-PosPUDL2-LePUDL2)^2/2,0)+IF(S33>PosPLa1,PLa1d*(S33-PosPLa1),0)+IF(S33>PosPLb1,PLb1d*(S33-PosPLb1),0)","v":{"v":-21.897408,"d":"-21.90"}},{"$f":"-RL1d*T33+UDL1d*T33^2/2+IF(T33>PosPUDL1,PUDL1d*(T33-PosPUDL1)^2/2,0)+IF(T33>(PosPUDL1+3),-PUDL1d*(T33-PosPUDL1-3)^2/2,0)+IF(T33>PosPUDL2,PUDL2d*(T33-PosPUDL2)^2/2,0)+IF(T33>(PosPUDL2+LePUDL2),-PUDL2d*(T33-PosPUDL2-LePUDL2)^2/2,0)+IF(T33>PosPLa1,PLa1d*(T33-PosPLa1),0)+IF(T33>PosPLb1,PLb1d*(T33-PosPLb1),0)","v":{"v":-23.028751999999997,"d":"-23.03"}},{"$f":"-RL1d*U33+UDL1d*U33^2/2+IF(U33>PosPUDL1,PUDL1d*(U33-PosPUDL1)^2/2,0)+IF(U33>(PosPUDL1+3),-PUDL1d*(U33-PosPUDL1-3)^2/2,0)+IF(U33>PosPUDL2,PUDL2d*(U33-PosPUDL2)^2/2,0)+IF(U33>(PosPUDL2+LePUDL2),-PUDL2d*(U33-PosPUDL2-LePUDL2)^2/2,0)+IF(U33>PosPLa1,PLa1d*(U33-PosPLa1),0)+IF(U33>PosPLb1,PLb1d*(U33-PosPLb1),0)","v":{"v":-24.124832,"d":"-24.12"}},{"$f":"-RL1d*V33+UDL1d*V33^2/2+IF(V33>PosPUDL1,PUDL1d*(V33-PosPUDL1)^2/2,0)+IF(V33>(PosPUDL1+3),-PUDL1d*(V33-PosPUDL1-3)^2/2,0)+IF(V33>PosPUDL2,PUDL2d*(V33-PosPUDL2)^2/2,0)+IF(V33>(PosPUDL2+LePUDL2),-PUDL2d*(V33-PosPUDL2-LePUDL2)^2/2,0)+IF(V33>PosPLa1,PLa1d*(V33-PosPLa1),0)+IF(V33>PosPLb1,PLb1d*(V33-PosPLb1),0)","v":{"v":-25.185648000000004,"d":"-25.19"}},{"$f":"-RL1d*W33+UDL1d*W33^2/2+IF(W33>PosPUDL1,PUDL1d*(W33-PosPUDL1)^2/2,0)+IF(W33>(PosPUDL1+3),-PUDL1d*(W33-PosPUDL1-3)^2/2,0)+IF(W33>PosPUDL2,PUDL2d*(W33-PosPUDL2)^2/2,0)+IF(W33>(PosPUDL2+LePUDL2),-PUDL2d*(W33-PosPUDL2-LePUDL2)^2/2,0)+IF(W33>PosPLa1,PLa1d*(W33-PosPLa1),0)+IF(W33>PosPLb1,PLb1d*(W33-PosPLb1),0)","v":{"v":-26.2112,"d":"-26.21"}},{"$f":"-RL1d*X33+UDL1d*X33^2/2+IF(X33>PosPUDL1,PUDL1d*(X33-PosPUDL1)^2/2,0)+IF(X33>(PosPUDL1+3),-PUDL1d*(X33-PosPUDL1-3)^2/2,0)+IF(X33>PosPUDL2,PUDL2d*(X33-PosPUDL2)^2/2,0)+IF(X33>(PosPUDL2+LePUDL2),-PUDL2d*(X33-PosPUDL2-LePUDL2)^2/2,0)+IF(X33>PosPLa1,PLa1d*(X33-PosPLa1),0)+IF(X33>PosPLb1,PLb1d*(X33-PosPLb1),0)","v":{"v":-27.201488,"d":"-27.20"}},{"$f":"-RL1d*Y33+UDL1d*Y33^2/2+IF(Y33>PosPUDL1,PUDL1d*(Y33-PosPUDL1)^2/2,0)+IF(Y33>(PosPUDL1+3),-PUDL1d*(Y33-PosPUDL1-3)^2/2,0)+IF(Y33>PosPUDL2,PUDL2d*(Y33-PosPUDL2)^2/2,0)+IF(Y33>(PosPUDL2+LePUDL2),-PUDL2d*(Y33-PosPUDL2-LePUDL2)^2/2,0)+IF(Y33>PosPLa1,PLa1d*(Y33-PosPLa1),0)+IF(Y33>PosPLb1,PLb1d*(Y33-PosPLb1),0)","v":{"v":-28.156512000000003,"d":"-28.16"}},{"$f":"-RL1d*Z33+UDL1d*Z33^2/2+IF(Z33>PosPUDL1,PUDL1d*(Z33-PosPUDL1)^2/2,0)+IF(Z33>(PosPUDL1+3),-PUDL1d*(Z33-PosPUDL1-3)^2/2,0)+IF(Z33>PosPUDL2,PUDL2d*(Z33-PosPUDL2)^2/2,0)+IF(Z33>(PosPUDL2+LePUDL2),-PUDL2d*(Z33-PosPUDL2-LePUDL2)^2/2,0)+IF(Z33>PosPLa1,PLa1d*(Z33-PosPLa1),0)+IF(Z33>PosPLb1,PLb1d*(Z33-PosPLb1),0)","v":{"v":-29.076272000000007,"d":"-29.08"}},{"$f":"-RL1d*AA33+UDL1d*AA33^2/2+IF(AA33>PosPUDL1,PUDL1d*(AA33-PosPUDL1)^2/2,0)+IF(AA33>(PosPUDL1+3),-PUDL1d*(AA33-PosPUDL1-3)^2/2,0)+IF(AA33>PosPUDL2,PUDL2d*(AA33-PosPUDL2)^2/2,0)+IF(AA33>(PosPUDL2+LePUDL2),-PUDL2d*(AA33-PosPUDL2-LePUDL2)^2/2,0)+IF(AA33>PosPLa1,PLa1d*(AA33-PosPLa1),0)+IF(AA33>PosPLb1,PLb1d*(AA33-PosPLb1),0)","v":{"v":-29.960768,"d":"-29.96"}},{"$f":"-RL1d*AB33+UDL1d*AB33^2/2+IF(AB33>PosPUDL1,PUDL1d*(AB33-PosPUDL1)^2/2,0)+IF(AB33>(PosPUDL1+3),-PUDL1d*(AB33-PosPUDL1-3)^2/2,0)+IF(AB33>PosPUDL2,PUDL2d*(AB33-PosPUDL2)^2/2,0)+IF(AB33>(PosPUDL2+LePUDL2),-PUDL2d*(AB33-PosPUDL2-LePUDL2)^2/2,0)+IF(AB33>PosPLa1,PLa1d*(AB33-PosPLa1),0)+IF(AB33>PosPLb1,PLb1d*(AB33-PosPLb1),0)","v":{"v":-30.810000000000002,"d":"-30.81"}},{"$f":"-RL1d*AC33+UDL1d*AC33^2/2+IF(AC33>PosPUDL1,PUDL1d*(AC33-PosPUDL1)^2/2,0)+IF(AC33>(PosPUDL1+3),-PUDL1d*(AC33-PosPUDL1-3)^2/2,0)+IF(AC33>PosPUDL2,PUDL2d*(AC33-PosPUDL2)^2/2,0)+IF(AC33>(PosPUDL2+LePUDL2),-PUDL2d*(AC33-PosPUDL2-LePUDL2)^2/2,0)+IF(AC33>PosPLa1,PLa1d*(AC33-PosPLa1),0)+IF(AC33>PosPLb1,PLb1d*(AC33-PosPLb1),0)","v":{"v":-31.623968000000005,"d":"-31.62"}},{"$f":"-RL1d*AD33+UDL1d*AD33^2/2+IF(AD33>PosPUDL1,PUDL1d*(AD33-PosPUDL1)^2/2,0)+IF(AD33>(PosPUDL1+3),-PUDL1d*(AD33-PosPUDL1-3)^2/2,0)+IF(AD33>PosPUDL2,PUDL2d*(AD33-PosPUDL2)^2/2,0)+IF(AD33>(PosPUDL2+LePUDL2),-PUDL2d*(AD33-PosPUDL2-LePUDL2)^2/2,0)+IF(AD33>PosPLa1,PLa1d*(AD33-PosPLa1),0)+IF(AD33>PosPLb1,PLb1d*(AD33-PosPLb1),0)","v":{"v":-32.402671999999995,"d":"-32.40"}},{"$f":"-RL1d*AE33+UDL1d*AE33^2/2+IF(AE33>PosPUDL1,PUDL1d*(AE33-PosPUDL1)^2/2,0)+IF(AE33>(PosPUDL1+3),-PUDL1d*(AE33-PosPUDL1-3)^2/2,0)+IF(AE33>PosPUDL2,PUDL2d*(AE33-PosPUDL2)^2/2,0)+IF(AE33>(PosPUDL2+LePUDL2),-PUDL2d*(AE33-PosPUDL2-LePUDL2)^2/2,0)+IF(AE33>PosPLa1,PLa1d*(AE33-PosPLa1),0)+IF(AE33>PosPLb1,PLb1d*(AE33-PosPLb1),0)","v":{"v":-33.146112,"d":"-33.15"}},{"$f":"-RL1d*AF33+UDL1d*AF33^2/2+IF(AF33>PosPUDL1,PUDL1d*(AF33-PosPUDL1)^2/2,0)+IF(AF33>(PosPUDL1+3),-PUDL1d*(AF33-PosPUDL1-3)^2/2,0)+IF(AF33>PosPUDL2,PUDL2d*(AF33-PosPUDL2)^2/2,0)+IF(AF33>(PosPUDL2+LePUDL2),-PUDL2d*(AF33-PosPUDL2-LePUDL2)^2/2,0)+IF(AF33>PosPLa1,PLa1d*(AF33-PosPLa1),0)+IF(AF33>PosPLb1,PLb1d*(AF33-PosPLb1),0)","v":{"v":-33.854288000000004,"d":"-33.85"}},{"$f":"-RL1d*AG33+UDL1d*AG33^2/2+IF(AG33>PosPUDL1,PUDL1d*(AG33-PosPUDL1)^2/2,0)+IF(AG33>(PosPUDL1+3),-PUDL1d*(AG33-PosPUDL1-3)^2/2,0)+IF(AG33>PosPUDL2,PUDL2d*(AG33-PosPUDL2)^2/2,0)+IF(AG33>(PosPUDL2+LePUDL2),-PUDL2d*(AG33-PosPUDL2-LePUDL2)^2/2,0)+IF(AG33>PosPLa1,PLa1d*(AG33-PosPLa1),0)+IF(AG33>PosPLb1,PLb1d*(AG33-PosPLb1),0)","v":{"v":-34.5272,"d":"-34.53"}},{"$f":"-RL1d*AH33+UDL1d*AH33^2/2+IF(AH33>PosPUDL1,PUDL1d*(AH33-PosPUDL1)^2/2,0)+IF(AH33>(PosPUDL1+3),-PUDL1d*(AH33-PosPUDL1-3)^2/2,0)+IF(AH33>PosPUDL2,PUDL2d*(AH33-PosPUDL2)^2/2,0)+IF(AH33>(PosPUDL2+LePUDL2),-PUDL2d*(AH33-PosPUDL2-LePUDL2)^2/2,0)+IF(AH33>PosPLa1,PLa1d*(AH33-PosPLa1),0)+IF(AH33>PosPLb1,PLb1d*(AH33-PosPLb1),0)","v":{"v":-35.164848,"d":"-35.16"}},{"$f":"-RL1d*AI33+UDL1d*AI33^2/2+IF(AI33>PosPUDL1,PUDL1d*(AI33-PosPUDL1)^2/2,0)+IF(AI33>(PosPUDL1+3),-PUDL1d*(AI33-PosPUDL1-3)^2/2,0)+IF(AI33>PosPUDL2,PUDL2d*(AI33-PosPUDL2)^2/2,0)+IF(AI33>(PosPUDL2+LePUDL2),-PUDL2d*(AI33-PosPUDL2-LePUDL2)^2/2,0)+IF(AI33>PosPLa1,PLa1d*(AI33-PosPLa1),0)+IF(AI33>PosPLb1,PLb1d*(AI33-PosPLb1),0)","v":{"v":-35.76723200000001,"d":"-35.77"}},{"$f":"-RL1d*AJ33+UDL1d*AJ33^2/2+IF(AJ33>PosPUDL1,PUDL1d*(AJ33-PosPUDL1)^2/2,0)+IF(AJ33>(PosPUDL1+3),-PUDL1d*(AJ33-PosPUDL1-3)^2/2,0)+IF(AJ33>PosPUDL2,PUDL2d*(AJ33-PosPUDL2)^2/2,0)+IF(AJ33>(PosPUDL2+LePUDL2),-PUDL2d*(AJ33-PosPUDL2-LePUDL2)^2/2,0)+IF(AJ33>PosPLa1,PLa1d*(AJ33-PosPLa1),0)+IF(AJ33>PosPLb1,PLb1d*(AJ33-PosPLb1),0)","v":{"v":-36.334352,"d":"-36.33"}},{"$f":"-RL1d*AK33+UDL1d*AK33^2/2+IF(AK33>PosPUDL1,PUDL1d*(AK33-PosPUDL1)^2/2,0)+IF(AK33>(PosPUDL1+3),-PUDL1d*(AK33-PosPUDL1-3)^2/2,0)+IF(AK33>PosPUDL2,PUDL2d*(AK33-PosPUDL2)^2/2,0)+IF(AK33>(PosPUDL2+LePUDL2),-PUDL2d*(AK33-PosPUDL2-LePUDL2)^2/2,0)+IF(AK33>PosPLa1,PLa1d*(AK33-PosPLa1),0)+IF(AK33>PosPLb1,PLb1d*(AK33-PosPLb1),0)","v":{"v":-36.86620800000001,"d":"-36.87"}},{"$f":"-RL1d*AL33+UDL1d*AL33^2/2+IF(AL33>PosPUDL1,PUDL1d*(AL33-PosPUDL1)^2/2,0)+IF(AL33>(PosPUDL1+3),-PUDL1d*(AL33-PosPUDL1-3)^2/2,0)+IF(AL33>PosPUDL2,PUDL2d*(AL33-PosPUDL2)^2/2,0)+IF(AL33>(PosPUDL2+LePUDL2),-PUDL2d*(AL33-PosPUDL2-LePUDL2)^2/2,0)+IF(AL33>PosPLa1,PLa1d*(AL33-PosPLa1),0)+IF(AL33>PosPLb1,PLb1d*(AL33-PosPLb1),0)","v":{"v":-37.362800000000014,"d":"-37.36"}},{"$f":"-RL1d*AM33+UDL1d*AM33^2/2+IF(AM33>PosPUDL1,PUDL1d*(AM33-PosPUDL1)^2/2,0)+IF(AM33>(PosPUDL1+3),-PUDL1d*(AM33-PosPUDL1-3)^2/2,0)+IF(AM33>PosPUDL2,PUDL2d*(AM33-PosPUDL2)^2/2,0)+IF(AM33>(PosPUDL2+LePUDL2),-PUDL2d*(AM33-PosPUDL2-LePUDL2)^2/2,0)+IF(AM33>PosPLa1,PLa1d*(AM33-PosPLa1),0)+IF(AM33>PosPLb1,PLb1d*(AM33-PosPLb1),0)","v":{"v":-37.824128,"d":"-37.82"}},{"$f":"-RL1d*AN33+UDL1d*AN33^2/2+IF(AN33>PosPUDL1,PUDL1d*(AN33-PosPUDL1)^2/2,0)+IF(AN33>(PosPUDL1+3),-PUDL1d*(AN33-PosPUDL1-3)^2/2,0)+IF(AN33>PosPUDL2,PUDL2d*(AN33-PosPUDL2)^2/2,0)+IF(AN33>(PosPUDL2+LePUDL2),-PUDL2d*(AN33-PosPUDL2-LePUDL2)^2/2,0)+IF(AN33>PosPLa1,PLa1d*(AN33-PosPLa1),0)+IF(AN33>PosPLb1,PLb1d*(AN33-PosPLb1),0)","v":{"v":-38.250192000000006,"d":"-38.25"}},{"$f":"-RL1d*AO33+UDL1d*AO33^2/2+IF(AO33>PosPUDL1,PUDL1d*(AO33-PosPUDL1)^2/2,0)+IF(AO33>(PosPUDL1+3),-PUDL1d*(AO33-PosPUDL1-3)^2/2,0)+IF(AO33>PosPUDL2,PUDL2d*(AO33-PosPUDL2)^2/2,0)+IF(AO33>(PosPUDL2+LePUDL2),-PUDL2d*(AO33-PosPUDL2-LePUDL2)^2/2,0)+IF(AO33>PosPLa1,PLa1d*(AO33-PosPLa1),0)+IF(AO33>PosPLb1,PLb1d*(AO33-PosPLb1),0)","v":{"v":-38.56099199999999,"d":"-38.56"}},{"$f":"-RL1d*AP33+UDL1d*AP33^2/2+IF(AP33>PosPUDL1,PUDL1d*(AP33-PosPUDL1)^2/2,0)+IF(AP33>(PosPUDL1+3),-PUDL1d*(AP33-PosPUDL1-3)^2/2,0)+IF(AP33>PosPUDL2,PUDL2d*(AP33-PosPUDL2)^2/2,0)+IF(AP33>(PosPUDL2+LePUDL2),-PUDL2d*(AP33-PosPUDL2-LePUDL2)^2/2,0)+IF(AP33>PosPLa1,PLa1d*(AP33-PosPLa1),0)+IF(AP33>PosPLb1,PLb1d*(AP33-PosPLb1),0)","v":{"v":-38.756528,"d":"-38.76"}},{"$f":"-RL1d*AQ33+UDL1d*AQ33^2/2+IF(AQ33>PosPUDL1,PUDL1d*(AQ33-PosPUDL1)^2/2,0)+IF(AQ33>(PosPUDL1+3),-PUDL1d*(AQ33-PosPUDL1-3)^2/2,0)+IF(AQ33>PosPUDL2,PUDL2d*(AQ33-PosPUDL2)^2/2,0)+IF(AQ33>(PosPUDL2+LePUDL2),-PUDL2d*(AQ33-PosPUDL2-LePUDL2)^2/2,0)+IF(AQ33>PosPLa1,PLa1d*(AQ33-PosPLa1),0)+IF(AQ33>PosPLb1,PLb1d*(AQ33-PosPLb1),0)","v":{"v":-38.91680000000001,"d":"-38.92"}},{"$f":"-RL1d*AR33+UDL1d*AR33^2/2+IF(AR33>PosPUDL1,PUDL1d*(AR33-PosPUDL1)^2/2,0)+IF(AR33>(PosPUDL1+3),-PUDL1d*(AR33-PosPUDL1-3)^2/2,0)+IF(AR33>PosPUDL2,PUDL2d*(AR33-PosPUDL2)^2/2,0)+IF(AR33>(PosPUDL2+LePUDL2),-PUDL2d*(AR33-PosPUDL2-LePUDL2)^2/2,0)+IF(AR33>PosPLa1,PLa1d*(AR33-PosPLa1),0)+IF(AR33>PosPLb1,PLb1d*(AR33-PosPLb1),0)","v":{"v":-39.041808,"d":"-39.04"}},{"$f":"-RL1d*AS33+UDL1d*AS33^2/2+IF(AS33>PosPUDL1,PUDL1d*(AS33-PosPUDL1)^2/2,0)+IF(AS33>(PosPUDL1+3),-PUDL1d*(AS33-PosPUDL1-3)^2/2,0)+IF(AS33>PosPUDL2,PUDL2d*(AS33-PosPUDL2)^2/2,0)+IF(AS33>(PosPUDL2+LePUDL2),-PUDL2d*(AS33-PosPUDL2-LePUDL2)^2/2,0)+IF(AS33>PosPLa1,PLa1d*(AS33-PosPLa1),0)+IF(AS33>PosPLb1,PLb1d*(AS33-PosPLb1),0)","v":{"v":-39.13155199999999,"d":"-39.13"}},{"$f":"-RL1d*AT33+UDL1d*AT33^2/2+IF(AT33>PosPUDL1,PUDL1d*(AT33-PosPUDL1)^2/2,0)+IF(AT33>(PosPUDL1+3),-PUDL1d*(AT33-PosPUDL1-3)^2/2,0)+IF(AT33>PosPUDL2,PUDL2d*(AT33-PosPUDL2)^2/2,0)+IF(AT33>(PosPUDL2+LePUDL2),-PUDL2d*(AT33-PosPUDL2-LePUDL2)^2/2,0)+IF(AT33>PosPLa1,PLa1d*(AT33-PosPLa1),0)+IF(AT33>PosPLb1,PLb1d*(AT33-PosPLb1),0)","v":{"v":-39.186032,"d":"-39.19"}},{"$f":"-RL1d*AU33+UDL1d*AU33^2/2+IF(AU33>PosPUDL1,PUDL1d*(AU33-PosPUDL1)^2/2,0)+IF(AU33>(PosPUDL1+3),-PUDL1d*(AU33-PosPUDL1-3)^2/2,0)+IF(AU33>PosPUDL2,PUDL2d*(AU33-PosPUDL2)^2/2,0)+IF(AU33>(PosPUDL2+LePUDL2),-PUDL2d*(AU33-PosPUDL2-LePUDL2)^2/2,0)+IF(AU33>PosPLa1,PLa1d*(AU33-PosPLa1),0)+IF(AU33>PosPLb1,PLb1d*(AU33-PosPLb1),0)","v":{"v":-39.205248,"d":"-39.21"}},{"$f":"-RL1d*AV33+UDL1d*AV33^2/2+IF(AV33>PosPUDL1,PUDL1d*(AV33-PosPUDL1)^2/2,0)+IF(AV33>(PosPUDL1+3),-PUDL1d*(AV33-PosPUDL1-3)^2/2,0)+IF(AV33>PosPUDL2,PUDL2d*(AV33-PosPUDL2)^2/2,0)+IF(AV33>(PosPUDL2+LePUDL2),-PUDL2d*(AV33-PosPUDL2-LePUDL2)^2/2,0)+IF(AV33>PosPLa1,PLa1d*(AV33-PosPLa1),0)+IF(AV33>PosPLb1,PLb1d*(AV33-PosPLb1),0)","v":{"v":-39.18919999999999,"d":"-39.19"}},{"$f":"-RL1d*AW33+UDL1d*AW33^2/2+IF(AW33>PosPUDL1,PUDL1d*(AW33-PosPUDL1)^2/2,0)+IF(AW33>(PosPUDL1+3),-PUDL1d*(AW33-PosPUDL1-3)^2/2,0)+IF(AW33>PosPUDL2,PUDL2d*(AW33-PosPUDL2)^2/2,0)+IF(AW33>(PosPUDL2+LePUDL2),-PUDL2d*(AW33-PosPUDL2-LePUDL2)^2/2,0)+IF(AW33>PosPLa1,PLa1d*(AW33-PosPLa1),0)+IF(AW33>PosPLb1,PLb1d*(AW33-PosPLb1),0)","v":{"v":-39.137888,"d":"-39.14"}},{"$f":"-RL1d*AX33+UDL1d*AX33^2/2+IF(AX33>PosPUDL1,PUDL1d*(AX33-PosPUDL1)^2/2,0)+IF(AX33>(PosPUDL1+3),-PUDL1d*(AX33-PosPUDL1-3)^2/2,0)+IF(AX33>PosPUDL2,PUDL2d*(AX33-PosPUDL2)^2/2,0)+IF(AX33>(PosPUDL2+LePUDL2),-PUDL2d*(AX33-PosPUDL2-LePUDL2)^2/2,0)+IF(AX33>PosPLa1,PLa1d*(AX33-PosPLa1),0)+IF(AX33>PosPLb1,PLb1d*(AX33-PosPLb1),0)","v":{"v":-39.051312,"d":"-39.05"}},{"$f":"-RL1d*AY33+UDL1d*AY33^2/2+IF(AY33>PosPUDL1,PUDL1d*(AY33-PosPUDL1)^2/2,0)+IF(AY33>(PosPUDL1+3),-PUDL1d*(AY33-PosPUDL1-3)^2/2,0)+IF(AY33>PosPUDL2,PUDL2d*(AY33-PosPUDL2)^2/2,0)+IF(AY33>(PosPUDL2+LePUDL2),-PUDL2d*(AY33-PosPUDL2-LePUDL2)^2/2,0)+IF(AY33>PosPLa1,PLa1d*(AY33-PosPLa1),0)+IF(AY33>PosPLb1,PLb1d*(AY33-PosPLb1),0)","v":{"v":-38.92947199999999,"d":"-38.93"}},{"$f":"-RL1d*AZ33+UDL1d*AZ33^2/2+IF(AZ33>PosPUDL1,PUDL1d*(AZ33-PosPUDL1)^2/2,0)+IF(AZ33>(PosPUDL1+3),-PUDL1d*(AZ33-PosPUDL1-3)^2/2,0)+IF(AZ33>PosPUDL2,PUDL2d*(AZ33-PosPUDL2)^2/2,0)+IF(AZ33>(PosPUDL2+LePUDL2),-PUDL2d*(AZ33-PosPUDL2-LePUDL2)^2/2,0)+IF(AZ33>PosPLa1,PLa1d*(AZ33-PosPLa1),0)+IF(AZ33>PosPLb1,PLb1d*(AZ33-PosPLb1),0)","v":{"v":-38.772368,"d":"-38.77"}},{"$f":"-RL1d*BA33+UDL1d*BA33^2/2+IF(BA33>PosPUDL1,PUDL1d*(BA33-PosPUDL1)^2/2,0)+IF(BA33>(PosPUDL1+3),-PUDL1d*(BA33-PosPUDL1-3)^2/2,0)+IF(BA33>PosPUDL2,PUDL2d*(BA33-PosPUDL2)^2/2,0)+IF(BA33>(PosPUDL2+LePUDL2),-PUDL2d*(BA33-PosPUDL2-LePUDL2)^2/2,0)+IF(BA33>PosPLa1,PLa1d*(BA33-PosPLa1),0)+IF(BA33>PosPLb1,PLb1d*(BA33-PosPLb1),0)","v":{"v":-38.579999999999984,"d":"-38.58"}},{"$f":"-RL1d*BB33+UDL1d*BB33^2/2+IF(BB33>PosPUDL1,PUDL1d*(BB33-PosPUDL1)^2/2,0)+IF(BB33>(PosPUDL1+3),-PUDL1d*(BB33-PosPUDL1-3)^2/2,0)+IF(BB33>PosPUDL2,PUDL2d*(BB33-PosPUDL2)^2/2,0)+IF(BB33>(PosPUDL2+LePUDL2),-PUDL2d*(BB33-PosPUDL2-LePUDL2)^2/2,0)+IF(BB33>PosPLa1,PLa1d*(BB33-PosPLa1),0)+IF(BB33>PosPLb1,PLb1d*(BB33-PosPLb1),0)","v":{"v":-38.35876799999999,"d":"-38.36"}},{"$f":"-RL1d*BC33+UDL1d*BC33^2/2+IF(BC33>PosPUDL1,PUDL1d*(BC33-PosPUDL1)^2/2,0)+IF(BC33>(PosPUDL1+3),-PUDL1d*(BC33-PosPUDL1-3)^2/2,0)+IF(BC33>PosPUDL2,PUDL2d*(BC33-PosPUDL2)^2/2,0)+IF(BC33>(PosPUDL2+LePUDL2),-PUDL2d*(BC33-PosPUDL2-LePUDL2)^2/2,0)+IF(BC33>PosPLa1,PLa1d*(BC33-PosPLa1),0)+IF(BC33>PosPLb1,PLb1d*(BC33-PosPLb1),0)","v":{"v":-38.115071999999984,"d":"-38.12"}},{"$f":"-RL1d*BD33+UDL1d*BD33^2/2+IF(BD33>PosPUDL1,PUDL1d*(BD33-PosPUDL1)^2/2,0)+IF(BD33>(PosPUDL1+3),-PUDL1d*(BD33-PosPUDL1-3)^2/2,0)+IF(BD33>PosPUDL2,PUDL2d*(BD33-PosPUDL2)^2/2,0)+IF(BD33>(PosPUDL2+LePUDL2),-PUDL2d*(BD33-PosPUDL2-LePUDL2)^2/2,0)+IF(BD33>PosPLa1,PLa1d*(BD33-PosPLa1),0)+IF(BD33>PosPLb1,PLb1d*(BD33-PosPLb1),0)","v":{"v":-37.848912,"d":"-37.85"}},{"$f":"-RL1d*BE33+UDL1d*BE33^2/2+IF(BE33>PosPUDL1,PUDL1d*(BE33-PosPUDL1)^2/2,0)+IF(BE33>(PosPUDL1+3),-PUDL1d*(BE33-PosPUDL1-3)^2/2,0)+IF(BE33>PosPUDL2,PUDL2d*(BE33-PosPUDL2)^2/2,0)+IF(BE33>(PosPUDL2+LePUDL2),-PUDL2d*(BE33-PosPUDL2-LePUDL2)^2/2,0)+IF(BE33>PosPLa1,PLa1d*(BE33-PosPLa1),0)+IF(BE33>PosPLb1,PLb1d*(BE33-PosPLb1),0)","v":{"v":-37.560288,"d":"-37.56"}},{"$f":"-RL1d*BF33+UDL1d*BF33^2/2+IF(BF33>PosPUDL1,PUDL1d*(BF33-PosPUDL1)^2/2,0)+IF(BF33>(PosPUDL1+3),-PUDL1d*(BF33-PosPUDL1-3)^2/2,0)+IF(BF33>PosPUDL2,PUDL2d*(BF33-PosPUDL2)^2/2,0)+IF(BF33>(PosPUDL2+LePUDL2),-PUDL2d*(BF33-PosPUDL2-LePUDL2)^2/2,0)+IF(BF33>PosPLa1,PLa1d*(BF33-PosPLa1),0)+IF(BF33>PosPLb1,PLb1d*(BF33-PosPLb1),0)","v":{"v":-37.2492,"d":"-37.25"}},{"$f":"-RL1d*BG33+UDL1d*BG33^2/2+IF(BG33>PosPUDL1,PUDL1d*(BG33-PosPUDL1)^2/2,0)+IF(BG33>(PosPUDL1+3),-PUDL1d*(BG33-PosPUDL1-3)^2/2,0)+IF(BG33>PosPUDL2,PUDL2d*(BG33-PosPUDL2)^2/2,0)+IF(BG33>(PosPUDL2+LePUDL2),-PUDL2d*(BG33-PosPUDL2-LePUDL2)^2/2,0)+IF(BG33>PosPLa1,PLa1d*(BG33-PosPLa1),0)+IF(BG33>PosPLb1,PLb1d*(BG33-PosPLb1),0)","v":{"v":-36.91564799999999,"d":"-36.92"}},{"$f":"-RL1d*BH33+UDL1d*BH33^2/2+IF(BH33>PosPUDL1,PUDL1d*(BH33-PosPUDL1)^2/2,0)+IF(BH33>(PosPUDL1+3),-PUDL1d*(BH33-PosPUDL1-3)^2/2,0)+IF(BH33>PosPUDL2,PUDL2d*(BH33-PosPUDL2)^2/2,0)+IF(BH33>(PosPUDL2+LePUDL2),-PUDL2d*(BH33-PosPUDL2-LePUDL2)^2/2,0)+IF(BH33>PosPLa1,PLa1d*(BH33-PosPLa1),0)+IF(BH33>PosPLb1,PLb1d*(BH33-PosPLb1),0)","v":{"v":-36.559631999999986,"d":"-36.56"}},{"$f":"-RL1d*BI33+UDL1d*BI33^2/2+IF(BI33>PosPUDL1,PUDL1d*(BI33-PosPUDL1)^2/2,0)+IF(BI33>(PosPUDL1+3),-PUDL1d*(BI33-PosPUDL1-3)^2/2,0)+IF(BI33>PosPUDL2,PUDL2d*(BI33-PosPUDL2)^2/2,0)+IF(BI33>(PosPUDL2+LePUDL2),-PUDL2d*(BI33-PosPUDL2-LePUDL2)^2/2,0)+IF(BI33>PosPLa1,PLa1d*(BI33-PosPLa1),0)+IF(BI33>PosPLb1,PLb1d*(BI33-PosPLb1),0)","v":{"v":-36.18115199999998,"d":"-36.18"}},{"$f":"-RL1d*BJ33+UDL1d*BJ33^2/2+IF(BJ33>PosPUDL1,PUDL1d*(BJ33-PosPUDL1)^2/2,0)+IF(BJ33>(PosPUDL1+3),-PUDL1d*(BJ33-PosPUDL1-3)^2/2,0)+IF(BJ33>PosPUDL2,PUDL2d*(BJ33-PosPUDL2)^2/2,0)+IF(BJ33>(PosPUDL2+LePUDL2),-PUDL2d*(BJ33-PosPUDL2-LePUDL2)^2/2,0)+IF(BJ33>PosPLa1,PLa1d*(BJ33-PosPLa1),0)+IF(BJ33>PosPLb1,PLb1d*(BJ33-PosPLb1),0)","v":{"v":-35.78020799999999,"d":"-35.78"}},{"$f":"-RL1d*BK33+UDL1d*BK33^2/2+IF(BK33>PosPUDL1,PUDL1d*(BK33-PosPUDL1)^2/2,0)+IF(BK33>(PosPUDL1+3),-PUDL1d*(BK33-PosPUDL1-3)^2/2,0)+IF(BK33>PosPUDL2,PUDL2d*(BK33-PosPUDL2)^2/2,0)+IF(BK33>(PosPUDL2+LePUDL2),-PUDL2d*(BK33-PosPUDL2-LePUDL2)^2/2,0)+IF(BK33>PosPLa1,PLa1d*(BK33-PosPLa1),0)+IF(BK33>PosPLb1,PLb1d*(BK33-PosPLb1),0)","v":{"v":-35.35679999999999,"d":"-35.36"}},{"$f":"-RL1d*BL33+UDL1d*BL33^2/2+IF(BL33>PosPUDL1,PUDL1d*(BL33-PosPUDL1)^2/2,0)+IF(BL33>(PosPUDL1+3),-PUDL1d*(BL33-PosPUDL1-3)^2/2,0)+IF(BL33>PosPUDL2,PUDL2d*(BL33-PosPUDL2)^2/2,0)+IF(BL33>(PosPUDL2+LePUDL2),-PUDL2d*(BL33-PosPUDL2-LePUDL2)^2/2,0)+IF(BL33>PosPLa1,PLa1d*(BL33-PosPLa1),0)+IF(BL33>PosPLb1,PLb1d*(BL33-PosPLb1),0)","v":{"v":-34.91092799999998,"d":"-34.91"}},{"$f":"-RL1d*BM33+UDL1d*BM33^2/2+IF(BM33>PosPUDL1,PUDL1d*(BM33-PosPUDL1)^2/2,0)+IF(BM33>(PosPUDL1+3),-PUDL1d*(BM33-PosPUDL1-3)^2/2,0)+IF(BM33>PosPUDL2,PUDL2d*(BM33-PosPUDL2)^2/2,0)+IF(BM33>(PosPUDL2+LePUDL2),-PUDL2d*(BM33-PosPUDL2-LePUDL2)^2/2,0)+IF(BM33>PosPLa1,PLa1d*(BM33-PosPLa1),0)+IF(BM33>PosPLb1,PLb1d*(BM33-PosPLb1),0)","v":{"v":-34.442591999999976,"d":"-34.44"}},{"$f":"-RL1d*BN33+UDL1d*BN33^2/2+IF(BN33>PosPUDL1,PUDL1d*(BN33-PosPUDL1)^2/2,0)+IF(BN33>(PosPUDL1+3),-PUDL1d*(BN33-PosPUDL1-3)^2/2,0)+IF(BN33>PosPUDL2,PUDL2d*(BN33-PosPUDL2)^2/2,0)+IF(BN33>(PosPUDL2+LePUDL2),-PUDL2d*(BN33-PosPUDL2-LePUDL2)^2/2,0)+IF(BN33>PosPLa1,PLa1d*(BN33-PosPLa1),0)+IF(BN33>PosPLb1,PLb1d*(BN33-PosPLb1),0)","v":{"v":-33.95179199999999,"d":"-33.95"}},{"$f":"-RL1d*BO33+UDL1d*BO33^2/2+IF(BO33>PosPUDL1,PUDL1d*(BO33-PosPUDL1)^2/2,0)+IF(BO33>(PosPUDL1+3),-PUDL1d*(BO33-PosPUDL1-3)^2/2,0)+IF(BO33>PosPUDL2,PUDL2d*(BO33-PosPUDL2)^2/2,0)+IF(BO33>(PosPUDL2+LePUDL2),-PUDL2d*(BO33-PosPUDL2-LePUDL2)^2/2,0)+IF(BO33>PosPLa1,PLa1d*(BO33-PosPLa1),0)+IF(BO33>PosPLb1,PLb1d*(BO33-PosPLb1),0)","v":{"v":-33.43852799999998,"d":"-33.44"}},{"$f":"-RL1d*BP33+UDL1d*BP33^2/2+IF(BP33>PosPUDL1,PUDL1d*(BP33-PosPUDL1)^2/2,0)+IF(BP33>(PosPUDL1+3),-PUDL1d*(BP33-PosPUDL1-3)^2/2,0)+IF(BP33>PosPUDL2,PUDL2d*(BP33-PosPUDL2)^2/2,0)+IF(BP33>(PosPUDL2+LePUDL2),-PUDL2d*(BP33-PosPUDL2-LePUDL2)^2/2,0)+IF(BP33>PosPLa1,PLa1d*(BP33-PosPLa1),0)+IF(BP33>PosPLb1,PLb1d*(BP33-PosPLb1),0)","v":{"v":-32.90279999999998,"d":"-32.90"}},{"$f":"-RL1d*BQ33+UDL1d*BQ33^2/2+IF(BQ33>PosPUDL1,PUDL1d*(BQ33-PosPUDL1)^2/2,0)+IF(BQ33>(PosPUDL1+3),-PUDL1d*(BQ33-PosPUDL1-3)^2/2,0)+IF(BQ33>PosPUDL2,PUDL2d*(BQ33-PosPUDL2)^2/2,0)+IF(BQ33>(PosPUDL2+LePUDL2),-PUDL2d*(BQ33-PosPUDL2-LePUDL2)^2/2,0)+IF(BQ33>PosPLa1,PLa1d*(BQ33-PosPLa1),0)+IF(BQ33>PosPLb1,PLb1d*(BQ33-PosPLb1),0)","v":{"v":-32.34460799999998,"d":"-32.34"}},{"$f":"-RL1d*BR33+UDL1d*BR33^2/2+IF(BR33>PosPUDL1,PUDL1d*(BR33-PosPUDL1)^2/2,0)+IF(BR33>(PosPUDL1+3),-PUDL1d*(BR33-PosPUDL1-3)^2/2,0)+IF(BR33>PosPUDL2,PUDL2d*(BR33-PosPUDL2)^2/2,0)+IF(BR33>(PosPUDL2+LePUDL2),-PUDL2d*(BR33-PosPUDL2-LePUDL2)^2/2,0)+IF(BR33>PosPLa1,PLa1d*(BR33-PosPLa1),0)+IF(BR33>PosPLb1,PLb1d*(BR33-PosPLb1),0)","v":{"v":-31.763951999999968,"d":"-31.76"}},{"$f":"-RL1d*BS33+UDL1d*BS33^2/2+IF(BS33>PosPUDL1,PUDL1d*(BS33-PosPUDL1)^2/2,0)+IF(BS33>(PosPUDL1+3),-PUDL1d*(BS33-PosPUDL1-3)^2/2,0)+IF(BS33>PosPUDL2,PUDL2d*(BS33-PosPUDL2)^2/2,0)+IF(BS33>(PosPUDL2+LePUDL2),-PUDL2d*(BS33-PosPUDL2-LePUDL2)^2/2,0)+IF(BS33>PosPLa1,PLa1d*(BS33-PosPLa1),0)+IF(BS33>PosPLb1,PLb1d*(BS33-PosPLb1),0)","v":{"v":-31.160831999999967,"d":"-31.16"}},{"$f":"-RL1d*BT33+UDL1d*BT33^2/2+IF(BT33>PosPUDL1,PUDL1d*(BT33-PosPUDL1)^2/2,0)+IF(BT33>(PosPUDL1+3),-PUDL1d*(BT33-PosPUDL1-3)^2/2,0)+IF(BT33>PosPUDL2,PUDL2d*(BT33-PosPUDL2)^2/2,0)+IF(BT33>(PosPUDL2+LePUDL2),-PUDL2d*(BT33-PosPUDL2-LePUDL2)^2/2,0)+IF(BT33>PosPLa1,PLa1d*(BT33-PosPLa1),0)+IF(BT33>PosPLb1,PLb1d*(BT33-PosPLb1),0)","v":{"v":-30.535247999999974,"d":"-30.54"}},{"$f":"-RL1d*BU33+UDL1d*BU33^2/2+IF(BU33>PosPUDL1,PUDL1d*(BU33-PosPUDL1)^2/2,0)+IF(BU33>(PosPUDL1+3),-PUDL1d*(BU33-PosPUDL1-3)^2/2,0)+IF(BU33>PosPUDL2,PUDL2d*(BU33-PosPUDL2)^2/2,0)+IF(BU33>(PosPUDL2+LePUDL2),-PUDL2d*(BU33-PosPUDL2-LePUDL2)^2/2,0)+IF(BU33>PosPLa1,PLa1d*(BU33-PosPLa1),0)+IF(BU33>PosPLb1,PLb1d*(BU33-PosPLb1),0)","v":{"v":-29.887199999999982,"d":"-29.89"}},{"$f":"-RL1d*BV33+UDL1d*BV33^2/2+IF(BV33>PosPUDL1,PUDL1d*(BV33-PosPUDL1)^2/2,0)+IF(BV33>(PosPUDL1+3),-PUDL1d*(BV33-PosPUDL1-3)^2/2,0)+IF(BV33>PosPUDL2,PUDL2d*(BV33-PosPUDL2)^2/2,0)+IF(BV33>(PosPUDL2+LePUDL2),-PUDL2d*(BV33-PosPUDL2-LePUDL2)^2/2,0)+IF(BV33>PosPLa1,PLa1d*(BV33-PosPLa1),0)+IF(BV33>PosPLb1,PLb1d*(BV33-PosPLb1),0)","v":{"v":-29.216687999999984,"d":"-29.22"}},{"$f":"-RL1d*BW33+UDL1d*BW33^2/2+IF(BW33>PosPUDL1,PUDL1d*(BW33-PosPUDL1)^2/2,0)+IF(BW33>(PosPUDL1+3),-PUDL1d*(BW33-PosPUDL1-3)^2/2,0)+IF(BW33>PosPUDL2,PUDL2d*(BW33-PosPUDL2)^2/2,0)+IF(BW33>(PosPUDL2+LePUDL2),-PUDL2d*(BW33-PosPUDL2-LePUDL2)^2/2,0)+IF(BW33>PosPLa1,PLa1d*(BW33-PosPLa1),0)+IF(BW33>PosPLb1,PLb1d*(BW33-PosPLb1),0)","v":{"v":-28.523711999999964,"d":"-28.52"}},{"$f":"-RL1d*BX33+UDL1d*BX33^2/2+IF(BX33>PosPUDL1,PUDL1d*(BX33-PosPUDL1)^2/2,0)+IF(BX33>(PosPUDL1+3),-PUDL1d*(BX33-PosPUDL1-3)^2/2,0)+IF(BX33>PosPUDL2,PUDL2d*(BX33-PosPUDL2)^2/2,0)+IF(BX33>(PosPUDL2+LePUDL2),-PUDL2d*(BX33-PosPUDL2-LePUDL2)^2/2,0)+IF(BX33>PosPLa1,PLa1d*(BX33-PosPLa1),0)+IF(BX33>PosPLb1,PLb1d*(BX33-PosPLb1),0)","v":{"v":-27.808271999999967,"d":"-27.81"}},{"$f":"-RL1d*BY33+UDL1d*BY33^2/2+IF(BY33>PosPUDL1,PUDL1d*(BY33-PosPUDL1)^2/2,0)+IF(BY33>(PosPUDL1+3),-PUDL1d*(BY33-PosPUDL1-3)^2/2,0)+IF(BY33>PosPUDL2,PUDL2d*(BY33-PosPUDL2)^2/2,0)+IF(BY33>(PosPUDL2+LePUDL2),-PUDL2d*(BY33-PosPUDL2-LePUDL2)^2/2,0)+IF(BY33>PosPLa1,PLa1d*(BY33-PosPLa1),0)+IF(BY33>PosPLb1,PLb1d*(BY33-PosPLb1),0)","v":{"v":-27.07036799999997,"d":"-27.07"}},{"$f":"-RL1d*BZ33+UDL1d*BZ33^2/2+IF(BZ33>PosPUDL1,PUDL1d*(BZ33-PosPUDL1)^2/2,0)+IF(BZ33>(PosPUDL1+3),-PUDL1d*(BZ33-PosPUDL1-3)^2/2,0)+IF(BZ33>PosPUDL2,PUDL2d*(BZ33-PosPUDL2)^2/2,0)+IF(BZ33>(PosPUDL2+LePUDL2),-PUDL2d*(BZ33-PosPUDL2-LePUDL2)^2/2,0)+IF(BZ33>PosPLa1,PLa1d*(BZ33-PosPLa1),0)+IF(BZ33>PosPLb1,PLb1d*(BZ33-PosPLb1),0)","v":{"v":-26.309999999999967,"d":"-26.31"}},{"$f":"-RL1d*CA33+UDL1d*CA33^2/2+IF(CA33>PosPUDL1,PUDL1d*(CA33-PosPUDL1)^2/2,0)+IF(CA33>(PosPUDL1+3),-PUDL1d*(CA33-PosPUDL1-3)^2/2,0)+IF(CA33>PosPUDL2,PUDL2d*(CA33-PosPUDL2)^2/2,0)+IF(CA33>(PosPUDL2+LePUDL2),-PUDL2d*(CA33-PosPUDL2-LePUDL2)^2/2,0)+IF(CA33>PosPLa1,PLa1d*(CA33-PosPLa1),0)+IF(CA33>PosPLb1,PLb1d*(CA33-PosPLb1),0)","v":{"v":-25.527167999999975,"d":"-25.53"}},{"$f":"-RL1d*CB33+UDL1d*CB33^2/2+IF(CB33>PosPUDL1,PUDL1d*(CB33-PosPUDL1)^2/2,0)+IF(CB33>(PosPUDL1+3),-PUDL1d*(CB33-PosPUDL1-3)^2/2,0)+IF(CB33>PosPUDL2,PUDL2d*(CB33-PosPUDL2)^2/2,0)+IF(CB33>(PosPUDL2+LePUDL2),-PUDL2d*(CB33-PosPUDL2-LePUDL2)^2/2,0)+IF(CB33>PosPLa1,PLa1d*(CB33-PosPLa1),0)+IF(CB33>PosPLb1,PLb1d*(CB33-PosPLb1),0)","v":{"v":-24.721871999999948,"d":"-24.72"}},{"$f":"-RL1d*CC33+UDL1d*CC33^2/2+IF(CC33>PosPUDL1,PUDL1d*(CC33-PosPUDL1)^2/2,0)+IF(CC33>(PosPUDL1+3),-PUDL1d*(CC33-PosPUDL1-3)^2/2,0)+IF(CC33>PosPUDL2,PUDL2d*(CC33-PosPUDL2)^2/2,0)+IF(CC33>(PosPUDL2+LePUDL2),-PUDL2d*(CC33-PosPUDL2-LePUDL2)^2/2,0)+IF(CC33>PosPLa1,PLa1d*(CC33-PosPLa1),0)+IF(CC33>PosPLb1,PLb1d*(CC33-PosPLb1),0)","v":{"v":-23.89411199999995,"d":"-23.89"}},{"$f":"-RL1d*CD33+UDL1d*CD33^2/2+IF(CD33>PosPUDL1,PUDL1d*(CD33-PosPUDL1)^2/2,0)+IF(CD33>(PosPUDL1+3),-PUDL1d*(CD33-PosPUDL1-3)^2/2,0)+IF(CD33>PosPUDL2,PUDL2d*(CD33-PosPUDL2)^2/2,0)+IF(CD33>(PosPUDL2+LePUDL2),-PUDL2d*(CD33-PosPUDL2-LePUDL2)^2/2,0)+IF(CD33>PosPLa1,PLa1d*(CD33-PosPLa1),0)+IF(CD33>PosPLb1,PLb1d*(CD33-PosPLb1),0)","v":{"v":-23.043887999999953,"d":"-23.04"}},{"$f":"-RL1d*CE33+UDL1d*CE33^2/2+IF(CE33>PosPUDL1,PUDL1d*(CE33-PosPUDL1)^2/2,0)+IF(CE33>(PosPUDL1+3),-PUDL1d*(CE33-PosPUDL1-3)^2/2,0)+IF(CE33>PosPUDL2,PUDL2d*(CE33-PosPUDL2)^2/2,0)+IF(CE33>(PosPUDL2+LePUDL2),-PUDL2d*(CE33-PosPUDL2-LePUDL2)^2/2,0)+IF(CE33>PosPLa1,PLa1d*(CE33-PosPLa1),0)+IF(CE33>PosPLb1,PLb1d*(CE33-PosPLb1),0)","v":{"v":-22.171199999999956,"d":"-22.17"}},{"$f":"-RL1d*CF33+UDL1d*CF33^2/2+IF(CF33>PosPUDL1,PUDL1d*(CF33-PosPUDL1)^2/2,0)+IF(CF33>(PosPUDL1+3),-PUDL1d*(CF33-PosPUDL1-3)^2/2,0)+IF(CF33>PosPUDL2,PUDL2d*(CF33-PosPUDL2)^2/2,0)+IF(CF33>(PosPUDL2+LePUDL2),-PUDL2d*(CF33-PosPUDL2-LePUDL2)^2/2,0)+IF(CF33>PosPLa1,PLa1d*(CF33-PosPLa1),0)+IF(CF33>PosPLb1,PLb1d*(CF33-PosPLb1),0)","v":{"v":-21.27604799999996,"d":"-21.28"}},{"$f":"-RL1d*CG33+UDL1d*CG33^2/2+IF(CG33>PosPUDL1,PUDL1d*(CG33-PosPUDL1)^2/2,0)+IF(CG33>(PosPUDL1+3),-PUDL1d*(CG33-PosPUDL1-3)^2/2,0)+IF(CG33>PosPUDL2,PUDL2d*(CG33-PosPUDL2)^2/2,0)+IF(CG33>(PosPUDL2+LePUDL2),-PUDL2d*(CG33-PosPUDL2-LePUDL2)^2/2,0)+IF(CG33>PosPLa1,PLa1d*(CG33-PosPLa1),0)+IF(CG33>PosPLb1,PLb1d*(CG33-PosPLb1),0)","v":{"v":-20.358431999999965,"d":"-20.36"}},{"$f":"-RL1d*CH33+UDL1d*CH33^2/2+IF(CH33>PosPUDL1,PUDL1d*(CH33-PosPUDL1)^2/2,0)+IF(CH33>(PosPUDL1+3),-PUDL1d*(CH33-PosPUDL1-3)^2/2,0)+IF(CH33>PosPUDL2,PUDL2d*(CH33-PosPUDL2)^2/2,0)+IF(CH33>(PosPUDL2+LePUDL2),-PUDL2d*(CH33-PosPUDL2-LePUDL2)^2/2,0)+IF(CH33>PosPLa1,PLa1d*(CH33-PosPLa1),0)+IF(CH33>PosPLb1,PLb1d*(CH33-PosPLb1),0)","v":{"v":-19.418351999999942,"d":"-19.42"}},{"$f":"-RL1d*CI33+UDL1d*CI33^2/2+IF(CI33>PosPUDL1,PUDL1d*(CI33-PosPUDL1)^2/2,0)+IF(CI33>(PosPUDL1+3),-PUDL1d*(CI33-PosPUDL1-3)^2/2,0)+IF(CI33>PosPUDL2,PUDL2d*(CI33-PosPUDL2)^2/2,0)+IF(CI33>(PosPUDL2+LePUDL2),-PUDL2d*(CI33-PosPUDL2-LePUDL2)^2/2,0)+IF(CI33>PosPLa1,PLa1d*(CI33-PosPLa1),0)+IF(CI33>PosPLb1,PLb1d*(CI33-PosPLb1),0)","v":{"v":-18.45580799999995,"d":"-18.46"}},{"$f":"-RL1d*CJ33+UDL1d*CJ33^2/2+IF(CJ33>PosPUDL1,PUDL1d*(CJ33-PosPUDL1)^2/2,0)+IF(CJ33>(PosPUDL1+3),-PUDL1d*(CJ33-PosPUDL1-3)^2/2,0)+IF(CJ33>PosPUDL2,PUDL2d*(CJ33-PosPUDL2)^2/2,0)+IF(CJ33>(PosPUDL2+LePUDL2),-PUDL2d*(CJ33-PosPUDL2-LePUDL2)^2/2,0)+IF(CJ33>PosPLa1,PLa1d*(CJ33-PosPLa1),0)+IF(CJ33>PosPLb1,PLb1d*(CJ33-PosPLb1),0)","v":{"v":-17.47079999999994,"d":"-17.47"}},{"$f":"-RL1d*CK33+UDL1d*CK33^2/2+IF(CK33>PosPUDL1,PUDL1d*(CK33-PosPUDL1)^2/2,0)+IF(CK33>(PosPUDL1+3),-PUDL1d*(CK33-PosPUDL1-3)^2/2,0)+IF(CK33>PosPUDL2,PUDL2d*(CK33-PosPUDL2)^2/2,0)+IF(CK33>(PosPUDL2+LePUDL2),-PUDL2d*(CK33-PosPUDL2-LePUDL2)^2/2,0)+IF(CK33>PosPLa1,PLa1d*(CK33-PosPLa1),0)+IF(CK33>PosPLb1,PLb1d*(CK33-PosPLb1),0)","v":{"v":-16.463327999999944,"d":"-16.46"}},{"$f":"-RL1d*CL33+UDL1d*CL33^2/2+IF(CL33>PosPUDL1,PUDL1d*(CL33-PosPUDL1)^2/2,0)+IF(CL33>(PosPUDL1+3),-PUDL1d*(CL33-PosPUDL1-3)^2/2,0)+IF(CL33>PosPUDL2,PUDL2d*(CL33-PosPUDL2)^2/2,0)+IF(CL33>(PosPUDL2+LePUDL2),-PUDL2d*(CL33-PosPUDL2-LePUDL2)^2/2,0)+IF(CL33>PosPLa1,PLa1d*(CL33-PosPLa1),0)+IF(CL33>PosPLb1,PLb1d*(CL33-PosPLb1),0)","v":{"v":-15.433391999999959,"d":"-15.43"}},{"$f":"-RL1d*CM33+UDL1d*CM33^2/2+IF(CM33>PosPUDL1,PUDL1d*(CM33-PosPUDL1)^2/2,0)+IF(CM33>(PosPUDL1+3),-PUDL1d*(CM33-PosPUDL1-3)^2/2,0)+IF(CM33>PosPUDL2,PUDL2d*(CM33-PosPUDL2)^2/2,0)+IF(CM33>(PosPUDL2+LePUDL2),-PUDL2d*(CM33-PosPUDL2-LePUDL2)^2/2,0)+IF(CM33>PosPLa1,PLa1d*(CM33-PosPLa1),0)+IF(CM33>PosPLb1,PLb1d*(CM33-PosPLb1),0)","v":{"v":-14.380991999999946,"d":"-14.38"}},{"$f":"-RL1d*CN33+UDL1d*CN33^2/2+IF(CN33>PosPUDL1,PUDL1d*(CN33-PosPUDL1)^2/2,0)+IF(CN33>(PosPUDL1+3),-PUDL1d*(CN33-PosPUDL1-3)^2/2,0)+IF(CN33>PosPUDL2,PUDL2d*(CN33-PosPUDL2)^2/2,0)+IF(CN33>(PosPUDL2+LePUDL2),-PUDL2d*(CN33-PosPUDL2-LePUDL2)^2/2,0)+IF(CN33>PosPLa1,PLa1d*(CN33-PosPLa1),0)+IF(CN33>PosPLb1,PLb1d*(CN33-PosPLb1),0)","v":{"v":-13.306127999999944,"d":"-13.31"}},{"$f":"-RL1d*CO33+UDL1d*CO33^2/2+IF(CO33>PosPUDL1,PUDL1d*(CO33-PosPUDL1)^2/2,0)+IF(CO33>(PosPUDL1+3),-PUDL1d*(CO33-PosPUDL1-3)^2/2,0)+IF(CO33>PosPUDL2,PUDL2d*(CO33-PosPUDL2)^2/2,0)+IF(CO33>(PosPUDL2+LePUDL2),-PUDL2d*(CO33-PosPUDL2-LePUDL2)^2/2,0)+IF(CO33>PosPLa1,PLa1d*(CO33-PosPLa1),0)+IF(CO33>PosPLb1,PLb1d*(CO33-PosPLb1),0)","v":{"v":-12.208799999999943,"d":"-12.21"}},{"$f":"-RL1d*CP33+UDL1d*CP33^2/2+IF(CP33>PosPUDL1,PUDL1d*(CP33-PosPUDL1)^2/2,0)+IF(CP33>(PosPUDL1+3),-PUDL1d*(CP33-PosPUDL1-3)^2/2,0)+IF(CP33>PosPUDL2,PUDL2d*(CP33-PosPUDL2)^2/2,0)+IF(CP33>(PosPUDL2+LePUDL2),-PUDL2d*(CP33-PosPUDL2-LePUDL2)^2/2,0)+IF(CP33>PosPLa1,PLa1d*(CP33-PosPLa1),0)+IF(CP33>PosPLb1,PLb1d*(CP33-PosPLb1),0)","v":{"v":-11.089007999999922,"d":"-11.09"}},{"$f":"-RL1d*CQ33+UDL1d*CQ33^2/2+IF(CQ33>PosPUDL1,PUDL1d*(CQ33-PosPUDL1)^2/2,0)+IF(CQ33>(PosPUDL1+3),-PUDL1d*(CQ33-PosPUDL1-3)^2/2,0)+IF(CQ33>PosPUDL2,PUDL2d*(CQ33-PosPUDL2)^2/2,0)+IF(CQ33>(PosPUDL2+LePUDL2),-PUDL2d*(CQ33-PosPUDL2-LePUDL2)^2/2,0)+IF(CQ33>PosPLa1,PLa1d*(CQ33-PosPLa1),0)+IF(CQ33>PosPLb1,PLb1d*(CQ33-PosPLb1),0)","v":{"v":-9.946751999999933,"d":"-9.95"}},{"$f":"-RL1d*CR33+UDL1d*CR33^2/2+IF(CR33>PosPUDL1,PUDL1d*(CR33-PosPUDL1)^2/2,0)+IF(CR33>(PosPUDL1+3),-PUDL1d*(CR33-PosPUDL1-3)^2/2,0)+IF(CR33>PosPUDL2,PUDL2d*(CR33-PosPUDL2)^2/2,0)+IF(CR33>(PosPUDL2+LePUDL2),-PUDL2d*(CR33-PosPUDL2-LePUDL2)^2/2,0)+IF(CR33>PosPLa1,PLa1d*(CR33-PosPLa1),0)+IF(CR33>PosPLb1,PLb1d*(CR33-PosPLb1),0)","v":{"v":-8.782031999999916,"d":"-8.78"}},{"$f":"-RL1d*CS33+UDL1d*CS33^2/2+IF(CS33>PosPUDL1,PUDL1d*(CS33-PosPUDL1)^2/2,0)+IF(CS33>(PosPUDL1+3),-PUDL1d*(CS33-PosPUDL1-3)^2/2,0)+IF(CS33>PosPUDL2,PUDL2d*(CS33-PosPUDL2)^2/2,0)+IF(CS33>(PosPUDL2+LePUDL2),-PUDL2d*(CS33-PosPUDL2-LePUDL2)^2/2,0)+IF(CS33>PosPLa1,PLa1d*(CS33-PosPLa1),0)+IF(CS33>PosPLb1,PLb1d*(CS33-PosPLb1),0)","v":{"v":-7.594847999999917,"d":"-7.59"}},{"$f":"-RL1d*CT33+UDL1d*CT33^2/2+IF(CT33>PosPUDL1,PUDL1d*(CT33-PosPUDL1)^2/2,0)+IF(CT33>(PosPUDL1+3),-PUDL1d*(CT33-PosPUDL1-3)^2/2,0)+IF(CT33>PosPUDL2,PUDL2d*(CT33-PosPUDL2)^2/2,0)+IF(CT33>(PosPUDL2+LePUDL2),-PUDL2d*(CT33-PosPUDL2-LePUDL2)^2/2,0)+IF(CT33>PosPLa1,PLa1d*(CT33-PosPLa1),0)+IF(CT33>PosPLb1,PLb1d*(CT33-PosPLb1),0)","v":{"v":-6.3851999999999265,"d":"-6.39"}},{"$f":"-RL1d*CU33+UDL1d*CU33^2/2+IF(CU33>PosPUDL1,PUDL1d*(CU33-PosPUDL1)^2/2,0)+IF(CU33>(PosPUDL1+3),-PUDL1d*(CU33-PosPUDL1-3)^2/2,0)+IF(CU33>PosPUDL2,PUDL2d*(CU33-PosPUDL2)^2/2,0)+IF(CU33>(PosPUDL2+LePUDL2),-PUDL2d*(CU33-PosPUDL2-LePUDL2)^2/2,0)+IF(CU33>PosPLa1,PLa1d*(CU33-PosPLa1),0)+IF(CU33>PosPLb1,PLb1d*(CU33-PosPLb1),0)","v":{"v":-5.153087999999924,"d":"-5.15"}},{"$f":"-RL1d*CV33+UDL1d*CV33^2/2+IF(CV33>PosPUDL1,PUDL1d*(CV33-PosPUDL1)^2/2,0)+IF(CV33>(PosPUDL1+3),-PUDL1d*(CV33-PosPUDL1-3)^2/2,0)+IF(CV33>PosPUDL2,PUDL2d*(CV33-PosPUDL2)^2/2,0)+IF(CV33>(PosPUDL2+LePUDL2),-PUDL2d*(CV33-PosPUDL2-LePUDL2)^2/2,0)+IF(CV33>PosPLa1,PLa1d*(CV33-PosPLa1),0)+IF(CV33>PosPLb1,PLb1d*(CV33-PosPLb1),0)","v":{"v":-3.898511999999908,"d":"-3.90"}},{"$f":"-RL1d*CW33+UDL1d*CW33^2/2+IF(CW33>PosPUDL1,PUDL1d*(CW33-PosPUDL1)^2/2,0)+IF(CW33>(PosPUDL1+3),-PUDL1d*(CW33-PosPUDL1-3)^2/2,0)+IF(CW33>PosPUDL2,PUDL2d*(CW33-PosPUDL2)^2/2,0)+IF(CW33>(PosPUDL2+LePUDL2),-PUDL2d*(CW33-PosPUDL2-LePUDL2)^2/2,0)+IF(CW33>PosPLa1,PLa1d*(CW33-PosPLa1),0)+IF(CW33>PosPLb1,PLb1d*(CW33-PosPLb1),0)","v":{"v":-2.6214719999999243,"d":"-2.62"}},{"$f":"-RL1d*CX33+UDL1d*CX33^2/2+IF(CX33>PosPUDL1,PUDL1d*(CX33-PosPUDL1)^2/2,0)+IF(CX33>(PosPUDL1+3),-PUDL1d*(CX33-PosPUDL1-3)^2/2,0)+IF(CX33>PosPUDL2,PUDL2d*(CX33-PosPUDL2)^2/2,0)+IF(CX33>(PosPUDL2+LePUDL2),-PUDL2d*(CX33-PosPUDL2-LePUDL2)^2/2,0)+IF(CX33>PosPLa1,PLa1d*(CX33-PosPLa1),0)+IF(CX33>PosPLb1,PLb1d*(CX33-PosPLb1),0)","v":{"v":-1.3219679999999272,"d":"-1.32"}},{"$f":"-RL1d*CY33+UDL1d*CY33^2/2+IF(CY33>PosPUDL1,PUDL1d*(CY33-PosPUDL1)^2/2,0)+IF(CY33>(PosPUDL1+3),-PUDL1d*(CY33-PosPUDL1-3)^2/2,0)+IF(CY33>PosPUDL2,PUDL2d*(CY33-PosPUDL2)^2/2,0)+IF(CY33>(PosPUDL2+LePUDL2),-PUDL2d*(CY33-PosPUDL2-LePUDL2)^2/2,0)+IF(CY33>PosPLa1,PLa1d*(CY33-PosPLa1),0)+IF(CY33>PosPLb1,PLb1d*(CY33-PosPLb1),0)","v":{"v":8.171241461241152e-14,"d":"0.00"}}]
[null,"Moment live [kNm]",{"v":0,"d":"0.00"},{"$f":"-RL1l*D33+2*D33^2/2+IF(D33>PosPUDL1,PUDL1l*(D33-PosPUDL1)^2/2,0)+IF(D33>(PosPUDL1+3),-PUDL1l*(D33-PosPUDL1-3)^2/2,0)+IF(D33>PosPUDL2,PUDL2l*(D33-PosPUDL2)^2/2,0)+IF(D33>(PosPUDL2+LePUDL2),-PUDL2l*(D33-PosPUDL2-LePUDL2)^2/2,0)+IF(D33>PosPLa1,PLa1l*(D33-PosPLa1),0)+IF(D33>PosPLb1,PLb1l*(D33-PosPLb1),0)","v":{"v":-0.8986000000000001,"d":"-0.90"}},{"$f":"-RL1l*E33+2*E33^2/2+IF(E33>PosPUDL1,PUDL1l*(E33-PosPUDL1)^2/2,0)+IF(E33>(PosPUDL1+3),-PUDL1l*(E33-PosPUDL1-3)^2/2,0)+IF(E33>PosPUDL2,PUDL2l*(E33-PosPUDL2)^2/2,0)+IF(E33>(PosPUDL2+LePUDL2),-PUDL2l*(E33-PosPUDL2-LePUDL2)^2/2,0)+IF(E33>PosPLa1,PLa1l*(E33-PosPLa1),0)+IF(E33>PosPLb1,PLb1l*(E33-PosPLb1),0)","v":{"v":-1.7844,"d":"-1.78"}},{"$f":"-RL1l*F33+2*F33^2/2+IF(F33>PosPUDL1,PUDL1l*(F33-PosPUDL1)^2/2,0)+IF(F33>(PosPUDL1+3),-PUDL1l*(F33-PosPUDL1-3)^2/2,0)+IF(F33>PosPUDL2,PUDL2l*(F33-PosPUDL2)^2/2,0)+IF(F33>(PosPUDL2+LePUDL2),-PUDL2l*(F33-PosPUDL2-LePUDL2)^2/2,0)+IF(F33>PosPLa1,PLa1l*(F33-PosPLa1),0)+IF(F33>PosPLb1,PLb1l*(F33-PosPLb1),0)","v":{"v":-2.6574,"d":"-2.66"}},{"$f":"-RL1l*G33+2*G33^2/2+IF(G33>PosPUDL1,PUDL1l*(G33-PosPUDL1)^2/2,0)+IF(G33>(PosPUDL1+3),-PUDL1l*(G33-PosPUDL1-3)^2/2,0)+IF(G33>PosPUDL2,PUDL2l*(G33-PosPUDL2)^2/2,0)+IF(G33>(PosPUDL2+LePUDL2),-PUDL2l*(G33-PosPUDL2-LePUDL2)^2/2,0)+IF(G33>PosPLa1,PLa1l*(G33-PosPLa1),0)+IF(G33>PosPLb1,PLb1l*(G33-PosPLb1),0)","v":{"v":-3.5176000000000003,"d":"-3.52"}},{"$f":"-RL1l*H33+2*H33^2/2+IF(H33>PosPUDL1,PUDL1l*(H33-PosPUDL1)^2/2,0)+IF(H33>(PosPUDL1+3),-PUDL1l*(H33-PosPUDL1-3)^2/2,0)+IF(H33>PosPUDL2,PUDL2l*(H33-PosPUDL2)^2/2,0)+IF(H33>(PosPUDL2+LePUDL2),-PUDL2l*(H33-PosPUDL2-LePUDL2)^2/2,0)+IF(H33>PosPLa1,PLa1l*(H33-PosPLa1),0)+IF(H33>PosPLb1,PLb1l*(H33-PosPLb1),0)","v":{"v":-4.365,"d":"-4.37"}},{"$f":"-RL1l*I33+2*I33^2/2+IF(I33>PosPUDL1,PUDL1l*(I33-PosPUDL1)^2/2,0)+IF(I33>(PosPUDL1+3),-PUDL1l*(I33-PosPUDL1-3)^2/2,0)+IF(I33>PosPUDL2,PUDL2l*(I33-PosPUDL2)^2/2,0)+IF(I33>(PosPUDL2+LePUDL2),-PUDL2l*(I33-PosPUDL2-LePUDL2)^2/2,0)+IF(I33>PosPLa1,PLa1l*(I33-PosPLa1),0)+IF(I33>PosPLb1,PLb1l*(I33-PosPLb1),0)","v":{"v":-5.1996,"d":"-5.20"}},{"$f":"-RL1l*J33+2*J33^2/2+IF(J33>PosPUDL1,PUDL1l*(J33-PosPUDL1)^2/2,0)+IF(J33>(PosPUDL1+3),-PUDL1l*(J33-PosPUDL1-3)^2/2,0)+IF(J33>PosPUDL2,PUDL2l*(J33-PosPUDL2)^2/2,0)+IF(J33>(PosPUDL2+LePUDL2),-PUDL2l*(J33-PosPUDL2-LePUDL2)^2/2,0)+IF(J33>PosPLa1,PLa1l*(J33-PosPLa1),0)+IF(J33>PosPLb1,PLb1l*(J33-PosPLb1),0)","v":{"v":-6.021400000000001,"d":"-6.02"}},{"$f":"-RL1l*K33+2*K33^2/2+IF(K33>PosPUDL1,PUDL1l*(K33-PosPUDL1)^2/2,0)+IF(K33>(PosPUDL1+3),-PUDL1l*(K33-PosPUDL1-3)^2/2,0)+IF(K33>PosPUDL2,PUDL2l*(K33-PosPUDL2)^2/2,0)+IF(K33>(PosPUDL2+LePUDL2),-PUDL2l*(K33-PosPUDL2-LePUDL2)^2/2,0)+IF(K33>PosPLa1,PLa1l*(K33-PosPLa1),0)+IF(K33>PosPLb1,PLb1l*(K33-PosPLb1),0)","v":{"v":-6.8304,"d":"-6.83"}},{"$f":"-RL1l*L33+2*L33^2/2+IF(L33>PosPUDL1,PUDL1l*(L33-PosPUDL1)^2/2,0)+IF(L33>(PosPUDL1+3),-PUDL1l*(L33-PosPUDL1-3)^2/2,0)+IF(L33>PosPUDL2,PUDL2l*(L33-PosPUDL2)^2/2,0)+IF(L33>(PosPUDL2+LePUDL2),-PUDL2l*(L33-PosPUDL2-LePUDL2)^2/2,0)+IF(L33>PosPLa1,PLa1l*(L33-PosPLa1),0)+IF(L33>PosPLb1,PLb1l*(L33-PosPLb1),0)","v":{"v":-7.6266,"d":"-7.63"}},{"$f":"-RL1l*M33+2*M33^2/2+IF(M33>PosPUDL1,PUDL1l*(M33-PosPUDL1)^2/2,0)+IF(M33>(PosPUDL1+3),-PUDL1l*(M33-PosPUDL1-3)^2/2,0)+IF(M33>PosPUDL2,PUDL2l*(M33-PosPUDL2)^2/2,0)+IF(M33>(PosPUDL2+LePUDL2),-PUDL2l*(M33-PosPUDL2-LePUDL2)^2/2,0)+IF(M33>PosPLa1,PLa1l*(M33-PosPLa1),0)+IF(M33>PosPLb1,PLb1l*(M33-PosPLb1),0)","v":{"v":-8.409999999999998,"d":"-8.41"}},{"$f":"-RL1l*N33+2*N33^2/2+IF(N33>PosPUDL1,PUDL1l*(N33-PosPUDL1)^2/2,0)+IF(N33>(PosPUDL1+3),-PUDL1l*(N33-PosPUDL1-3)^2/2,0)+IF(N33>PosPUDL2,PUDL2l*(N33-PosPUDL2)^2/2,0)+IF(N33>(PosPUDL2+LePUDL2),-PUDL2l*(N33-PosPUDL2-LePUDL2)^2/2,0)+IF(N33>PosPLa1,PLa1l*(N33-PosPLa1),0)+IF(N33>PosPLb1,PLb1l*(N33-PosPLb1),0)","v":{"v":-9.180599999999998,"d":"-9.18"}},{"$f":"-RL1l*O33+2*O33^2/2+IF(O33>PosPUDL1,PUDL1l*(O33-PosPUDL1)^2/2,0)+IF(O33>(PosPUDL1+3),-PUDL1l*(O33-PosPUDL1-3)^2/2,0)+IF(O33>PosPUDL2,PUDL2l*(O33-PosPUDL2)^2/2,0)+IF(O33>(PosPUDL2+LePUDL2),-PUDL2l*(O33-PosPUDL2-LePUDL2)^2/2,0)+IF(O33>PosPLa1,PLa1l*(O33-PosPLa1),0)+IF(O33>PosPLb1,PLb1l*(O33-PosPLb1),0)","v":{"v":-9.938399999999998,"d":"-9.94"}},{"$f":"-RL1l*P33+2*P33^2/2+IF(P33>PosPUDL1,PUDL1l*(P33-PosPUDL1)^2/2,0)+IF(P33>(PosPUDL1+3),-PUDL1l*(P33-PosPUDL1-3)^2/2,0)+IF(P33>PosPUDL2,PUDL2l*(P33-PosPUDL2)^2/2,0)+IF(P33>(PosPUDL2+LePUDL2),-PUDL2l*(P33-PosPUDL2-LePUDL2)^2/2,0)+IF(P33>PosPLa1,PLa1l*(P33-PosPLa1),0)+IF(P33>PosPLb1,PLb1l*(P33-PosPLb1),0)","v":{"v":-10.682599999999997,"d":"-10.68"}},{"$f":"-RL1l*Q33+2*Q33^2/2+IF(Q33>PosPUDL1,PUDL1l*(Q33-PosPUDL1)^2/2,0)+IF(Q33>(PosPUDL1+3),-PUDL1l*(Q33-PosPUDL1-3)^2/2,0)+IF(Q33>PosPUDL2,PUDL2l*(Q33-PosPUDL2)^2/2,0)+IF(Q33>(PosPUDL2+LePUDL2),-PUDL2l*(Q33-PosPUDL2-LePUDL2)^2/2,0)+IF(Q33>PosPLa1,PLa1l*(Q33-PosPLa1),0)+IF(Q33>PosPLb1,PLb1l*(Q33-PosPLb1),0)","v":{"v":-11.408399999999999,"d":"-11.41"}},{"$f":"-RL1l*R33+2*R33^2/2+IF(R33>PosPUDL1,PUDL1l*(R33-PosPUDL1)^2/2,0)+IF(R33>(PosPUDL1+3),-PUDL1l*(R33-PosPUDL1-3)^2/2,0)+IF(R33>PosPUDL2,PUDL2l*(R33-PosPUDL2)^2/2,0)+IF(R33>(PosPUDL2+LePUDL2),-PUDL2l*(R33-PosPUDL2-LePUDL2)^2/2,0)+IF(R33>PosPLa1,PLa1l*(R33-PosPLa1),0)+IF(R33>PosPLb1,PLb1l*(R33-PosPLb1),0)","v":{"v":-12.115,"d":"-12.12"}},{"$f":"-RL1l*S33+2*S33^2/2+IF(S33>PosPUDL1,PUDL1l*(S33-PosPUDL1)^2/2,0)+IF(S33>(PosPUDL1+3),-PUDL1l*(S33-PosPUDL1-3)^2/2,0)+IF(S33>PosPUDL2,PUDL2l*(S33-PosPUDL2)^2/2,0)+IF(S33>(PosPUDL2+LePUDL2),-PUDL2l*(S33-PosPUDL2-LePUDL2)^2/2,0)+IF(S33>PosPLa1,PLa1l*(S33-PosPLa1),0)+IF(S33>PosPLb1,PLb1l*(S33-PosPLb1),0)","v":{"v":-12.8024,"d":"-12.80"}},{"$f":"-RL1l*T33+2*T33^2/2+IF(T33>PosPUDL1,PUDL1l*(T33-PosPUDL1)^2/2,0)+IF(T33>(PosPUDL1+3),-PUDL1l*(T33-PosPUDL1-3)^2/2,0)+IF(T33>PosPUDL2,PUDL2l*(T33-PosPUDL2)^2/2,0)+IF(T33>(PosPUDL2+LePUDL2),-PUDL2l*(T33-PosPUDL2-LePUDL2)^2/2,0)+IF(T33>PosPLa1,PLa1l*(T33-PosPLa1),0)+IF(T33>PosPLb1,PLb1l*(T33-PosPLb1),0)","v":{"v":-13.470600000000001,"d":"-13.47"}},{"$f":"-RL1l*U33+2*U33^2/2+IF(U33>PosPUDL1,PUDL1l*(U33-PosPUDL1)^2/2,0)+IF(U33>(PosPUDL1+3),-PUDL1l*(U33-PosPUDL1-3)^2/2,0)+IF(U33>PosPUDL2,PUDL2l*(U33-PosPUDL2)^2/2,0)+IF(U33>(PosPUDL2+LePUDL2),-PUDL2l*(U33-PosPUDL2-LePUDL2)^2/2,0)+IF(U33>PosPLa1,PLa1l*(U33-PosPLa1),0)+IF(U33>PosPLb1,PLb1l*(U33-PosPLb1),0)","v":{"v":-14.119600000000002,"d":"-14.12"}},{"$f":"-RL1l*V33+2*V33^2/2+IF(V33>PosPUDL1,PUDL1l*(V33-PosPUDL1)^2/2,0)+IF(V33>(PosPUDL1+3),-PUDL1l*(V33-PosPUDL1-3)^2/2,0)+IF(V33>PosPUDL2,PUDL2l*(V33-PosPUDL2)^2/2,0)+IF(V33>(PosPUDL2+LePUDL2),-PUDL2l*(V33-PosPUDL2-LePUDL2)^2/2,0)+IF(V33>PosPLa1,PLa1l*(V33-PosPLa1),0)+IF(V33>PosPLb1,PLb1l*(V33-PosPLb1),0)","v":{"v":-14.749400000000003,"d":"-14.75"}},{"$f":"-RL1l*W33+2*W33^2/2+IF(W33>PosPUDL1,PUDL1l*(W33-PosPUDL1)^2/2,0)+IF(W33>(PosPUDL1+3),-PUDL1l*(W33-PosPUDL1-3)^2/2,0)+IF(W33>PosPUDL2,PUDL2l*(W33-PosPUDL2)^2/2,0)+IF(W33>(PosPUDL2+LePUDL2),-PUDL2l*(W33-PosPUDL2-LePUDL2)^2/2,0)+IF(W33>PosPLa1,PLa1l*(W33-PosPLa1),0)+IF(W33>PosPLb1,PLb1l*(W33-PosPLb1),0)","v":{"v":-15.360000000000005,"d":"-15.36"}},{"$f":"-RL1l*X33+2*X33^2/2+IF(X33>PosPUDL1,PUDL1l*(X33-PosPUDL1)^2/2,0)+IF(X33>(PosPUDL1+3),-PUDL1l*(X33-PosPUDL1-3)^2/2,0)+IF(X33>PosPUDL2,PUDL2l*(X33-PosPUDL2)^2/2,0)+IF(X33>(PosPUDL2+LePUDL2),-PUDL2l*(X33-PosPUDL2-LePUDL2)^2/2,0)+IF(X33>PosPLa1,PLa1l*(X33-PosPLa1),0)+IF(X33>PosPLb1,PLb1l*(X33-PosPLb1),0)","v":{"v":-15.951400000000001,"d":"-15.95"}},{"$f":"-RL1l*Y33+2*Y33^2/2+IF(Y33>PosPUDL1,PUDL1l*(Y33-PosPUDL1)^2/2,0)+IF(Y33>(PosPUDL1+3),-PUDL1l*(Y33-PosPUDL1-3)^2/2,0)+IF(Y33>PosPUDL2,PUDL2l*(Y33-PosPUDL2)^2/2,0)+IF(Y33>(PosPUDL2+LePUDL2),-PUDL2l*(Y33-PosPUDL2-LePUDL2)^2/2,0)+IF(Y33>PosPLa1,PLa1l*(Y33-PosPLa1),0)+IF(Y33>PosPLb1,PLb1l*(Y33-PosPLb1),0)","v":{"v":-16.523600000000002,"d":"-16.52"}},{"$f":"-RL1l*Z33+2*Z33^2/2+IF(Z33>PosPUDL1,PUDL1l*(Z33-PosPUDL1)^2/2,0)+IF(Z33>(PosPUDL1+3),-PUDL1l*(Z33-PosPUDL1-3)^2/2,0)+IF(Z33>PosPUDL2,PUDL2l*(Z33-PosPUDL2)^2/2,0)+IF(Z33>(PosPUDL2+LePUDL2),-PUDL2l*(Z33-PosPUDL2-LePUDL2)^2/2,0)+IF(Z33>PosPLa1,PLa1l*(Z33-PosPLa1),0)+IF(Z33>PosPLb1,PLb1l*(Z33-PosPLb1),0)","v":{"v":-17.0766,"d":"-17.08"}},{"$f":"-RL1l*AA33+2*AA33^2/2+IF(AA33>PosPUDL1,PUDL1l*(AA33-PosPUDL1)^2/2,0)+IF(AA33>(PosPUDL1+3),-PUDL1l*(AA33-PosPUDL1-3)^2/2,0)+IF(AA33>PosPUDL2,PUDL2l*(AA33-PosPUDL2)^2/2,0)+IF(AA33>(PosPUDL2+LePUDL2),-PUDL2l*(AA33-PosPUDL2-LePUDL2)^2/2,0)+IF(AA33>PosPLa1,PLa1l*(AA33-PosPLa1),0)+IF(AA33>PosPLb1,PLb1l*(AA33-PosPLb1),0)","v":{"v":-17.610400000000002,"d":"-17.61"}},{"$f":"-RL1l*AB33+2*AB33^2/2+IF(AB33>PosPUDL1,PUDL1l*(AB33-PosPUDL1)^2/2,0)+IF(AB33>(PosPUDL1+3),-PUDL1l*(AB33-PosPUDL1-3)^2/2,0)+IF(AB33>PosPUDL2,PUDL2l*(AB33-PosPUDL2)^2/2,0)+IF(AB33>(PosPUDL2+LePUDL2),-PUDL2l*(AB33-PosPUDL2-LePUDL2)^2/2,0)+IF(AB33>PosPLa1,PLa1l*(AB33-PosPLa1),0)+IF(AB33>PosPLb1,PLb1l*(AB33-PosPLb1),0)","v":{"v":-18.125,"d":"-18.13"}},{"$f":"-RL1l*AC33+2*AC33^2/2+IF(AC33>PosPUDL1,PUDL1l*(AC33-PosPUDL1)^2/2,0)+IF(AC33>(PosPUDL1+3),-PUDL1l*(AC33-PosPUDL1-3)^2/2,0)+IF(AC33>PosPUDL2,PUDL2l*(AC33-PosPUDL2)^2/2,0)+IF(AC33>(PosPUDL2+LePUDL2),-PUDL2l*(AC33-PosPUDL2-LePUDL2)^2/2,0)+IF(AC33>PosPLa1,PLa1l*(AC33-PosPLa1),0)+IF(AC33>PosPLb1,PLb1l*(AC33-PosPLb1),0)","v":{"v":-18.6204,"d":"-18.62"}},{"$f":"-RL1l*AD33+2*AD33^2/2+IF(AD33>PosPUDL1,PUDL1l*(AD33-PosPUDL1)^2/2,0)+IF(AD33>(PosPUDL1+3),-PUDL1l*(AD33-PosPUDL1-3)^2/2,0)+IF(AD33>PosPUDL2,PUDL2l*(AD33-PosPUDL2)^2/2,0)+IF(AD33>(PosPUDL2+LePUDL2),-PUDL2l*(AD33-PosPUDL2-LePUDL2)^2/2,0)+IF(AD33>PosPLa1,PLa1l*(AD33-PosPLa1),0)+IF(AD33>PosPLb1,PLb1l*(AD33-PosPLb1),0)","v":{"v":-19.096600000000002,"d":"-19.10"}},{"$f":"-RL1l*AE33+2*AE33^2/2+IF(AE33>PosPUDL1,PUDL1l*(AE33-PosPUDL1)^2/2,0)+IF(AE33>(PosPUDL1+3),-PUDL1l*(AE33-PosPUDL1-3)^2/2,0)+IF(AE33>PosPUDL2,PUDL2l*(AE33-PosPUDL2)^2/2,0)+IF(AE33>(PosPUDL2+LePUDL2),-PUDL2l*(AE33-PosPUDL2-LePUDL2)^2/2,0)+IF(AE33>PosPLa1,PLa1l*(AE33-PosPLa1),0)+IF(AE33>PosPLb1,PLb1l*(AE33-PosPLb1),0)","v":{"v":-19.553600000000003,"d":"-19.55"}},{"$f":"-RL1l*AF33+2*AF33^2/2+IF(AF33>PosPUDL1,PUDL1l*(AF33-PosPUDL1)^2/2,0)+IF(AF33>(PosPUDL1+3),-PUDL1l*(AF33-PosPUDL1-3)^2/2,0)+IF(AF33>PosPUDL2,PUDL2l*(AF33-PosPUDL2)^2/2,0)+IF(AF33>(PosPUDL2+LePUDL2),-PUDL2l*(AF33-PosPUDL2-LePUDL2)^2/2,0)+IF(AF33>PosPLa1,PLa1l*(AF33-PosPLa1),0)+IF(AF33>PosPLb1,PLb1l*(AF33-PosPLb1),0)","v":{"v":-19.991400000000002,"d":"-19.99"}},{"$f":"-RL1l*AG33+2*AG33^2/2+IF(AG33>PosPUDL1,PUDL1l*(AG33-PosPUDL1)^2/2,0)+IF(AG33>(PosPUDL1+3),-PUDL1l*(AG33-PosPUDL1-3)^2/2,0)+IF(AG33>PosPUDL2,PUDL2l*(AG33-PosPUDL2)^2/2,0)+IF(AG33>(PosPUDL2+LePUDL2),-PUDL2l*(AG33-PosPUDL2-LePUDL2)^2/2,0)+IF(AG33>PosPLa1,PLa1l*(AG33-PosPLa1),0)+IF(AG33>PosPLb1,PLb1l*(AG33-PosPLb1),0)","v":{"v":-20.410000000000004,"d":"-20.41"}},{"$f":"-RL1l*AH33+2*AH33^2/2+IF(AH33>PosPUDL1,PUDL1l*(AH33-PosPUDL1)^2/2,0)+IF(AH33>(PosPUDL1+3),-PUDL1l*(AH33-PosPUDL1-3)^2/2,0)+IF(AH33>PosPUDL2,PUDL2l*(AH33-PosPUDL2)^2/2,0)+IF(AH33>(PosPUDL2+LePUDL2),-PUDL2l*(AH33-PosPUDL2-LePUDL2)^2/2,0)+IF(AH33>PosPLa1,PLa1l*(AH33-PosPLa1),0)+IF(AH33>PosPLb1,PLb1l*(AH33-PosPLb1),0)","v":{"v":-20.809400000000004,"d":"-20.81"}},{"$f":"-RL1l*AI33+2*AI33^2/2+IF(AI33>PosPUDL1,PUDL1l*(AI33-PosPUDL1)^2/2,0)+IF(AI33>(PosPUDL1+3),-PUDL1l*(AI33-PosPUDL1-3)^2/2,0)+IF(AI33>PosPUDL2,PUDL2l*(AI33-PosPUDL2)^2/2,0)+IF(AI33>(PosPUDL2+LePUDL2),-PUDL2l*(AI33-PosPUDL2-LePUDL2)^2/2,0)+IF(AI33>PosPLa1,PLa1l*(AI33-PosPLa1),0)+IF(AI33>PosPLb1,PLb1l*(AI33-PosPLb1),0)","v":{"v":-21.189600000000002,"d":"-21.19"}},{"$f":"-RL1l*AJ33+2*AJ33^2/2+IF(AJ33>PosPUDL1,PUDL1l*(AJ33-PosPUDL1)^2/2,0)+IF(AJ33>(PosPUDL1+3),-PUDL1l*(AJ33-PosPUDL1-3)^2/2,0)+IF(AJ33>PosPUDL2,PUDL2l*(AJ33-PosPUDL2)^2/2,0)+IF(AJ33>(PosPUDL2+LePUDL2),-PUDL2l*(AJ33-PosPUDL2-LePUDL2)^2/2,0)+IF(AJ33>PosPLa1,PLa1l*(AJ33-PosPLa1),0)+IF(AJ33>PosPLb1,PLb1l*(AJ33-PosPLb1),0)","v":{"v":-21.550600000000006,"d":"-21.55"}},{"$f":"-RL1l*AK33+2*AK33^2/2+IF(AK33>PosPUDL1,PUDL1l*(AK33-PosPUDL1)^2/2,0)+IF(AK33>(PosPUDL1+3),-PUDL1l*(AK33-PosPUDL1-3)^2/2,0)+IF(AK33>PosPUDL2,PUDL2l*(AK33-PosPUDL2)^2/2,0)+IF(AK33>(PosPUDL2+LePUDL2),-PUDL2l*(AK33-PosPUDL2-LePUDL2)^2/2,0)+IF(AK33>PosPLa1,PLa1l*(AK33-PosPLa1),0)+IF(AK33>PosPLb1,PLb1l*(AK33-PosPLb1),0)","v":{"v":-21.892400000000006,"d":"-21.89"}},{"$f":"-RL1l*AL33+2*AL33^2/2+IF(AL33>PosPUDL1,PUDL1l*(AL33-PosPUDL1)^2/2,0)+IF(AL33>(PosPUDL1+3),-PUDL1l*(AL33-PosPUDL1-3)^2/2,0)+IF(AL33>PosPUDL2,PUDL2l*(AL33-PosPUDL2)^2/2,0)+IF(AL33>(PosPUDL2+LePUDL2),-PUDL2l*(AL33-PosPUDL2-LePUDL2)^2/2,0)+IF(AL33>PosPLa1,PLa1l*(AL33-PosPLa1),0)+IF(AL33>PosPLb1,PLb1l*(AL33-PosPLb1),0)","v":{"v":-22.215000000000003,"d":"-22.22"}},{"$f":"-RL1l*AM33+2*AM33^2/2+IF(AM33>PosPUDL1,PUDL1l*(AM33-PosPUDL1)^2/2,0)+IF(AM33>(PosPUDL1+3),-PUDL1l*(AM33-PosPUDL1-3)^2/2,0)+IF(AM33>PosPUDL2,PUDL2l*(AM33-PosPUDL2)^2/2,0)+IF(AM33>(PosPUDL2+LePUDL2),-PUDL2l*(AM33-PosPUDL2-LePUDL2)^2/2,0)+IF(AM33>PosPLa1,PLa1l*(AM33-PosPLa1),0)+IF(AM33>PosPLb1,PLb1l*(AM33-PosPLb1),0)","v":{"v":-22.518400000000003,"d":"-22.52"}},{"$f":"-RL1l*AN33+2*AN33^2/2+IF(AN33>PosPUDL1,PUDL1l*(AN33-PosPUDL1)^2/2,0)+IF(AN33>(PosPUDL1+3),-PUDL1l*(AN33-PosPUDL1-3)^2/2,0)+IF(AN33>PosPUDL2,PUDL2l*(AN33-PosPUDL2)^2/2,0)+IF(AN33>(PosPUDL2+LePUDL2),-PUDL2l*(AN33-PosPUDL2-LePUDL2)^2/2,0)+IF(AN33>PosPLa1,PLa1l*(AN33-PosPLa1),0)+IF(AN33>PosPLb1,PLb1l*(AN33-PosPLb1),0)","v":{"v":-22.8026,"d":"-22.80"}},{"$f":"-RL1l*AO33+2*AO33^2/2+IF(AO33>PosPUDL1,PUDL1l*(AO33-PosPUDL1)^2/2,0)+IF(AO33>(PosPUDL1+3),-PUDL1l*(AO33-PosPUDL1-3)^2/2,0)+IF(AO33>PosPUDL2,PUDL2l*(AO33-PosPUDL2)^2/2,0)+IF(AO33>(PosPUDL2+LePUDL2),-PUDL2l*(AO33-PosPUDL2-LePUDL2)^2/2,0)+IF(AO33>PosPLa1,PLa1l*(AO33-PosPLa1),0)+IF(AO33>PosPLb1,PLb1l*(AO33-PosPLb1),0)","v":{"v":-22.9876,"d":"-22.99"}},{"$f":"-RL1l*AP33+2*AP33^2/2+IF(AP33>PosPUDL1,PUDL1l*(AP33-PosPUDL1)^2/2,0)+IF(AP33>(PosPUDL1+3),-PUDL1l*(AP33-PosPUDL1-3)^2/2,0)+IF(AP33>PosPUDL2,PUDL2l*(AP33-PosPUDL2)^2/2,0)+IF(AP33>(PosPUDL2+LePUDL2),-PUDL2l*(AP33-PosPUDL2-LePUDL2)^2/2,0)+IF(AP33>PosPLa1,PLa1l*(AP33-PosPLa1),0)+IF(AP33>PosPLb1,PLb1l*(AP33-PosPLb1),0)","v":{"v":-23.073400000000003,"d":"-23.07"}},{"$f":"-RL1l*AQ33+2*AQ33^2/2+IF(AQ33>PosPUDL1,PUDL1l*(AQ33-PosPUDL1)^2/2,0)+IF(AQ33>(PosPUDL1+3),-PUDL1l*(AQ33-PosPUDL1-3)^2/2,0)+IF(AQ33>PosPUDL2,PUDL2l*(AQ33-PosPUDL2)^2/2,0)+IF(AQ33>(PosPUDL2+LePUDL2),-PUDL2l*(AQ33-PosPUDL2-LePUDL2)^2/2,0)+IF(AQ33>PosPLa1,PLa1l*(AQ33-PosPLa1),0)+IF(AQ33>PosPLb1,PLb1l*(AQ33-PosPLb1),0)","v":{"v":-23.140000000000004,"d":"-23.14"}},{"$f":"-RL1l*AR33+2*AR33^2/2+IF(AR33>PosPUDL1,PUDL1l*(AR33-PosPUDL1)^2/2,0)+IF(AR33>(PosPUDL1+3),-PUDL1l*(AR33-PosPUDL1-3)^2/2,0)+IF(AR33>PosPUDL2,PUDL2l*(AR33-PosPUDL2)^2/2,0)+IF(AR33>(PosPUDL2+LePUDL2),-PUDL2l*(AR33-PosPUDL2-LePUDL2)^2/2,0)+IF(AR33>PosPLa1,PLa1l*(AR33-PosPLa1),0)+IF(AR33>PosPLb1,PLb1l*(AR33-PosPLb1),0)","v":{"v":-23.187400000000004,"d":"-23.19"}},{"$f":"-RL1l*AS33+2*AS33^2/2+IF(AS33>PosPUDL1,PUDL1l*(AS33-PosPUDL1)^2/2,0)+IF(AS33>(PosPUDL1+3),-PUDL1l*(AS33-PosPUDL1-3)^2/2,0)+IF(AS33>PosPUDL2,PUDL2l*(AS33-PosPUDL2)^2/2,0)+IF(AS33>(PosPUDL2+LePUDL2),-PUDL2l*(AS33-PosPUDL2-LePUDL2)^2/2,0)+IF(AS33>PosPLa1,PLa1l*(AS33-PosPLa1),0)+IF(AS33>PosPLb1,PLb1l*(AS33-PosPLb1),0)","v":{"v":-23.215600000000002,"d":"-23.22"}},{"$f":"-RL1l*AT33+2*AT33^2/2+IF(AT33>PosPUDL1,PUDL1l*(AT33-PosPUDL1)^2/2,0)+IF(AT33>(PosPUDL1+3),-PUDL1l*(AT33-PosPUDL1-3)^2/2,0)+IF(AT33>PosPUDL2,PUDL2l*(AT33-PosPUDL2)^2/2,0)+IF(AT33>(PosPUDL2+LePUDL2),-PUDL2l*(AT33-PosPUDL2-LePUDL2)^2/2,0)+IF(AT33>PosPLa1,PLa1l*(AT33-PosPLa1),0)+IF(AT33>PosPLb1,PLb1l*(AT33-PosPLb1),0)","v":{"v":-23.224600000000002,"d":"-23.22"}},{"$f":"-RL1l*AU33+2*AU33^2/2+IF(AU33>PosPUDL1,PUDL1l*(AU33-PosPUDL1)^2/2,0)+IF(AU33>(PosPUDL1+3),-PUDL1l*(AU33-PosPUDL1-3)^2/2,0)+IF(AU33>PosPUDL2,PUDL2l*(AU33-PosPUDL2)^2/2,0)+IF(AU33>(PosPUDL2+LePUDL2),-PUDL2l*(AU33-PosPUDL2-LePUDL2)^2/2,0)+IF(AU33>PosPLa1,PLa1l*(AU33-PosPLa1),0)+IF(AU33>PosPLb1,PLb1l*(AU33-PosPLb1),0)","v":{"v":-23.2144,"d":"-23.21"}},{"$f":"-RL1l*AV33+2*AV33^2/2+IF(AV33>PosPUDL1,PUDL1l*(AV33-PosPUDL1)^2/2,0)+IF(AV33>(PosPUDL1+3),-PUDL1l*(AV33-PosPUDL1-3)^2/2,0)+IF(AV33>PosPUDL2,PUDL2l*(AV33-PosPUDL2)^2/2,0)+IF(AV33>(PosPUDL2+LePUDL2),-PUDL2l*(AV33-PosPUDL2-LePUDL2)^2/2,0)+IF(AV33>PosPLa1,PLa1l*(AV33-PosPLa1),0)+IF(AV33>PosPLb1,PLb1l*(AV33-PosPLb1),0)","v":{"v":-23.185,"d":"-23.19"}},{"$f":"-RL1l*AW33+2*AW33^2/2+IF(AW33>PosPUDL1,PUDL1l*(AW33-PosPUDL1)^2/2,0)+IF(AW33>(PosPUDL1+3),-PUDL1l*(AW33-PosPUDL1-3)^2/2,0)+IF(AW33>PosPUDL2,PUDL2l*(AW33-PosPUDL2)^2/2,0)+IF(AW33>(PosPUDL2+LePUDL2),-PUDL2l*(AW33-PosPUDL2-LePUDL2)^2/2,0)+IF(AW33>PosPLa1,PLa1l*(AW33-PosPLa1),0)+IF(AW33>PosPLb1,PLb1l*(AW33-PosPLb1),0)","v":{"v":-23.136400000000002,"d":"-23.14"}},{"$f":"-RL1l*AX33+2*AX33^2/2+IF(AX33>PosPUDL1,PUDL1l*(AX33-PosPUDL1)^2/2,0)+IF(AX33>(PosPUDL1+3),-PUDL1l*(AX33-PosPUDL1-3)^2/2,0)+IF(AX33>PosPUDL2,PUDL2l*(AX33-PosPUDL2)^2/2,0)+IF(AX33>(PosPUDL2+LePUDL2),-PUDL2l*(AX33-PosPUDL2-LePUDL2)^2/2,0)+IF(AX33>PosPLa1,PLa1l*(AX33-PosPLa1),0)+IF(AX33>PosPLb1,PLb1l*(AX33-PosPLb1),0)","v":{"v":-23.068600000000004,"d":"-23.07"}},{"$f":"-RL1l*AY33+2*AY33^2/2+IF(AY33>PosPUDL1,PUDL1l*(AY33-PosPUDL1)^2/2,0)+IF(AY33>(PosPUDL1+3),-PUDL1l*(AY33-PosPUDL1-3)^2/2,0)+IF(AY33>PosPUDL2,PUDL2l*(AY33-PosPUDL2)^2/2,0)+IF(AY33>(PosPUDL2+LePUDL2),-PUDL2l*(AY33-PosPUDL2-LePUDL2)^2/2,0)+IF(AY33>PosPLa1,PLa1l*(AY33-PosPLa1),0)+IF(AY33>PosPLb1,PLb1l*(AY33-PosPLb1),0)","v":{"v":-22.9816,"d":"-22.98"}},{"$f":"-RL1l*AZ33+2*AZ33^2/2+IF(AZ33>PosPUDL1,PUDL1l*(AZ33-PosPUDL1)^2/2,0)+IF(AZ33>(PosPUDL1+3),-PUDL1l*(AZ33-PosPUDL1-3)^2/2,0)+IF(AZ33>PosPUDL2,PUDL2l*(AZ33-PosPUDL2)^2/2,0)+IF(AZ33>(PosPUDL2+LePUDL2),-PUDL2l*(AZ33-PosPUDL2-LePUDL2)^2/2,0)+IF(AZ33>PosPLa1,PLa1l*(AZ33-PosPLa1),0)+IF(AZ33>PosPLb1,PLb1l*(AZ33-PosPLb1),0)","v":{"v":-22.8754,"d":"-22.88"}},{"$f":"-RL1l*BA33+2*BA33^2/2+IF(BA33>PosPUDL1,PUDL1l*(BA33-PosPUDL1)^2/2,0)+IF(BA33>(PosPUDL1+3),-PUDL1l*(BA33-PosPUDL1-3)^2/2,0)+IF(BA33>PosPUDL2,PUDL2l*(BA33-PosPUDL2)^2/2,0)+IF(BA33>(PosPUDL2+LePUDL2),-PUDL2l*(BA33-PosPUDL2-LePUDL2)^2/2,0)+IF(BA33>PosPLa1,PLa1l*(BA33-PosPLa1),0)+IF(BA33>PosPLb1,PLb1l*(BA33-PosPLb1),0)","v":{"v":-22.749999999999996,"d":"-22.75"}},{"$f":"-RL1l*BB33+2*BB33^2/2+IF(BB33>PosPUDL1,PUDL1l*(BB33-PosPUDL1)^2/2,0)+IF(BB33>(PosPUDL1+3),-PUDL1l*(BB33-PosPUDL1-3)^2/2,0)+IF(BB33>PosPUDL2,PUDL2l*(BB33-PosPUDL2)^2/2,0)+IF(BB33>(PosPUDL2+LePUDL2),-PUDL2l*(BB33-PosPUDL2-LePUDL2)^2/2,0)+IF(BB33>PosPLa1,PLa1l*(BB33-PosPLa1),0)+IF(BB33>PosPLb1,PLb1l*(BB33-PosPLb1),0)","v":{"v":-22.6086,"d":"-22.61"}},{"$f":"-RL1l*BC33+2*BC33^2/2+IF(BC33>PosPUDL1,PUDL1l*(BC33-PosPUDL1)^2/2,0)+IF(BC33>(PosPUDL1+3),-PUDL1l*(BC33-PosPUDL1-3)^2/2,0)+IF(BC33>PosPUDL2,PUDL2l*(BC33-PosPUDL2)^2/2,0)+IF(BC33>(PosPUDL2+LePUDL2),-PUDL2l*(BC33-PosPUDL2-LePUDL2)^2/2,0)+IF(BC33>PosPLa1,PLa1l*(BC33-PosPLa1),0)+IF(BC33>PosPLb1,PLb1l*(BC33-PosPLb1),0)","v":{"v":-22.454399999999996,"d":"-22.45"}},{"$f":"-RL1l*BD33+2*BD33^2/2+IF(BD33>PosPUDL1,PUDL1l*(BD33-PosPUDL1)^2/2,0)+IF(BD33>(PosPUDL1+3),-PUDL1l*(BD33-PosPUDL1-3)^2/2,0)+IF(BD33>PosPUDL2,PUDL2l*(BD33-PosPUDL2)^2/2,0)+IF(BD33>(PosPUDL2+LePUDL2),-PUDL2l*(BD33-PosPUDL2-LePUDL2)^2/2,0)+IF(BD33>PosPLa1,PLa1l*(BD33-PosPLa1),0)+IF(BD33>PosPLb1,PLb1l*(BD33-PosPLb1),0)","v":{"v":-22.287399999999998,"d":"-22.29"}},{"$f":"-RL1l*BE33+2*BE33^2/2+IF(BE33>PosPUDL1,PUDL1l*(BE33-PosPUDL1)^2/2,0)+IF(BE33>(PosPUDL1+3),-PUDL1l*(BE33-PosPUDL1-3)^2/2,0)+IF(BE33>PosPUDL2,PUDL2l*(BE33-PosPUDL2)^2/2,0)+IF(BE33>(PosPUDL2+LePUDL2),-PUDL2l*(BE33-PosPUDL2-LePUDL2)^2/2,0)+IF(BE33>PosPLa1,PLa1l*(BE33-PosPLa1),0)+IF(BE33>PosPLb1,PLb1l*(BE33-PosPLb1),0)","v":{"v":-22.107599999999998,"d":"-22.11"}},{"$f":"-RL1l*BF33+2*BF33^2/2+IF(BF33>PosPUDL1,PUDL1l*(BF33-PosPUDL1)^2/2,0)+IF(BF33>(PosPUDL1+3),-PUDL1l*(BF33-PosPUDL1-3)^2/2,0)+IF(BF33>PosPUDL2,PUDL2l*(BF33-PosPUDL2)^2/2,0)+IF(BF33>(PosPUDL2+LePUDL2),-PUDL2l*(BF33-PosPUDL2-LePUDL2)^2/2,0)+IF(BF33>PosPLa1,PLa1l*(BF33-PosPLa1),0)+IF(BF33>PosPLb1,PLb1l*(BF33-PosPLb1),0)","v":{"v":-21.915,"d":"-21.92"}},{"$f":"-RL1l*BG33+2*BG33^2/2+IF(BG33>PosPUDL1,PUDL1l*(BG33-PosPUDL1)^2/2,0)+IF(BG33>(PosPUDL1+3),-PUDL1l*(BG33-PosPUDL1-3)^2/2,0)+IF(BG33>PosPUDL2,PUDL2l*(BG33-PosPUDL2)^2/2,0)+IF(BG33>(PosPUDL2+LePUDL2),-PUDL2l*(BG33-PosPUDL2-LePUDL2)^2/2,0)+IF(BG33>PosPLa1,PLa1l*(BG33-PosPLa1),0)+IF(BG33>PosPLb1,PLb1l*(BG33-PosPLb1),0)","v":{"v":-21.7096,"d":"-21.71"}},{"$f":"-RL1l*BH33+2*BH33^2/2+IF(BH33>PosPUDL1,PUDL1l*(BH33-PosPUDL1)^2/2,0)+IF(BH33>(PosPUDL1+3),-PUDL1l*(BH33-PosPUDL1-3)^2/2,0)+IF(BH33>PosPUDL2,PUDL2l*(BH33-PosPUDL2)^2/2,0)+IF(BH33>(PosPUDL2+LePUDL2),-PUDL2l*(BH33-PosPUDL2-LePUDL2)^2/2,0)+IF(BH33>PosPLa1,PLa1l*(BH33-PosPLa1),0)+IF(BH33>PosPLb1,PLb1l*(BH33-PosPLb1),0)","v":{"v":-21.49139999999999,"d":"-21.49"}},{"$f":"-RL1l*BI33+2*BI33^2/2+IF(BI33>PosPUDL1,PUDL1l*(BI33-PosPUDL1)^2/2,0)+IF(BI33>(PosPUDL1+3),-PUDL1l*(BI33-PosPUDL1-3)^2/2,0)+IF(BI33>PosPUDL2,PUDL2l*(BI33-PosPUDL2)^2/2,0)+IF(BI33>(PosPUDL2+LePUDL2),-PUDL2l*(BI33-PosPUDL2-LePUDL2)^2/2,0)+IF(BI33>PosPLa1,PLa1l*(BI33-PosPLa1),0)+IF(BI33>PosPLb1,PLb1l*(BI33-PosPLb1),0)","v":{"v":-21.26039999999999,"d":"-21.26"}},{"$f":"-RL1l*BJ33+2*BJ33^2/2+IF(BJ33>PosPUDL1,PUDL1l*(BJ33-PosPUDL1)^2/2,0)+IF(BJ33>(PosPUDL1+3),-PUDL1l*(BJ33-PosPUDL1-3)^2/2,0)+IF(BJ33>PosPUDL2,PUDL2l*(BJ33-PosPUDL2)^2/2,0)+IF(BJ33>(PosPUDL2+LePUDL2),-PUDL2l*(BJ33-PosPUDL2-LePUDL2)^2/2,0)+IF(BJ33>PosPLa1,PLa1l*(BJ33-PosPLa1),0)+IF(BJ33>PosPLb1,PLb1l*(BJ33-PosPLb1),0)","v":{"v":-21.016599999999993,"d":"-21.02"}},{"$f":"-RL1l*BK33+2*BK33^2/2+IF(BK33>PosPUDL1,PUDL1l*(BK33-PosPUDL1)^2/2,0)+IF(BK33>(PosPUDL1+3),-PUDL1l*(BK33-PosPUDL1-3)^2/2,0)+IF(BK33>PosPUDL2,PUDL2l*(BK33-PosPUDL2)^2/2,0)+IF(BK33>(PosPUDL2+LePUDL2),-PUDL2l*(BK33-PosPUDL2-LePUDL2)^2/2,0)+IF(BK33>PosPLa1,PLa1l*(BK33-PosPLa1),0)+IF(BK33>PosPLb1,PLb1l*(BK33-PosPLb1),0)","v":{"v":-20.759999999999987,"d":"-20.76"}},{"$f":"-RL1l*BL33+2*BL33^2/2+IF(BL33>PosPUDL1,PUDL1l*(BL33-PosPUDL1)^2/2,0)+IF(BL33>(PosPUDL1+3),-PUDL1l*(BL33-PosPUDL1-3)^2/2,0)+IF(BL33>PosPUDL2,PUDL2l*(BL33-PosPUDL2)^2/2,0)+IF(BL33>(PosPUDL2+LePUDL2),-PUDL2l*(BL33-PosPUDL2-LePUDL2)^2/2,0)+IF(BL33>PosPLa1,PLa1l*(BL33-PosPLa1),0)+IF(BL33>PosPLb1,PLb1l*(BL33-PosPLb1),0)","v":{"v":-20.49059999999999,"d":"-20.49"}},{"$f":"-RL1l*BM33+2*BM33^2/2+IF(BM33>PosPUDL1,PUDL1l*(BM33-PosPUDL1)^2/2,0)+IF(BM33>(PosPUDL1+3),-PUDL1l*(BM33-PosPUDL1-3)^2/2,0)+IF(BM33>PosPUDL2,PUDL2l*(BM33-PosPUDL2)^2/2,0)+IF(BM33>(PosPUDL2+LePUDL2),-PUDL2l*(BM33-PosPUDL2-LePUDL2)^2/2,0)+IF(BM33>PosPLa1,PLa1l*(BM33-PosPLa1),0)+IF(BM33>PosPLb1,PLb1l*(BM33-PosPLb1),0)","v":{"v":-20.20839999999999,"d":"-20.21"}},{"$f":"-RL1l*BN33+2*BN33^2/2+IF(BN33>PosPUDL1,PUDL1l*(BN33-PosPUDL1)^2/2,0)+IF(BN33>(PosPUDL1+3),-PUDL1l*(BN33-PosPUDL1-3)^2/2,0)+IF(BN33>PosPUDL2,PUDL2l*(BN33-PosPUDL2)^2/2,0)+IF(BN33>(PosPUDL2+LePUDL2),-PUDL2l*(BN33-PosPUDL2-LePUDL2)^2/2,0)+IF(BN33>PosPLa1,PLa1l*(BN33-PosPLa1),0)+IF(BN33>PosPLb1,PLb1l*(BN33-PosPLb1),0)","v":{"v":-19.91339999999999,"d":"-19.91"}},{"$f":"-RL1l*BO33+2*BO33^2/2+IF(BO33>PosPUDL1,PUDL1l*(BO33-PosPUDL1)^2/2,0)+IF(BO33>(PosPUDL1+3),-PUDL1l*(BO33-PosPUDL1-3)^2/2,0)+IF(BO33>PosPUDL2,PUDL2l*(BO33-PosPUDL2)^2/2,0)+IF(BO33>(PosPUDL2+LePUDL2),-PUDL2l*(BO33-PosPUDL2-LePUDL2)^2/2,0)+IF(BO33>PosPLa1,PLa1l*(BO33-PosPLa1),0)+IF(BO33>PosPLb1,PLb1l*(BO33-PosPLb1),0)","v":{"v":-19.605599999999985,"d":"-19.61"}},{"$f":"-RL1l*BP33+2*BP33^2/2+IF(BP33>PosPUDL1,PUDL1l*(BP33-PosPUDL1)^2/2,0)+IF(BP33>(PosPUDL1+3),-PUDL1l*(BP33-PosPUDL1-3)^2/2,0)+IF(BP33>PosPUDL2,PUDL2l*(BP33-PosPUDL2)^2/2,0)+IF(BP33>(PosPUDL2+LePUDL2),-PUDL2l*(BP33-PosPUDL2-LePUDL2)^2/2,0)+IF(BP33>PosPLa1,PLa1l*(BP33-PosPLa1),0)+IF(BP33>PosPLb1,PLb1l*(BP33-PosPLb1),0)","v":{"v":-19.284999999999986,"d":"-19.29"}},{"$f":"-RL1l*BQ33+2*BQ33^2/2+IF(BQ33>PosPUDL1,PUDL1l*(BQ33-PosPUDL1)^2/2,0)+IF(BQ33>(PosPUDL1+3),-PUDL1l*(BQ33-PosPUDL1-3)^2/2,0)+IF(BQ33>PosPUDL2,PUDL2l*(BQ33-PosPUDL2)^2/2,0)+IF(BQ33>(PosPUDL2+LePUDL2),-PUDL2l*(BQ33-PosPUDL2-LePUDL2)^2/2,0)+IF(BQ33>PosPLa1,PLa1l*(BQ33-PosPLa1),0)+IF(BQ33>PosPLb1,PLb1l*(BQ33-PosPLb1),0)","v":{"v":-18.951599999999985,"d":"-18.95"}},{"$f":"-RL1l*BR33+2*BR33^2/2+IF(BR33>PosPUDL1,PUDL1l*(BR33-PosPUDL1)^2/2,0)+IF(BR33>(PosPUDL1+3),-PUDL1l*(BR33-PosPUDL1-3)^2/2,0)+IF(BR33>PosPUDL2,PUDL2l*(BR33-PosPUDL2)^2/2,0)+IF(BR33>(PosPUDL2+LePUDL2),-PUDL2l*(BR33-PosPUDL2-LePUDL2)^2/2,0)+IF(BR33>PosPLa1,PLa1l*(BR33-PosPLa1),0)+IF(BR33>PosPLb1,PLb1l*(BR33-PosPLb1),0)","v":{"v":-18.605399999999985,"d":"-18.61"}},{"$f":"-RL1l*BS33+2*BS33^2/2+IF(BS33>PosPUDL1,PUDL1l*(BS33-PosPUDL1)^2/2,0)+IF(BS33>(PosPUDL1+3),-PUDL1l*(BS33-PosPUDL1-3)^2/2,0)+IF(BS33>PosPUDL2,PUDL2l*(BS33-PosPUDL2)^2/2,0)+IF(BS33>(PosPUDL2+LePUDL2),-PUDL2l*(BS33-PosPUDL2-LePUDL2)^2/2,0)+IF(BS33>PosPLa1,PLa1l*(BS33-PosPLa1),0)+IF(BS33>PosPLb1,PLb1l*(BS33-PosPLb1),0)","v":{"v":-18.246399999999984,"d":"-18.25"}},{"$f":"-RL1l*BT33+2*BT33^2/2+IF(BT33>PosPUDL1,PUDL1l*(BT33-PosPUDL1)^2/2,0)+IF(BT33>(PosPUDL1+3),-PUDL1l*(BT33-PosPUDL1-3)^2/2,0)+IF(BT33>PosPUDL2,PUDL2l*(BT33-PosPUDL2)^2/2,0)+IF(BT33>(PosPUDL2+LePUDL2),-PUDL2l*(BT33-PosPUDL2-LePUDL2)^2/2,0)+IF(BT33>PosPLa1,PLa1l*(BT33-PosPLa1),0)+IF(BT33>PosPLb1,PLb1l*(BT33-PosPLb1),0)","v":{"v":-17.874599999999987,"d":"-17.87"}},{"$f":"-RL1l*BU33+2*BU33^2/2+IF(BU33>PosPUDL1,PUDL1l*(BU33-PosPUDL1)^2/2,0)+IF(BU33>(PosPUDL1+3),-PUDL1l*(BU33-PosPUDL1-3)^2/2,0)+IF(BU33>PosPUDL2,PUDL2l*(BU33-PosPUDL2)^2/2,0)+IF(BU33>(PosPUDL2+LePUDL2),-PUDL2l*(BU33-PosPUDL2-LePUDL2)^2/2,0)+IF(BU33>PosPLa1,PLa1l*(BU33-PosPLa1),0)+IF(BU33>PosPLb1,PLb1l*(BU33-PosPLb1),0)","v":{"v":-17.489999999999988,"d":"-17.49"}},{"$f":"-RL1l*BV33+2*BV33^2/2+IF(BV33>PosPUDL1,PUDL1l*(BV33-PosPUDL1)^2/2,0)+IF(BV33>(PosPUDL1+3),-PUDL1l*(BV33-PosPUDL1-3)^2/2,0)+IF(BV33>PosPUDL2,PUDL2l*(BV33-PosPUDL2)^2/2,0)+IF(BV33>(PosPUDL2+LePUDL2),-PUDL2l*(BV33-PosPUDL2-LePUDL2)^2/2,0)+IF(BV33>PosPLa1,PLa1l*(BV33-PosPLa1),0)+IF(BV33>PosPLb1,PLb1l*(BV33-PosPLb1),0)","v":{"v":-17.092599999999987,"d":"-17.09"}},{"$f":"-RL1l*BW33+2*BW33^2/2+IF(BW33>PosPUDL1,PUDL1l*(BW33-PosPUDL1)^2/2,0)+IF(BW33>(PosPUDL1+3),-PUDL1l*(BW33-PosPUDL1-3)^2/2,0)+IF(BW33>PosPUDL2,PUDL2l*(BW33-PosPUDL2)^2/2,0)+IF(BW33>(PosPUDL2+LePUDL2),-PUDL2l*(BW33-PosPUDL2-LePUDL2)^2/2,0)+IF(BW33>PosPLa1,PLa1l*(BW33-PosPLa1),0)+IF(BW33>PosPLb1,PLb1l*(BW33-PosPLb1),0)","v":{"v":-16.682399999999983,"d":"-16.68"}},{"$f":"-RL1l*BX33+2*BX33^2/2+IF(BX33>PosPUDL1,PUDL1l*(BX33-PosPUDL1)^2/2,0)+IF(BX33>(PosPUDL1+3),-PUDL1l*(BX33-PosPUDL1-3)^2/2,0)+IF(BX33>PosPUDL2,PUDL2l*(BX33-PosPUDL2)^2/2,0)+IF(BX33>(PosPUDL2+LePUDL2),-PUDL2l*(BX33-PosPUDL2-LePUDL2)^2/2,0)+IF(BX33>PosPLa1,PLa1l*(BX33-PosPLa1),0)+IF(BX33>PosPLb1,PLb1l*(BX33-PosPLb1),0)","v":{"v":-16.259399999999985,"d":"-16.26"}},{"$f":"-RL1l*BY33+2*BY33^2/2+IF(BY33>PosPUDL1,PUDL1l*(BY33-PosPUDL1)^2/2,0)+IF(BY33>(PosPUDL1+3),-PUDL1l*(BY33-PosPUDL1-3)^2/2,0)+IF(BY33>PosPUDL2,PUDL2l*(BY33-PosPUDL2)^2/2,0)+IF(BY33>(PosPUDL2+LePUDL2),-PUDL2l*(BY33-PosPUDL2-LePUDL2)^2/2,0)+IF(BY33>PosPLa1,PLa1l*(BY33-PosPLa1),0)+IF(BY33>PosPLb1,PLb1l*(BY33-PosPLb1),0)","v":{"v":-15.823599999999985,"d":"-15.82"}},{"$f":"-RL1l*BZ33+2*BZ33^2/2+IF(BZ33>PosPUDL1,PUDL1l*(BZ33-PosPUDL1)^2/2,0)+IF(BZ33>(PosPUDL1+3),-PUDL1l*(BZ33-PosPUDL1-3)^2/2,0)+IF(BZ33>PosPUDL2,PUDL2l*(BZ33-PosPUDL2)^2/2,0)+IF(BZ33>(PosPUDL2+LePUDL2),-PUDL2l*(BZ33-PosPUDL2-LePUDL2)^2/2,0)+IF(BZ33>PosPLa1,PLa1l*(BZ33-PosPLa1),0)+IF(BZ33>PosPLb1,PLb1l*(BZ33-PosPLb1),0)","v":{"v":-15.374999999999982,"d":"-15.38"}},{"$f":"-RL1l*CA33+2*CA33^2/2+IF(CA33>PosPUDL1,PUDL1l*(CA33-PosPUDL1)^2/2,0)+IF(CA33>(PosPUDL1+3),-PUDL1l*(CA33-PosPUDL1-3)^2/2,0)+IF(CA33>PosPUDL2,PUDL2l*(CA33-PosPUDL2)^2/2,0)+IF(CA33>(PosPUDL2+LePUDL2),-PUDL2l*(CA33-PosPUDL2-LePUDL2)^2/2,0)+IF(CA33>PosPLa1,PLa1l*(CA33-PosPLa1),0)+IF(CA33>PosPLb1,PLb1l*(CA33-PosPLb1),0)","v":{"v":-14.913599999999981,"d":"-14.91"}},{"$f":"-RL1l*CB33+2*CB33^2/2+IF(CB33>PosPUDL1,PUDL1l*(CB33-PosPUDL1)^2/2,0)+IF(CB33>(PosPUDL1+3),-PUDL1l*(CB33-PosPUDL1-3)^2/2,0)+IF(CB33>PosPUDL2,PUDL2l*(CB33-PosPUDL2)^2/2,0)+IF(CB33>(PosPUDL2+LePUDL2),-PUDL2l*(CB33-PosPUDL2-LePUDL2)^2/2,0)+IF(CB33>PosPLa1,PLa1l*(CB33-PosPLa1),0)+IF(CB33>PosPLb1,PLb1l*(CB33-PosPLb1),0)","v":{"v":-14.439399999999981,"d":"-14.44"}},{"$f":"-RL1l*CC33+2*CC33^2/2+IF(CC33>PosPUDL1,PUDL1l*(CC33-PosPUDL1)^2/2,0)+IF(CC33>(PosPUDL1+3),-PUDL1l*(CC33-PosPUDL1-3)^2/2,0)+IF(CC33>PosPUDL2,PUDL2l*(CC33-PosPUDL2)^2/2,0)+IF(CC33>(PosPUDL2+LePUDL2),-PUDL2l*(CC33-PosPUDL2-LePUDL2)^2/2,0)+IF(CC33>PosPLa1,PLa1l*(CC33-PosPLa1),0)+IF(CC33>PosPLb1,PLb1l*(CC33-PosPLb1),0)","v":{"v":-13.95239999999998,"d":"-13.95"}},{"$f":"-RL1l*CD33+2*CD33^2/2+IF(CD33>PosPUDL1,PUDL1l*(CD33-PosPUDL1)^2/2,0)+IF(CD33>(PosPUDL1+3),-PUDL1l*(CD33-PosPUDL1-3)^2/2,0)+IF(CD33>PosPUDL2,PUDL2l*(CD33-PosPUDL2)^2/2,0)+IF(CD33>(PosPUDL2+LePUDL2),-PUDL2l*(CD33-PosPUDL2-LePUDL2)^2/2,0)+IF(CD33>PosPLa1,PLa1l*(CD33-PosPLa1),0)+IF(CD33>PosPLb1,PLb1l*(CD33-PosPLb1),0)","v":{"v":-13.452599999999979,"d":"-13.45"}},{"$f":"-RL1l*CE33+2*CE33^2/2+IF(CE33>PosPUDL1,PUDL1l*(CE33-PosPUDL1)^2/2,0)+IF(CE33>(PosPUDL1+3),-PUDL1l*(CE33-PosPUDL1-3)^2/2,0)+IF(CE33>PosPUDL2,PUDL2l*(CE33-PosPUDL2)^2/2,0)+IF(CE33>(PosPUDL2+LePUDL2),-PUDL2l*(CE33-PosPUDL2-LePUDL2)^2/2,0)+IF(CE33>PosPLa1,PLa1l*(CE33-PosPLa1),0)+IF(CE33>PosPLb1,PLb1l*(CE33-PosPLb1),0)","v":{"v":-12.93999999999998,"d":"-12.94"}},{"$f":"-RL1l*CF33+2*CF33^2/2+IF(CF33>PosPUDL1,PUDL1l*(CF33-PosPUDL1)^2/2,0)+IF(CF33>(PosPUDL1+3),-PUDL1l*(CF33-PosPUDL1-3)^2/2,0)+IF(CF33>PosPUDL2,PUDL2l*(CF33-PosPUDL2)^2/2,0)+IF(CF33>(PosPUDL2+LePUDL2),-PUDL2l*(CF33-PosPUDL2-LePUDL2)^2/2,0)+IF(CF33>PosPLa1,PLa1l*(CF33-PosPLa1),0)+IF(CF33>PosPLb1,PLb1l*(CF33-PosPLb1),0)","v":{"v":-12.414599999999979,"d":"-12.41"}},{"$f":"-RL1l*CG33+2*CG33^2/2+IF(CG33>PosPUDL1,PUDL1l*(CG33-PosPUDL1)^2/2,0)+IF(CG33>(PosPUDL1+3),-PUDL1l*(CG33-PosPUDL1-3)^2/2,0)+IF(CG33>PosPUDL2,PUDL2l*(CG33-PosPUDL2)^2/2,0)+IF(CG33>(PosPUDL2+LePUDL2),-PUDL2l*(CG33-PosPUDL2-LePUDL2)^2/2,0)+IF(CG33>PosPLa1,PLa1l*(CG33-PosPLa1),0)+IF(CG33>PosPLb1,PLb1l*(CG33-PosPLb1),0)","v":{"v":-11.876399999999979,"d":"-11.88"}},{"$f":"-RL1l*CH33+2*CH33^2/2+IF(CH33>PosPUDL1,PUDL1l*(CH33-PosPUDL1)^2/2,0)+IF(CH33>(PosPUDL1+3),-PUDL1l*(CH33-PosPUDL1-3)^2/2,0)+IF(CH33>PosPUDL2,PUDL2l*(CH33-PosPUDL2)^2/2,0)+IF(CH33>(PosPUDL2+LePUDL2),-PUDL2l*(CH33-PosPUDL2-LePUDL2)^2/2,0)+IF(CH33>PosPLa1,PLa1l*(CH33-PosPLa1),0)+IF(CH33>PosPLb1,PLb1l*(CH33-PosPLb1),0)","v":{"v":-11.325399999999977,"d":"-11.33"}},{"$f":"-RL1l*CI33+2*CI33^2/2+IF(CI33>PosPUDL1,PUDL1l*(CI33-PosPUDL1)^2/2,0)+IF(CI33>(PosPUDL1+3),-PUDL1l*(CI33-PosPUDL1-3)^2/2,0)+IF(CI33>PosPUDL2,PUDL2l*(CI33-PosPUDL2)^2/2,0)+IF(CI33>(PosPUDL2+LePUDL2),-PUDL2l*(CI33-PosPUDL2-LePUDL2)^2/2,0)+IF(CI33>PosPLa1,PLa1l*(CI33-PosPLa1),0)+IF(CI33>PosPLb1,PLb1l*(CI33-PosPLb1),0)","v":{"v":-10.761599999999977,"d":"-10.76"}},{"$f":"-RL1l*CJ33+2*CJ33^2/2+IF(CJ33>PosPUDL1,PUDL1l*(CJ33-PosPUDL1)^2/2,0)+IF(CJ33>(PosPUDL1+3),-PUDL1l*(CJ33-PosPUDL1-3)^2/2,0)+IF(CJ33>PosPUDL2,PUDL2l*(CJ33-PosPUDL2)^2/2,0)+IF(CJ33>(PosPUDL2+LePUDL2),-PUDL2l*(CJ33-PosPUDL2-LePUDL2)^2/2,0)+IF(CJ33>PosPLa1,PLa1l*(CJ33-PosPLa1),0)+IF(CJ33>PosPLb1,PLb1l*(CJ33-PosPLb1),0)","v":{"v":-10.184999999999974,"d":"-10.19"}},{"$f":"-RL1l*CK33+2*CK33^2/2+IF(CK33>PosPUDL1,PUDL1l*(CK33-PosPUDL1)^2/2,0)+IF(CK33>(PosPUDL1+3),-PUDL1l*(CK33-PosPUDL1-3)^2/2,0)+IF(CK33>PosPUDL2,PUDL2l*(CK33-PosPUDL2)^2/2,0)+IF(CK33>(PosPUDL2+LePUDL2),-PUDL2l*(CK33-PosPUDL2-LePUDL2)^2/2,0)+IF(CK33>PosPLa1,PLa1l*(CK33-PosPLa1),0)+IF(CK33>PosPLb1,PLb1l*(CK33-PosPLb1),0)","v":{"v":-9.595599999999973,"d":"-9.60"}},{"$f":"-RL1l*CL33+2*CL33^2/2+IF(CL33>PosPUDL1,PUDL1l*(CL33-PosPUDL1)^2/2,0)+IF(CL33>(PosPUDL1+3),-PUDL1l*(CL33-PosPUDL1-3)^2/2,0)+IF(CL33>PosPUDL2,PUDL2l*(CL33-PosPUDL2)^2/2,0)+IF(CL33>(PosPUDL2+LePUDL2),-PUDL2l*(CL33-PosPUDL2-LePUDL2)^2/2,0)+IF(CL33>PosPLa1,PLa1l*(CL33-PosPLa1),0)+IF(CL33>PosPLb1,PLb1l*(CL33-PosPLb1),0)","v":{"v":-8.99339999999998,"d":"-8.99"}},{"$f":"-RL1l*CM33+2*CM33^2/2+IF(CM33>PosPUDL1,PUDL1l*(CM33-PosPUDL1)^2/2,0)+IF(CM33>(PosPUDL1+3),-PUDL1l*(CM33-PosPUDL1-3)^2/2,0)+IF(CM33>PosPUDL2,PUDL2l*(CM33-PosPUDL2)^2/2,0)+IF(CM33>(PosPUDL2+LePUDL2),-PUDL2l*(CM33-PosPUDL2-LePUDL2)^2/2,0)+IF(CM33>PosPLa1,PLa1l*(CM33-PosPLa1),0)+IF(CM33>PosPLb1,PLb1l*(CM33-PosPLb1),0)","v":{"v":-8.37839999999997,"d":"-8.38"}},{"$f":"-RL1l*CN33+2*CN33^2/2+IF(CN33>PosPUDL1,PUDL1l*(CN33-PosPUDL1)^2/2,0)+IF(CN33>(PosPUDL1+3),-PUDL1l*(CN33-PosPUDL1-3)^2/2,0)+IF(CN33>PosPUDL2,PUDL2l*(CN33-PosPUDL2)^2/2,0)+IF(CN33>(PosPUDL2+LePUDL2),-PUDL2l*(CN33-PosPUDL2-LePUDL2)^2/2,0)+IF(CN33>PosPLa1,PLa1l*(CN33-PosPLa1),0)+IF(CN33>PosPLb1,PLb1l*(CN33-PosPLb1),0)","v":{"v":-7.750599999999956,"d":"-7.75"}},{"$f":"-RL1l*CO33+2*CO33^2/2+IF(CO33>PosPUDL1,PUDL1l*(CO33-PosPUDL1)^2/2,0)+IF(CO33>(PosPUDL1+3),-PUDL1l*(CO33-PosPUDL1-3)^2/2,0)+IF(CO33>PosPUDL2,PUDL2l*(CO33-PosPUDL2)^2/2,0)+IF(CO33>(PosPUDL2+LePUDL2),-PUDL2l*(CO33-PosPUDL2-LePUDL2)^2/2,0)+IF(CO33>PosPLa1,PLa1l*(CO33-PosPLa1),0)+IF(CO33>PosPLb1,PLb1l*(CO33-PosPLb1),0)","v":{"v":-7.109999999999957,"d":"-7.11"}},{"$f":"-RL1l*CP33+2*CP33^2/2+IF(CP33>PosPUDL1,PUDL1l*(CP33-PosPUDL1)^2/2,0)+IF(CP33>(PosPUDL1+3),-PUDL1l*(CP33-PosPUDL1-3)^2/2,0)+IF(CP33>PosPUDL2,PUDL2l*(CP33-PosPUDL2)^2/2,0)+IF(CP33>(PosPUDL2+LePUDL2),-PUDL2l*(CP33-PosPUDL2-LePUDL2)^2/2,0)+IF(CP33>PosPLa1,PLa1l*(CP33-PosPLa1),0)+IF(CP33>PosPLb1,PLb1l*(CP33-PosPLb1),0)","v":{"v":-6.4565999999999555,"d":"-6.46"}},{"$f":"-RL1l*CQ33+2*CQ33^2/2+IF(CQ33>PosPUDL1,PUDL1l*(CQ33-PosPUDL1)^2/2,0)+IF(CQ33>(PosPUDL1+3),-PUDL1l*(CQ33-PosPUDL1-3)^2/2,0)+IF(CQ33>PosPUDL2,PUDL2l*(CQ33-PosPUDL2)^2/2,0)+IF(CQ33>(PosPUDL2+LePUDL2),-PUDL2l*(CQ33-PosPUDL2-LePUDL2)^2/2,0)+IF(CQ33>PosPLa1,PLa1l*(CQ33-PosPLa1),0)+IF(CQ33>PosPLb1,PLb1l*(CQ33-PosPLb1),0)","v":{"v":-5.790399999999957,"d":"-5.79"}},{"$f":"-RL1l*CR33+2*CR33^2/2+IF(CR33>PosPUDL1,PUDL1l*(CR33-PosPUDL1)^2/2,0)+IF(CR33>(PosPUDL1+3),-PUDL1l*(CR33-PosPUDL1-3)^2/2,0)+IF(CR33>PosPUDL2,PUDL2l*(CR33-PosPUDL2)^2/2,0)+IF(CR33>(PosPUDL2+LePUDL2),-PUDL2l*(CR33-PosPUDL2-LePUDL2)^2/2,0)+IF(CR33>PosPLa1,PLa1l*(CR33-PosPLa1),0)+IF(CR33>PosPLb1,PLb1l*(CR33-PosPLb1),0)","v":{"v":-5.1113999999999535,"d":"-5.11"}},{"$f":"-RL1l*CS33+2*CS33^2/2+IF(CS33>PosPUDL1,PUDL1l*(CS33-PosPUDL1)^2/2,0)+IF(CS33>(PosPUDL1+3),-PUDL1l*(CS33-PosPUDL1-3)^2/2,0)+IF(CS33>PosPUDL2,PUDL2l*(CS33-PosPUDL2)^2/2,0)+IF(CS33>(PosPUDL2+LePUDL2),-PUDL2l*(CS33-PosPUDL2-LePUDL2)^2/2,0)+IF(CS33>PosPLa1,PLa1l*(CS33-PosPLa1),0)+IF(CS33>PosPLb1,PLb1l*(CS33-PosPLb1),0)","v":{"v":-4.419599999999953,"d":"-4.42"}},{"$f":"-RL1l*CT33+2*CT33^2/2+IF(CT33>PosPUDL1,PUDL1l*(CT33-PosPUDL1)^2/2,0)+IF(CT33>(PosPUDL1+3),-PUDL1l*(CT33-PosPUDL1-3)^2/2,0)+IF(CT33>PosPUDL2,PUDL2l*(CT33-PosPUDL2)^2/2,0)+IF(CT33>(PosPUDL2+LePUDL2),-PUDL2l*(CT33-PosPUDL2-LePUDL2)^2/2,0)+IF(CT33>PosPLa1,PLa1l*(CT33-PosPLa1),0)+IF(CT33>PosPLb1,PLb1l*(CT33-PosPLb1),0)","v":{"v":-3.71499999999995,"d":"-3.71"}},{"$f":"-RL1l*CU33+2*CU33^2/2+IF(CU33>PosPUDL1,PUDL1l*(CU33-PosPUDL1)^2/2,0)+IF(CU33>(PosPUDL1+3),-PUDL1l*(CU33-PosPUDL1-3)^2/2,0)+IF(CU33>PosPUDL2,PUDL2l*(CU33-PosPUDL2)^2/2,0)+IF(CU33>(PosPUDL2+LePUDL2),-PUDL2l*(CU33-PosPUDL2-LePUDL2)^2/2,0)+IF(CU33>PosPLa1,PLa1l*(CU33-PosPLa1),0)+IF(CU33>PosPLb1,PLb1l*(CU33-PosPLb1),0)","v":{"v":-2.9975999999999487,"d":"-3.00"}},{"$f":"-RL1l*CV33+2*CV33^2/2+IF(CV33>PosPUDL1,PUDL1l*(CV33-PosPUDL1)^2/2,0)+IF(CV33>(PosPUDL1+3),-PUDL1l*(CV33-PosPUDL1-3)^2/2,0)+IF(CV33>PosPUDL2,PUDL2l*(CV33-PosPUDL2)^2/2,0)+IF(CV33>(PosPUDL2+LePUDL2),-PUDL2l*(CV33-PosPUDL2-LePUDL2)^2/2,0)+IF(CV33>PosPLa1,PLa1l*(CV33-PosPLa1),0)+IF(CV33>PosPLb1,PLb1l*(CV33-PosPLb1),0)","v":{"v":-2.2673999999999435,"d":"-2.27"}},{"$f":"-RL1l*CW33+2*CW33^2/2+IF(CW33>PosPUDL1,PUDL1l*(CW33-PosPUDL1)^2/2,0)+IF(CW33>(PosPUDL1+3),-PUDL1l*(CW33-PosPUDL1-3)^2/2,0)+IF(CW33>PosPUDL2,PUDL2l*(CW33-PosPUDL2)^2/2,0)+IF(CW33>(PosPUDL2+LePUDL2),-PUDL2l*(CW33-PosPUDL2-LePUDL2)^2/2,0)+IF(CW33>PosPLa1,PLa1l*(CW33-PosPLa1),0)+IF(CW33>PosPLb1,PLb1l*(CW33-PosPLb1),0)","v":{"v":-1.5243999999999467,"d":"-1.52"}},{"$f":"-RL1l*CX33+2*CX33^2/2+IF(CX33>PosPUDL1,PUDL1l*(CX33-PosPUDL1)^2/2,0)+IF(CX33>(PosPUDL1+3),-PUDL1l*(CX33-PosPUDL1-3)^2/2,0)+IF(CX33>PosPUDL2,PUDL2l*(CX33-PosPUDL2)^2/2,0)+IF(CX33>(PosPUDL2+LePUDL2),-PUDL2l*(CX33-PosPUDL2-LePUDL2)^2/2,0)+IF(CX33>PosPLa1,PLa1l*(CX33-PosPLa1),0)+IF(CX33>PosPLb1,PLb1l*(CX33-PosPLb1),0)","v":{"v":-0.768599999999946,"d":"-0.77"}},{"$f":"-RL1l*CY33+2*CY33^2/2+IF(CY33>PosPUDL1,PUDL1l*(CY33-PosPUDL1)^2/2,0)+IF(CY33>(PosPUDL1+3),-PUDL1l*(CY33-PosPUDL1-3)^2/2,0)+IF(CY33>PosPUDL2,PUDL2l*(CY33-PosPUDL2)^2/2,0)+IF(CY33>(PosPUDL2+LePUDL2),-PUDL2l*(CY33-PosPUDL2-LePUDL2)^2/2,0)+IF(CY33>PosPLa1,PLa1l*(CY33-PosPLa1),0)+IF(CY33>PosPLb1,PLb1l*(CY33-PosPLb1),0)","v":{"v":5.3290705182007514E-14,"d":"0.00"}}]
[null,"Shear dead [kN]",{"$f":"RL1d","v":{"v":19.415,"d":"19.42"}},{"$f":"RL1d-UDL1d*D33-IF(D33>PosPUDL1,PUDL1d*(D33-PosPUDL1),0)-IF(D33>(PosPUDL1+3),-PUDL1d*(D33-PosPUDL1-3),0)-IF(D33>PosPUDL2,PUDL2d*(D33-PosPUDL2),0)-IF(D33>(PosPUDL2+LePUDL2),-PUDL2d*(D33-PosPUDL2-LePUDL2),0)-IF(D33>PosPLa1,PLa1d,0)-IF(D33>PosPLb1,PLb1d,0)","v":{"v":19.1342,"d":"19.13"}},{"$f":"RL1d-UDL1d*E33-IF(E33>PosPUDL1,PUDL1d*(E33-PosPUDL1),0)-IF(E33>(PosPUDL1+3),-PUDL1d*(E33-PosPUDL1-3),0)-IF(E33>PosPUDL2,PUDL2d*(E33-PosPUDL2),0)-IF(E33>(PosPUDL2+LePUDL2),-PUDL2d*(E33-PosPUDL2-LePUDL2),0)-IF(E33>PosPLa1,PLa1d,0)-IF(E33>PosPLb1,PLb1d,0)","v":{"v":18.8534,"d":"18.85"}},{"$f":"RL1d-UDL1d*F33-IF(F33>PosPUDL1,PUDL1d*(F33-PosPUDL1),0)-IF(F33>(PosPUDL1+3),-PUDL1d*(F33-PosPUDL1-3),0)-IF(F33>PosPUDL2,PUDL2d*(F33-PosPUDL2),0)-IF(F33>(PosPUDL2+LePUDL2),-PUDL2d*(F33-PosPUDL2-LePUDL2),0)-IF(F33>PosPLa1,PLa1d,0)-IF(F33>PosPLb1,PLb1d,0)","v":{"v":18.572599999999998,"d":"18.57"}},{"$f":"RL1d-UDL1d*G33-IF(G33>PosPUDL1,PUDL1d*(G33-PosPUDL1),0)-IF(G33>(PosPUDL1+3),-PUDL1d*(G33-PosPUDL1-3),0)-IF(G33>PosPUDL2,PUDL2d*(G33-PosPUDL2),0)-IF(G33>(PosPUDL2+LePUDL2),-PUDL2d*(G33-PosPUDL2-LePUDL2),0)-IF(G33>PosPLa1,PLa1d,0)-IF(G33>PosPLb1,PLb1d,0)","v":{"v":18.2918,"d":"18.29"}},{"$f":"RL1d-UDL1d*H33-IF(H33>PosPUDL1,PUDL1d*(H33-PosPUDL1),0)-IF(H33>(PosPUDL1+3),-PUDL1d*(H33-PosPUDL1-3),0)-IF(H33>PosPUDL2,PUDL2d*(H33-PosPUDL2),0)-IF(H33>(PosPUDL2+LePUDL2),-PUDL2d*(H33-PosPUDL2-LePUDL2),0)-IF(H33>PosPLa1,PLa1d,0)-IF(H33>PosPLb1,PLb1d,0)","v":{"v":18.011,"d":"18.01"}},{"$f":"RL1d-UDL1d*I33-IF(I33>PosPUDL1,PUDL1d*(I33-PosPUDL1),0)-IF(I33>(PosPUDL1+3),-PUDL1d*(I33-PosPUDL1-3),0)-IF(I33>PosPUDL2,PUDL2d*(I33-PosPUDL2),0)-IF(I33>(PosPUDL2+LePUDL2),-PUDL2d*(I33-PosPUDL2-LePUDL2),0)-IF(I33>PosPLa1,PLa1d,0)-IF(I33>PosPLb1,PLb1d,0)","v":{"v":17.7302,"d":"17.73"}},{"$f":"RL1d-UDL1d*J33-IF(J33>PosPUDL1,PUDL1d*(J33-PosPUDL1),0)-IF(J33>(PosPUDL1+3),-PUDL1d*(J33-PosPUDL1-3),0)-IF(J33>PosPUDL2,PUDL2d*(J33-PosPUDL2),0)-IF(J33>(PosPUDL2+LePUDL2),-PUDL2d*(J33-PosPUDL2-LePUDL2),0)-IF(J33>PosPLa1,PLa1d,0)-IF(J33>PosPLb1,PLb1d,0)","v":{"v":17.4494,"d":"17.45"}},{"$f":"RL1d-UDL1d*K33-IF(K33>PosPUDL1,PUDL1d*(K33-PosPUDL1),0)-IF(K33>(PosPUDL1+3),-PUDL1d*(K33-PosPUDL1-3),0)-IF(K33>PosPUDL2,PUDL2d*(K33-PosPUDL2),0)-IF(K33>(PosPUDL2+LePUDL2),-PUDL2d*(K33-PosPUDL2-LePUDL2),0)-IF(K33>PosPLa1,PLa1d,0)-IF(K33>PosPLb1,PLb1d,0)","v":{"v":17.168599999999998,"d":"17.17"}},{"$f":"RL1d-UDL1d*L33-IF(L33>PosPUDL1,PUDL1d*(L33-PosPUDL1),0)-IF(L33>(PosPUDL1+3),-PUDL1d*(L33-PosPUDL1-3),0)-IF(L33>PosPUDL2,PUDL2d*(L33-PosPUDL2),0)-IF(L33>(PosPUDL2+LePUDL2),-PUDL2d*(L33-PosPUDL2-LePUDL2),0)-IF(L33>PosPLa1,PLa1d,0)-IF(L33>PosPLb1,PLb1d,0)","v":{"v":16.8878,"d":"16.89"}},{"$f":"RL1d-UDL1d*M33-IF(M33>PosPUDL1,PUDL1d*(M33-PosPUDL1),0)-IF(M33>(PosPUDL1+3),-PUDL1d*(M33-PosPUDL1-3),0)-IF(M33>PosPUDL2,PUDL2d*(M33-PosPUDL2),0)-IF(M33>(PosPUDL2+LePUDL2),-PUDL2d*(M33-PosPUDL2-LePUDL2),0)-IF(M33>PosPLa1,PLa1d,0)-IF(M33>PosPLb1,PLb1d,0)","v":{"v":16.607,"d":"16.61"}},{"$f":"RL1d-UDL1d*N33-IF(N33>PosPUDL1,PUDL1d*(N33-PosPUDL1),0)-IF(N33>(PosPUDL1+3),-PUDL1d*(N33-PosPUDL1-3),0)-IF(N33>PosPUDL2,PUDL2d*(N33-PosPUDL2),0)-IF(N33>(PosPUDL2+LePUDL2),-PUDL2d*(N33-PosPUDL2-LePUDL2),0)-IF(N33>PosPLa1,PLa1d,0)-IF(N33>PosPLb1,PLb1d,0)","v":{"v":16.3262,"d":"16.33"}},{"$f":"RL1d-UDL1d*O33-IF(O33>PosPUDL1,PUDL1d*(O33-PosPUDL1),0)-IF(O33>(PosPUDL1+3),-PUDL1d*(O33-PosPUDL1-3),0)-IF(O33>PosPUDL2,PUDL2d*(O33-PosPUDL2),0)-IF(O33>(PosPUDL2+LePUDL2),-PUDL2d*(O33-PosPUDL2-LePUDL2),0)-IF(O33>PosPLa1,PLa1d,0)-IF(O33>PosPLb1,PLb1d,0)","v":{"v":16.0454,"d":"16.05"}},{"$f":"RL1d-UDL1d*P33-IF(P33>PosPUDL1,PUDL1d*(P33-PosPUDL1),0)-IF(P33>(PosPUDL1+3),-PUDL1d*(P33-PosPUDL1-3),0)-IF(P33>PosPUDL2,PUDL2d*(P33-PosPUDL2),0)-IF(P33>(PosPUDL2+LePUDL2),-PUDL2d*(P33-PosPUDL2-LePUDL2),0)-IF(P33>PosPLa1,PLa1d,0)-IF(P33>PosPLb1,PLb1d,0)","v":{"v":15.6846,"d":"15.68"}},{"$f":"RL1d-UDL1d*Q33-IF(Q33>PosPUDL1,PUDL1d*(Q33-PosPUDL1),0)-IF(Q33>(PosPUDL1+3),-PUDL1d*(Q33-PosPUDL1-3),0)-IF(Q33>PosPUDL2,PUDL2d*(Q33-PosPUDL2),0)-IF(Q33>(PosPUDL2+LePUDL2),-PUDL2d*(Q33-PosPUDL2-LePUDL2),0)-IF(Q33>PosPLa1,PLa1d,0)-IF(Q33>PosPLb1,PLb1d,0)","v":{"v":15.2438,"d":"15.24"}},{"$f":"RL1d-UDL1d*R33-IF(R33>PosPUDL1,PUDL1d*(R33-PosPUDL1),0)-IF(R33>(PosPUDL1+3),-PUDL1d*(R33-PosPUDL1-3),0)-IF(R33>PosPUDL2,PUDL2d*(R33-PosPUDL2),0)-IF(R33>(PosPUDL2+LePUDL2),-PUDL2d*(R33-PosPUDL2-LePUDL2),0)-IF(R33>PosPLa1,PLa1d,0)-IF(R33>PosPLb1,PLb1d,0)","v":{"v":14.802999999999999,"d":"14.80"}},{"$f":"RL1d-UDL1d*S33-IF(S33>PosPUDL1,PUDL1d*(S33-PosPUDL1),0)-IF(S33>(PosPUDL1+3),-PUDL1d*(S33-PosPUDL1-3),0)-IF(S33>PosPUDL2,PUDL2d*(S33-PosPUDL2),0)-IF(S33>(PosPUDL2+LePUDL2),-PUDL2d*(S33-PosPUDL2-LePUDL2),0)-IF(S33>PosPLa1,PLa1d,0)-IF(S33>PosPLb1,PLb1d,0)","v":{"v":14.3622,"d":"14.36"}},{"$f":"RL1d-UDL1d*T33-IF(T33>PosPUDL1,PUDL1d*(T33-PosPUDL1),0)-IF(T33>(PosPUDL1+3),-PUDL1d*(T33-PosPUDL1-3),0)-IF(T33>PosPUDL2,PUDL2d*(T33-PosPUDL2),0)-IF(T33>(PosPUDL2+LePUDL2),-PUDL2d*(T33-PosPUDL2-LePUDL2),0)-IF(T33>PosPLa1,PLa1d,0)-IF(T33>PosPLb1,PLb1d,0)","v":{"v":13.921399999999998,"d":"13.92"}},{"$f":"RL1d-UDL1d*U33-IF(U33>PosPUDL1,PUDL1d*(U33-PosPUDL1),0)-IF(U33>(PosPUDL1+3),-PUDL1d*(U33-PosPUDL1-3),0)-IF(U33>PosPUDL2,PUDL2d*(U33-PosPUDL2),0)-IF(U33>(PosPUDL2+LePUDL2),-PUDL2d*(U33-PosPUDL2-LePUDL2),0)-IF(U33>PosPLa1,PLa1d,0)-IF(U33>PosPLb1,PLb1d,0)","v":{"v":13.480599999999997,"d":"13.48"}},{"$f":"RL1d-UDL1d*V33-IF(V33>PosPUDL1,PUDL1d*(V33-PosPUDL1),0)-IF(V33>(PosPUDL1+3),-PUDL1d*(V33-PosPUDL1-3),0)-IF(V33>PosPUDL2,PUDL2d*(V33-PosPUDL2),0)-IF(V33>(PosPUDL2+LePUDL2),-PUDL2d*(V33-PosPUDL2-LePUDL2),0)-IF(V33>PosPLa1,PLa1d,0)-IF(V33>PosPLb1,PLb1d,0)","v":{"v":13.039799999999998,"d":"13.04"}},{"$f":"RL1d-UDL1d*W33-IF(W33>PosPUDL1,PUDL1d*(W33-PosPUDL1),0)-IF(W33>(PosPUDL1+3),-PUDL1d*(W33-PosPUDL1-3),0)-IF(W33>PosPUDL2,PUDL2d*(W33-PosPUDL2),0)-IF(W33>(PosPUDL2+LePUDL2),-PUDL2d*(W33-PosPUDL2-LePUDL2),0)-IF(W33>PosPLa1,PLa1d,0)-IF(W33>PosPLb1,PLb1d,0)","v":{"v":12.598999999999998,"d":"12.60"}},{"$f":"RL1d-UDL1d*X33-IF(X33>PosPUDL1,PUDL1d*(X33-PosPUDL1),0)-IF(X33>(PosPUDL1+3),-PUDL1d*(X33-PosPUDL1-3),0)-IF(X33>PosPUDL2,PUDL2d*(X33-PosPUDL2),0)-IF(X33>(PosPUDL2+LePUDL2),-PUDL2d*(X33-PosPUDL2-LePUDL2),0)-IF(X33>PosPLa1,PLa1d,0)-IF(X33>PosPLb1,PLb1d,0)","v":{"v":12.158199999999997,"d":"12.16"}},{"$f":"RL1d-UDL1d*Y33-IF(Y33>PosPUDL1,PUDL1d*(Y33-PosPUDL1),0)-IF(Y33>(PosPUDL1+3),-PUDL1d*(Y33-PosPUDL1-3),0)-IF(Y33>PosPUDL2,PUDL2d*(Y33-PosPUDL2),0)-IF(Y33>(PosPUDL2+LePUDL2),-PUDL2d*(Y33-PosPUDL2-LePUDL2),0)-IF(Y33>PosPLa1,PLa1d,0)-IF(Y33>PosPLb1,PLb1d,0)","v":{"v":11.717399999999996,"d":"11.72"}},{"$f":"RL1d-UDL1d*Z33-IF(Z33>PosPUDL1,PUDL1d*(Z33-PosPUDL1),0)-IF(Z33>(PosPUDL1+3),-PUDL1d*(Z33-PosPUDL1-3),0)-IF(Z33>PosPUDL2,PUDL2d*(Z33-PosPUDL2),0)-IF(Z33>(PosPUDL2+LePUDL2),-PUDL2d*(Z33-PosPUDL2-LePUDL2),0)-IF(Z33>PosPLa1,PLa1d,0)-IF(Z33>PosPLb1,PLb1d,0)","v":{"v":11.276599999999997,"d":"11.28"}},{"$f":"RL1d-UDL1d*AA33-IF(AA33>PosPUDL1,PUDL1d*(AA33-PosPUDL1),0)-IF(AA33>(PosPUDL1+3),-PUDL1d*(AA33-PosPUDL1-3),0)-IF(AA33>PosPUDL2,PUDL2d*(AA33-PosPUDL2),0)-IF(AA33>(PosPUDL2+LePUDL2),-PUDL2d*(AA33-PosPUDL2-LePUDL2),0)-IF(AA33>PosPLa1,PLa1d,0)-IF(AA33>PosPLb1,PLb1d,0)","v":{"v":10.835799999999995,"d":"10.84"}},{"$f":"RL1d-UDL1d*AB33-IF(AB33>PosPUDL1,PUDL1d*(AB33-PosPUDL1),0)-IF(AB33>(PosPUDL1+3),-PUDL1d*(AB33-PosPUDL1-3),0)-IF(AB33>PosPUDL2,PUDL2d*(AB33-PosPUDL2),0)-IF(AB33>(PosPUDL2+LePUDL2),-PUDL2d*(AB33-PosPUDL2-LePUDL2),0)-IF(AB33>PosPLa1,PLa1d,0)-IF(AB33>PosPLb1,PLb1d,0)","v":{"v":10.394999999999996,"d":"10.40"}},{"$f":"RL1d-UDL1d*AC33-IF(AC33>PosPUDL1,PUDL1d*(AC33-PosPUDL1),0)-IF(AC33>(PosPUDL1+3),-PUDL1d*(AC33-PosPUDL1-3),0)-IF(AC33>PosPUDL2,PUDL2d*(AC33-PosPUDL2),0)-IF(AC33>(PosPUDL2+LePUDL2),-PUDL2d*(AC33-PosPUDL2-LePUDL2),0)-IF(AC33>PosPLa1,PLa1d,0)-IF(AC33>PosPLb1,PLb1d,0)","v":{"v":9.954199999999997,"d":"9.95"}},{"$f":"RL1d-UDL1d*AD33-IF(AD33>PosPUDL1,PUDL1d*(AD33-PosPUDL1),0)-IF(AD33>(PosPUDL1+3),-PUDL1d*(AD33-PosPUDL1-3),0)-IF(AD33>PosPUDL2,PUDL2d*(AD33-PosPUDL2),0)-IF(AD33>(PosPUDL2+LePUDL2),-PUDL2d*(AD33-PosPUDL2-LePUDL2),0)-IF(AD33>PosPLa1,PLa1d,0)-IF(AD33>PosPLb1,PLb1d,0)","v":{"v":9.513399999999997,"d":"9.51"}},{"$f":"RL1d-UDL1d*AE33-IF(AE33>PosPUDL1,PUDL1d*(AE33-PosPUDL1),0)-IF(AE33>(PosPUDL1+3),-PUDL1d*(AE33-PosPUDL1-3),0)-IF(AE33>PosPUDL2,PUDL2d*(AE33-PosPUDL2),0)-IF(AE33>(PosPUDL2+LePUDL2),-PUDL2d*(AE33-PosPUDL2-LePUDL2),0)-IF(AE33>PosPLa1,PLa1d,0)-IF(AE33>PosPLb1,PLb1d,0)","v":{"v":9.072599999999998,"d":"9.07"}},{"$f":"RL1d-UDL1d*AF33-IF(AF33>PosPUDL1,PUDL1d*(AF33-PosPUDL1),0)-IF(AF33>(PosPUDL1+3),-PUDL1d*(AF33-PosPUDL1-3),0)-IF(AF33>PosPUDL2,PUDL2d*(AF33-PosPUDL2),0)-IF(AF33>(PosPUDL2+LePUDL2),-PUDL2d*(AF33-PosPUDL2-LePUDL2),0)-IF(AF33>PosPLa1,PLa1d,0)-IF(AF33>PosPLb1,PLb1d,0)","v":{"v":8.631799999999995,"d":"8.63"}},{"$f":"RL1d-UDL1d*AG33-IF(AG33>PosPUDL1,PUDL1d*(AG33-PosPUDL1),0)-IF(AG33>(PosPUDL1+3),-PUDL1d*(AG33-PosPUDL1-3),0)-IF(AG33>PosPUDL2,PUDL2d*(AG33-PosPUDL2),0)-IF(AG33>(PosPUDL2+LePUDL2),-PUDL2d*(AG33-PosPUDL2-LePUDL2),0)-IF(AG33>PosPLa1,PLa1d,0)-IF(AG33>PosPLb1,PLb1d,0)","v":{"v":8.190999999999995,"d":"8.19"}},{"$f":"RL1d-UDL1d*AH33-IF(AH33>PosPUDL1,PUDL1d*(AH33-PosPUDL1),0)-IF(AH33>(PosPUDL1+3),-PUDL1d*(AH33-PosPUDL1-3),0)-IF(AH33>PosPUDL2,PUDL2d*(AH33-PosPUDL2),0)-IF(AH33>(PosPUDL2+LePUDL2),-PUDL2d*(AH33-PosPUDL2-LePUDL2),0)-IF(AH33>PosPLa1,PLa1d,0)-IF(AH33>PosPLb1,PLb1d,0)","v":{"v":7.750199999999995,"d":"7.75"}},{"$f":"RL1d-UDL1d*AI33-IF(AI33>PosPUDL1,PUDL1d*(AI33-PosPUDL1),0)-IF(AI33>(PosPUDL1+3),-PUDL1d*(AI33-PosPUDL1-3),0)-IF(AI33>PosPUDL2,PUDL2d*(AI33-PosPUDL2),0)-IF(AI33>(PosPUDL2+LePUDL2),-PUDL2d*(AI33-PosPUDL2-LePUDL2),0)-IF(AI33>PosPLa1,PLa1d,0)-IF(AI33>PosPLb1,PLb1d,0)","v":{"v":7.309399999999994,"d":"7.31"}},{"$f":"RL1d-UDL1d*AJ33-IF(AJ33>PosPUDL1,PUDL1d*(AJ33-PosPUDL1),0)-IF(AJ33>(PosPUDL1+3),-PUDL1d*(AJ33-PosPUDL1-3),0)-IF(AJ33>PosPUDL2,PUDL2d*(AJ33-PosPUDL2),0)-IF(AJ33>(PosPUDL2+LePUDL2),-PUDL2d*(AJ33-PosPUDL2-LePUDL2),0)-IF(AJ33>PosPLa1,PLa1d,0)-IF(AJ33>PosPLb1,PLb1d,0)","v":{"v":6.8685999999999945,"d":"6.87"}},{"$f":"RL1d-UDL1d*AK33-IF(AK33>PosPUDL1,PUDL1d*(AK33-PosPUDL1),0)-IF(AK33>(PosPUDL1+3),-PUDL1d*(AK33-PosPUDL1-3),0)-IF(AK33>PosPUDL2,PUDL2d*(AK33-PosPUDL2),0)-IF(AK33>(PosPUDL2+LePUDL2),-PUDL2d*(AK33-PosPUDL2-LePUDL2),0)-IF(AK33>PosPLa1,PLa1d,0)-IF(AK33>PosPLb1,PLb1d,0)","v":{"v":6.427799999999993,"d":"6.43"}},{"$f":"RL1d-UDL1d*AL33-IF(AL33>PosPUDL1,PUDL1d*(AL33-PosPUDL1),0)-IF(AL33>(PosPUDL1+3),-PUDL1d*(AL33-PosPUDL1-3),0)-IF(AL33>PosPUDL2,PUDL2d*(AL33-PosPUDL2),0)-IF(AL33>(PosPUDL2+LePUDL2),-PUDL2d*(AL33-PosPUDL2-LePUDL2),0)-IF(AL33>PosPLa1,PLa1d,0)-IF(AL33>PosPLb1,PLb1d,0)","v":{"v":5.986999999999994,"d":"5.99"}},{"$f":"RL1d-UDL1d*AM33-IF(AM33>PosPUDL1,PUDL1d*(AM33-PosPUDL1),0)-IF(AM33>(PosPUDL1+3),-PUDL1d*(AM33-PosPUDL1-3),0)-IF(AM33>PosPUDL2,PUDL2d*(AM33-PosPUDL2),0)-IF(AM33>(PosPUDL2+LePUDL2),-PUDL2d*(AM33-PosPUDL2-LePUDL2),0)-IF(AM33>PosPLa1,PLa1d,0)-IF(AM33>PosPLb1,PLb1d,0)","v":{"v":5.546199999999993,"d":"5.55"}},{"$f":"RL1d-UDL1d*AN33-IF(AN33>PosPUDL1,PUDL1d*(AN33-PosPUDL1),0)-IF(AN33>(PosPUDL1+3),-PUDL1d*(AN33-PosPUDL1-3),0)-IF(AN33>PosPUDL2,PUDL2d*(AN33-PosPUDL2),0)-IF(AN33>(PosPUDL2+LePUDL2),-PUDL2d*(AN33-PosPUDL2-LePUDL2),0)-IF(AN33>PosPLa1,PLa1d,0)-IF(AN33>PosPLb1,PLb1d,0)","v":{"v":5.105399999999993,"d":"5.11"}},{"$f":"RL1d-UDL1d*AO33-IF(AO33>PosPUDL1,PUDL1d*(AO33-PosPUDL1),0)-IF(AO33>(PosPUDL1+3),-PUDL1d*(AO33-PosPUDL1-3),0)-IF(AO33>PosPUDL2,PUDL2d*(AO33-PosPUDL2),0)-IF(AO33>(PosPUDL2+LePUDL2),-PUDL2d*(AO33-PosPUDL2-LePUDL2),0)-IF(AO33>PosPLa1,PLa1d,0)-IF(AO33>PosPLb1,PLb1d,0)","v":{"v":2.664599999999992,"d":"2.66"}},{"$f":"RL1d-UDL1d*AP33-IF(AP33>PosPUDL1,PUDL1d*(AP33-PosPUDL1),0)-IF(AP33>(PosPUDL1+3),-PUDL1d*(AP33-PosPUDL1-3),0)-IF(AP33>PosPUDL2,PUDL2d*(AP33-PosPUDL2),0)-IF(AP33>(PosPUDL2+LePUDL2),-PUDL2d*(AP33-PosPUDL2-LePUDL2),0)-IF(AP33>PosPLa1,PLa1d,0)-IF(AP33>PosPLb1,PLb1d,0)","v":{"v":2.2237999999999927,"d":"2.22"}},{"$f":"RL1d-UDL1d*AQ33-IF(AQ33>PosPUDL1,PUDL1d*(AQ33-PosPUDL1),0)-IF(AQ33>(PosPUDL1+3),-PUDL1d*(AQ33-PosPUDL1-3),0)-IF(AQ33>PosPUDL2,PUDL2d*(AQ33-PosPUDL2),0)-IF(AQ33>(PosPUDL2+LePUDL2),-PUDL2d*(AQ33-PosPUDL2-LePUDL2),0)-IF(AQ33>PosPLa1,PLa1d,0)-IF(AQ33>PosPLb1,PLb1d,0)","v":{"v":1.7829999999999915,"d":"1.78"}},{"$f":"RL1d-UDL1d*AR33-IF(AR33>PosPUDL1,PUDL1d*(AR33-PosPUDL1),0)-IF(AR33>(PosPUDL1+3),-PUDL1d*(AR33-PosPUDL1-3),0)-IF(AR33>PosPUDL2,PUDL2d*(AR33-PosPUDL2),0)-IF(AR33>(PosPUDL2+LePUDL2),-PUDL2d*(AR33-PosPUDL2-LePUDL2),0)-IF(AR33>PosPLa1,PLa1d,0)-IF(AR33>PosPLb1,PLb1d,0)","v":{"v":1.3421999999999903,"d":"1.34"}},{"$f":"RL1d-UDL1d*AS33-IF(AS33>PosPUDL1,PUDL1d*(AS33-PosPUDL1),0)-IF(AS33>(PosPUDL1+3),-PUDL1d*(AS33-PosPUDL1-3),0)-IF(AS33>PosPUDL2,PUDL2d*(AS33-PosPUDL2),0)-IF(AS33>(PosPUDL2+LePUDL2),-PUDL2d*(AS33-PosPUDL2-LePUDL2),0)-IF(AS33>PosPLa1,PLa1d,0)-IF(AS33>PosPLb1,PLb1d,0)","v":{"v":0.9013999999999909,"d":"0.90"}},{"$f":"RL1d-UDL1d*AT33-IF(AT33>PosPUDL1,PUDL1d*(AT33-PosPUDL1),0)-IF(AT33>(PosPUDL1+3),-PUDL1d*(AT33-PosPUDL1-3),0)-IF(AT33>PosPUDL2,PUDL2d*(AT33-PosPUDL2),0)-IF(AT33>(PosPUDL2+LePUDL2),-PUDL2d*(AT33-PosPUDL2-LePUDL2),0)-IF(AT33>PosPLa1,PLa1d,0)-IF(AT33>PosPLb1,PLb1d,0)","v":{"v":0.4605999999999897,"d":"0.46"}},{"$f":"RL1d-UDL1d*AU33-IF(AU33>PosPUDL1,PUDL1d*(AU33-PosPUDL1),0)-IF(AU33>(PosPUDL1+3),-PUDL1d*(AU33-PosPUDL1-3),0)-IF(AU33>PosPUDL2,PUDL2d*(AU33-PosPUDL2),0)-IF(AU33>(PosPUDL2+LePUDL2),-PUDL2d*(AU33-PosPUDL2-LePUDL2),0)-IF(AU33>PosPLa1,PLa1d,0)-IF(AU33>PosPLb1,PLb1d,0)","v":{"v":0.01979999999999027,"d":"0.02"}},{"$f":"RL1d-UDL1d*AV33-IF(AV33>PosPUDL1,PUDL1d*(AV33-PosPUDL1),0)-IF(AV33>(PosPUDL1+3),-PUDL1d*(AV33-PosPUDL1-3),0)-IF(AV33>PosPUDL2,PUDL2d*(AV33-PosPUDL2),0)-IF(AV33>(PosPUDL2+LePUDL2),-PUDL2d*(AV33-PosPUDL2-LePUDL2),0)-IF(AV33>PosPLa1,PLa1d,0)-IF(AV33>PosPLb1,PLb1d,0)","v":{"v":-0.4210000000000109,"d":"-0.42"}},{"$f":"RL1d-UDL1d*AW33-IF(AW33>PosPUDL1,PUDL1d*(AW33-PosPUDL1),0)-IF(AW33>(PosPUDL1+3),-PUDL1d*(AW33-PosPUDL1-3),0)-IF(AW33>PosPUDL2,PUDL2d*(AW33-PosPUDL2),0)-IF(AW33>(PosPUDL2+LePUDL2),-PUDL2d*(AW33-PosPUDL2-LePUDL2),0)-IF(AW33>PosPLa1,PLa1d,0)-IF(AW33>PosPLb1,PLb1d,0)","v":{"v":-0.8618000000000103,"d":"-0.86"}},{"$f":"RL1d-UDL1d*AX33-IF(AX33>PosPUDL1,PUDL1d*(AX33-PosPUDL1),0)-IF(AX33>(PosPUDL1+3),-PUDL1d*(AX33-PosPUDL1-3),0)-IF(AX33>PosPUDL2,PUDL2d*(AX33-PosPUDL2),0)-IF(AX33>(PosPUDL2+LePUDL2),-PUDL2d*(AX33-PosPUDL2-LePUDL2),0)-IF(AX33>PosPLa1,PLa1d,0)-IF(AX33>PosPLb1,PLb1d,0)","v":{"v":-1.3026000000000115,"d":"-1.30"}},{"$f":"RL1d-UDL1d*AY33-IF(AY33>PosPUDL1,PUDL1d*(AY33-PosPUDL1),0)-IF(AY33>(PosPUDL1+3),-PUDL1d*(AY33-PosPUDL1-3),0)-IF(AY33>PosPUDL2,PUDL2d*(AY33-PosPUDL2),0)-IF(AY33>(PosPUDL2+LePUDL2),-PUDL2d*(AY33-PosPUDL2-LePUDL2),0)-IF(AY33>PosPLa1,PLa1d,0)-IF(AY33>PosPLb1,PLb1d,0)","v":{"v":-1.743400000000011,"d":"-1.74"}},{"$f":"RL1d-UDL1d*AZ33-IF(AZ33>PosPUDL1,PUDL1d*(AZ33-PosPUDL1),0)-IF(AZ33>(PosPUDL1+3),-PUDL1d*(AZ33-PosPUDL1-3),0)-IF(AZ33>PosPUDL2,PUDL2d*(AZ33-PosPUDL2),0)-IF(AZ33>(PosPUDL2+LePUDL2),-PUDL2d*(AZ33-PosPUDL2-LePUDL2),0)-IF(AZ33>PosPLa1,PLa1d,0)-IF(AZ33>PosPLb1,PLb1d,0)","v":{"v":-2.184200000000012,"d":"-2.18"}},{"$f":"RL1d-UDL1d*BA33-IF(BA33>PosPUDL1,PUDL1d*(BA33-PosPUDL1),0)-IF(BA33>(PosPUDL1+3),-PUDL1d*(BA33-PosPUDL1-3),0)-IF(BA33>PosPUDL2,PUDL2d*(BA33-PosPUDL2),0)-IF(BA33>(PosPUDL2+LePUDL2),-PUDL2d*(BA33-PosPUDL2-LePUDL2),0)-IF(BA33>PosPLa1,PLa1d,0)-IF(BA33>PosPLb1,PLb1d,0)","v":{"v":-2.6250000000000107,"d":"-2.63"}},{"$f":"RL1d-UDL1d*BB33-IF(BB33>PosPUDL1,PUDL1d*(BB33-PosPUDL1),0)-IF(BB33>(PosPUDL1+3),-PUDL1d*(BB33-PosPUDL1-3),0)-IF(BB33>PosPUDL2,PUDL2d*(BB33-PosPUDL2),0)-IF(BB33>(PosPUDL2+LePUDL2),-PUDL2d*(BB33-PosPUDL2-LePUDL2),0)-IF(BB33>PosPLa1,PLa1d,0)-IF(BB33>PosPLb1,PLb1d,0)","v":{"v":-2.9058000000000064,"d":"-2.91"}},{"$f":"RL1d-UDL1d*BC33-IF(BC33>PosPUDL1,PUDL1d*(BC33-PosPUDL1),0)-IF(BC33>(PosPUDL1+3),-PUDL1d*(BC33-PosPUDL1-3),0)-IF(BC33>PosPUDL2,PUDL2d*(BC33-PosPUDL2),0)-IF(BC33>(PosPUDL2+LePUDL2),-PUDL2d*(BC33-PosPUDL2-LePUDL2),0)-IF(BC33>PosPLa1,PLa1d,0)-IF(BC33>PosPLb1,PLb1d,0)","v":{"v":-3.1866000000000074,"d":"-3.19"}},{"$f":"RL1d-UDL1d*BD33-IF(BD33>PosPUDL1,PUDL1d*(BD33-PosPUDL1),0)-IF(BD33>(PosPUDL1+3),-PUDL1d*(BD33-PosPUDL1-3),0)-IF(BD33>PosPUDL2,PUDL2d*(BD33-PosPUDL2),0)-IF(BD33>(PosPUDL2+LePUDL2),-PUDL2d*(BD33-PosPUDL2-LePUDL2),0)-IF(BD33>PosPLa1,PLa1d,0)-IF(BD33>PosPLb1,PLb1d,0)","v":{"v":-3.4674000000000067,"d":"-3.47"}},{"$f":"RL1d-UDL1d*BE33-IF(BE33>PosPUDL1,PUDL1d*(BE33-PosPUDL1),0)-IF(BE33>(PosPUDL1+3),-PUDL1d*(BE33-PosPUDL1-3),0)-IF(BE33>PosPUDL2,PUDL2d*(BE33-PosPUDL2),0)-IF(BE33>(PosPUDL2+LePUDL2),-PUDL2d*(BE33-PosPUDL2-LePUDL2),0)-IF(BE33>PosPLa1,PLa1d,0)-IF(BE33>PosPLb1,PLb1d,0)","v":{"v":-3.7482000000000077,"d":"-3.75"}},{"$f":"RL1d-UDL1d*BF33-IF(BF33>PosPUDL1,PUDL1d*(BF33-PosPUDL1),0)-IF(BF33>(PosPUDL1+3),-PUDL1d*(BF33-PosPUDL1-3),0)-IF(BF33>PosPUDL2,PUDL2d*(BF33-PosPUDL2),0)-IF(BF33>(PosPUDL2+LePUDL2),-PUDL2d*(BF33-PosPUDL2-LePUDL2),0)-IF(BF33>PosPLa1,PLa1d,0)-IF(BF33>PosPLb1,PLb1d,0)","v":{"v":-4.029000000000007,"d":"-4.03"}},{"$f":"RL1d-UDL1d*BG33-IF(BG33>PosPUDL1,PUDL1d*(BG33-PosPUDL1),0)-IF(BG33>(PosPUDL1+3),-PUDL1d*(BG33-PosPUDL1-3),0)-IF(BG33>PosPUDL2,PUDL2d*(BG33-PosPUDL2),0)-IF(BG33>(PosPUDL2+LePUDL2),-PUDL2d*(BG33-PosPUDL2-LePUDL2),0)-IF(BG33>PosPLa1,PLa1d,0)-IF(BG33>PosPLb1,PLb1d,0)","v":{"v":-4.309800000000008,"d":"-4.31"}},{"$f":"RL1d-UDL1d*BH33-IF(BH33>PosPUDL1,PUDL1d*(BH33-PosPUDL1),0)-IF(BH33>(PosPUDL1+3),-PUDL1d*(BH33-PosPUDL1-3),0)-IF(BH33>PosPUDL2,PUDL2d*(BH33-PosPUDL2),0)-IF(BH33>(PosPUDL2+LePUDL2),-PUDL2d*(BH33-PosPUDL2-LePUDL2),0)-IF(BH33>PosPLa1,PLa1d,0)-IF(BH33>PosPLb1,PLb1d,0)","v":{"v":-4.590600000000009,"d":"-4.59"}},{"$f":"RL1d-UDL1d*BI33-IF(BI33>PosPUDL1,PUDL1d*(BI33-PosPUDL1),0)-IF(BI33>(PosPUDL1+3),-PUDL1d*(BI33-PosPUDL1-3),0)-IF(BI33>PosPUDL2,PUDL2d*(BI33-PosPUDL2),0)-IF(BI33>(PosPUDL2+LePUDL2),-PUDL2d*(BI33-PosPUDL2-LePUDL2),0)-IF(BI33>PosPLa1,PLa1d,0)-IF(BI33>PosPLb1,PLb1d,0)","v":{"v":-4.871400000000008,"d":"-4.87"}},{"$f":"RL1d-UDL1d*BJ33-IF(BJ33>PosPUDL1,PUDL1d*(BJ33-PosPUDL1),0)-IF(BJ33>(PosPUDL1+3),-PUDL1d*(BJ33-PosPUDL1-3),0)-IF(BJ33>PosPUDL2,PUDL2d*(BJ33-PosPUDL2),0)-IF(BJ33>(PosPUDL2+LePUDL2),-PUDL2d*(BJ33-PosPUDL2-LePUDL2),0)-IF(BJ33>PosPLa1,PLa1d,0)-IF(BJ33>PosPLb1,PLb1d,0)","v":{"v":-5.152200000000008,"d":"-5.15"}},{"$f":"RL1d-UDL1d*BK33-IF(BK33>PosPUDL1,PUDL1d*(BK33-PosPUDL1),0)-IF(BK33>(PosPUDL1+3),-PUDL1d*(BK33-PosPUDL1-3),0)-IF(BK33>PosPUDL2,PUDL2d*(BK33-PosPUDL2),0)-IF(BK33>(PosPUDL2+LePUDL2),-PUDL2d*(BK33-PosPUDL2-LePUDL2),0)-IF(BK33>PosPLa1,PLa1d,0)-IF(BK33>PosPLb1,PLb1d,0)","v":{"v":-5.433000000000007,"d":"-5.43"}},{"$f":"RL1d-UDL1d*BL33-IF(BL33>PosPUDL1,PUDL1d*(BL33-PosPUDL1),0)-IF(BL33>(PosPUDL1+3),-PUDL1d*(BL33-PosPUDL1-3),0)-IF(BL33>PosPUDL2,PUDL2d*(BL33-PosPUDL2),0)-IF(BL33>(PosPUDL2+LePUDL2),-PUDL2d*(BL33-PosPUDL2-LePUDL2),0)-IF(BL33>PosPLa1,PLa1d,0)-IF(BL33>PosPLb1,PLb1d,0)","v":{"v":-5.71380000000001,"d":"-5.71"}},{"$f":"RL1d-UDL1d*BM33-IF(BM33>PosPUDL1,PUDL1d*(BM33-PosPUDL1),0)-IF(BM33>(PosPUDL1+3),-PUDL1d*(BM33-PosPUDL1-3),0)-IF(BM33>PosPUDL2,PUDL2d*(BM33-PosPUDL2),0)-IF(BM33>(PosPUDL2+LePUDL2),-PUDL2d*(BM33-PosPUDL2-LePUDL2),0)-IF(BM33>PosPLa1,PLa1d,0)-IF(BM33>PosPLb1,PLb1d,0)","v":{"v":-5.994600000000009,"d":"-5.99"}},{"$f":"RL1d-UDL1d*BN33-IF(BN33>PosPUDL1,PUDL1d*(BN33-PosPUDL1),0)-IF(BN33>(PosPUDL1+3),-PUDL1d*(BN33-PosPUDL1-3),0)-IF(BN33>PosPUDL2,PUDL2d*(BN33-PosPUDL2),0)-IF(BN33>(PosPUDL2+LePUDL2),-PUDL2d*(BN33-PosPUDL2-LePUDL2),0)-IF(BN33>PosPLa1,PLa1d,0)-IF(BN33>PosPLb1,PLb1d,0)","v":{"v":-6.275400000000008,"d":"-6.28"}},{"$f":"RL1d-UDL1d*BO33-IF(BO33>PosPUDL1,PUDL1d*(BO33-PosPUDL1),0)-IF(BO33>(PosPUDL1+3),-PUDL1d*(BO33-PosPUDL1-3),0)-IF(BO33>PosPUDL2,PUDL2d*(BO33-PosPUDL2),0)-IF(BO33>(PosPUDL2+LePUDL2),-PUDL2d*(BO33-PosPUDL2-LePUDL2),0)-IF(BO33>PosPLa1,PLa1d,0)-IF(BO33>PosPLb1,PLb1d,0)","v":{"v":-6.556200000000011,"d":"-6.56"}},{"$f":"RL1d-UDL1d*BP33-IF(BP33>PosPUDL1,PUDL1d*(BP33-PosPUDL1),0)-IF(BP33>(PosPUDL1+3),-PUDL1d*(BP33-PosPUDL1-3),0)-IF(BP33>PosPUDL2,PUDL2d*(BP33-PosPUDL2),0)-IF(BP33>(PosPUDL2+LePUDL2),-PUDL2d*(BP33-PosPUDL2-LePUDL2),0)-IF(BP33>PosPLa1,PLa1d,0)-IF(BP33>PosPLb1,PLb1d,0)","v":{"v":-6.83700000000001,"d":"-6.84"}},{"$f":"RL1d-UDL1d*BQ33-IF(BQ33>PosPUDL1,PUDL1d*(BQ33-PosPUDL1),0)-IF(BQ33>(PosPUDL1+3),-PUDL1d*(BQ33-PosPUDL1-3),0)-IF(BQ33>PosPUDL2,PUDL2d*(BQ33-PosPUDL2),0)-IF(BQ33>(PosPUDL2+LePUDL2),-PUDL2d*(BQ33-PosPUDL2-LePUDL2),0)-IF(BQ33>PosPLa1,PLa1d,0)-IF(BQ33>PosPLb1,PLb1d,0)","v":{"v":-7.11780000000001,"d":"-7.12"}},{"$f":"RL1d-UDL1d*BR33-IF(BR33>PosPUDL1,PUDL1d*(BR33-PosPUDL1),0)-IF(BR33>(PosPUDL1+3),-PUDL1d*(BR33-PosPUDL1-3),0)-IF(BR33>PosPUDL2,PUDL2d*(BR33-PosPUDL2),0)-IF(BR33>(PosPUDL2+LePUDL2),-PUDL2d*(BR33-PosPUDL2-LePUDL2),0)-IF(BR33>PosPLa1,PLa1d,0)-IF(BR33>PosPLb1,PLb1d,0)","v":{"v":-7.398600000000009,"d":"-7.40"}},{"$f":"RL1d-UDL1d*BS33-IF(BS33>PosPUDL1,PUDL1d*(BS33-PosPUDL1),0)-IF(BS33>(PosPUDL1+3),-PUDL1d*(BS33-PosPUDL1-3),0)-IF(BS33>PosPUDL2,PUDL2d*(BS33-PosPUDL2),0)-IF(BS33>(PosPUDL2+LePUDL2),-PUDL2d*(BS33-PosPUDL2-LePUDL2),0)-IF(BS33>PosPLa1,PLa1d,0)-IF(BS33>PosPLb1,PLb1d,0)","v":{"v":-7.679400000000012,"d":"-7.68"}},{"$f":"RL1d-UDL1d*BT33-IF(BT33>PosPUDL1,PUDL1d*(BT33-PosPUDL1),0)-IF(BT33>(PosPUDL1+3),-PUDL1d*(BT33-PosPUDL1-3),0)-IF(BT33>PosPUDL2,PUDL2d*(BT33-PosPUDL2),0)-IF(BT33>(PosPUDL2+LePUDL2),-PUDL2d*(BT33-PosPUDL2-LePUDL2),0)-IF(BT33>PosPLa1,PLa1d,0)-IF(BT33>PosPLb1,PLb1d,0)","v":{"v":-7.960200000000011,"d":"-7.96"}},{"$f":"RL1d-UDL1d*BU33-IF(BU33>PosPUDL1,PUDL1d*(BU33-PosPUDL1),0)-IF(BU33>(PosPUDL1+3),-PUDL1d*(BU33-PosPUDL1-3),0)-IF(BU33>PosPUDL2,PUDL2d*(BU33-PosPUDL2),0)-IF(BU33>(PosPUDL2+LePUDL2),-PUDL2d*(BU33-PosPUDL2-LePUDL2),0)-IF(BU33>PosPLa1,PLa1d,0)-IF(BU33>PosPLb1,PLb1d,0)","v":{"v":-8.24100000000001,"d":"-8.24"}},{"$f":"RL1d-UDL1d*BV33-IF(BV33>PosPUDL1,PUDL1d*(BV33-PosPUDL1),0)-IF(BV33>(PosPUDL1+3),-PUDL1d*(BV33-PosPUDL1-3),0)-IF(BV33>PosPUDL2,PUDL2d*(BV33-PosPUDL2),0)-IF(BV33>(PosPUDL2+LePUDL2),-PUDL2d*(BV33-PosPUDL2-LePUDL2),0)-IF(BV33>PosPLa1,PLa1d,0)-IF(BV33>PosPLb1,PLb1d,0)","v":{"v":-8.52180000000001,"d":"-8.52"}},{"$f":"RL1d-UDL1d*BW33-IF(BW33>PosPUDL1,PUDL1d*(BW33-PosPUDL1),0)-IF(BW33>(PosPUDL1+3),-PUDL1d*(BW33-PosPUDL1-3),0)-IF(BW33>PosPUDL2,PUDL2d*(BW33-PosPUDL2),0)-IF(BW33>(PosPUDL2+LePUDL2),-PUDL2d*(BW33-PosPUDL2-LePUDL2),0)-IF(BW33>PosPLa1,PLa1d,0)-IF(BW33>PosPLb1,PLb1d,0)","v":{"v":-8.802600000000012,"d":"-8.80"}},{"$f":"RL1d-UDL1d*BX33-IF(BX33>PosPUDL1,PUDL1d*(BX33-PosPUDL1),0)-IF(BX33>(PosPUDL1+3),-PUDL1d*(BX33-PosPUDL1-3),0)-IF(BX33>PosPUDL2,PUDL2d*(BX33-PosPUDL2),0)-IF(BX33>(PosPUDL2+LePUDL2),-PUDL2d*(BX33-PosPUDL2-LePUDL2),0)-IF(BX33>PosPLa1,PLa1d,0)-IF(BX33>PosPLb1,PLb1d,0)","v":{"v":-9.083400000000012,"d":"-9.08"}},{"$f":"RL1d-UDL1d*BY33-IF(BY33>PosPUDL1,PUDL1d*(BY33-PosPUDL1),0)-IF(BY33>(PosPUDL1+3),-PUDL1d*(BY33-PosPUDL1-3),0)-IF(BY33>PosPUDL2,PUDL2d*(BY33-PosPUDL2),0)-IF(BY33>(PosPUDL2+LePUDL2),-PUDL2d*(BY33-PosPUDL2-LePUDL2),0)-IF(BY33>PosPLa1,PLa1d,0)-IF(BY33>PosPLb1,PLb1d,0)","v":{"v":-9.364200000000011,"d":"-9.36"}},{"$f":"RL1d-UDL1d*BZ33-IF(BZ33>PosPUDL1,PUDL1d*(BZ33-PosPUDL1),0)-IF(BZ33>(PosPUDL1+3),-PUDL1d*(BZ33-PosPUDL1-3),0)-IF(BZ33>PosPUDL2,PUDL2d*(BZ33-PosPUDL2),0)-IF(BZ33>(PosPUDL2+LePUDL2),-PUDL2d*(BZ33-PosPUDL2-LePUDL2),0)-IF(BZ33>PosPLa1,PLa1d,0)-IF(BZ33>PosPLb1,PLb1d,0)","v":{"v":-9.645000000000014,"d":"-9.65"}},{"$f":"RL1d-UDL1d*CA33-IF(CA33>PosPUDL1,PUDL1d*(CA33-PosPUDL1),0)-IF(CA33>(PosPUDL1+3),-PUDL1d*(CA33-PosPUDL1-3),0)-IF(CA33>PosPUDL2,PUDL2d*(CA33-PosPUDL2),0)-IF(CA33>(PosPUDL2+LePUDL2),-PUDL2d*(CA33-PosPUDL2-LePUDL2),0)-IF(CA33>PosPLa1,PLa1d,0)-IF(CA33>PosPLb1,PLb1d,0)","v":{"v":-9.925800000000013,"d":"-9.93"}},{"$f":"RL1d-UDL1d*CB33-IF(CB33>PosPUDL1,PUDL1d*(CB33-PosPUDL1),0)-IF(CB33>(PosPUDL1+3),-PUDL1d*(CB33-PosPUDL1-3),0)-IF(CB33>PosPUDL2,PUDL2d*(CB33-PosPUDL2),0)-IF(CB33>(PosPUDL2+LePUDL2),-PUDL2d*(CB33-PosPUDL2-LePUDL2),0)-IF(CB33>PosPLa1,PLa1d,0)-IF(CB33>PosPLb1,PLb1d,0)","v":{"v":-10.206600000000012,"d":"-10.21"}},{"$f":"RL1d-UDL1d*CC33-IF(CC33>PosPUDL1,PUDL1d*(CC33-PosPUDL1),0)-IF(CC33>(PosPUDL1+3),-PUDL1d*(CC33-PosPUDL1-3),0)-IF(CC33>PosPUDL2,PUDL2d*(CC33-PosPUDL2),0)-IF(CC33>(PosPUDL2+LePUDL2),-PUDL2d*(CC33-PosPUDL2-LePUDL2),0)-IF(CC33>PosPLa1,PLa1d,0)-IF(CC33>PosPLb1,PLb1d,0)","v":{"v":-10.487400000000012,"d":"-10.49"}},{"$f":"RL1d-UDL1d*CD33-IF(CD33>PosPUDL1,PUDL1d*(CD33-PosPUDL1),0)-IF(CD33>(PosPUDL1+3),-PUDL1d*(CD33-PosPUDL1-3),0)-IF(CD33>PosPUDL2,PUDL2d*(CD33-PosPUDL2),0)-IF(CD33>(PosPUDL2+LePUDL2),-PUDL2d*(CD33-PosPUDL2-LePUDL2),0)-IF(CD33>PosPLa1,PLa1d,0)-IF(CD33>PosPLb1,PLb1d,0)","v":{"v":-10.768200000000014,"d":"-10.77"}},{"$f":"RL1d-UDL1d*CE33-IF(CE33>PosPUDL1,PUDL1d*(CE33-PosPUDL1),0)-IF(CE33>(PosPUDL1+3),-PUDL1d*(CE33-PosPUDL1-3),0)-IF(CE33>PosPUDL2,PUDL2d*(CE33-PosPUDL2),0)-IF(CE33>(PosPUDL2+LePUDL2),-PUDL2d*(CE33-PosPUDL2-LePUDL2),0)-IF(CE33>PosPLa1,PLa1d,0)-IF(CE33>PosPLb1,PLb1d,0)","v":{"v":-11.049000000000014,"d":"-11.05"}},{"$f":"RL1d-UDL1d*CF33-IF(CF33>PosPUDL1,PUDL1d*(CF33-PosPUDL1),0)-IF(CF33>(PosPUDL1+3),-PUDL1d*(CF33-PosPUDL1-3),0)-IF(CF33>PosPUDL2,PUDL2d*(CF33-PosPUDL2),0)-IF(CF33>(PosPUDL2+LePUDL2),-PUDL2d*(CF33-PosPUDL2-LePUDL2),0)-IF(CF33>PosPLa1,PLa1d,0)-IF(CF33>PosPLb1,PLb1d,0)","v":{"v":-11.329800000000013,"d":"-11.33"}},{"$f":"RL1d-UDL1d*CG33-IF(CG33>PosPUDL1,PUDL1d*(CG33-PosPUDL1),0)-IF(CG33>(PosPUDL1+3),-PUDL1d*(CG33-PosPUDL1-3),0)-IF(CG33>PosPUDL2,PUDL2d*(CG33-PosPUDL2),0)-IF(CG33>(PosPUDL2+LePUDL2),-PUDL2d*(CG33-PosPUDL2-LePUDL2),0)-IF(CG33>PosPLa1,PLa1d,0)-IF(CG33>PosPLb1,PLb1d,0)","v":{"v":-11.610600000000012,"d":"-11.61"}},{"$f":"RL1d-UDL1d*CH33-IF(CH33>PosPUDL1,PUDL1d*(CH33-PosPUDL1),0)-IF(CH33>(PosPUDL1+3),-PUDL1d*(CH33-PosPUDL1-3),0)-IF(CH33>PosPUDL2,PUDL2d*(CH33-PosPUDL2),0)-IF(CH33>(PosPUDL2+LePUDL2),-PUDL2d*(CH33-PosPUDL2-LePUDL2),0)-IF(CH33>PosPLa1,PLa1d,0)-IF(CH33>PosPLb1,PLb1d,0)","v":{"v":-11.891400000000015,"d":"-11.89"}},{"$f":"RL1d-UDL1d*CI33-IF(CI33>PosPUDL1,PUDL1d*(CI33-PosPUDL1),0)-IF(CI33>(PosPUDL1+3),-PUDL1d*(CI33-PosPUDL1-3),0)-IF(CI33>PosPUDL2,PUDL2d*(CI33-PosPUDL2),0)-IF(CI33>(PosPUDL2+LePUDL2),-PUDL2d*(CI33-PosPUDL2-LePUDL2),0)-IF(CI33>PosPLa1,PLa1d,0)-IF(CI33>PosPLb1,PLb1d,0)","v":{"v":-12.172200000000014,"d":"-12.17"}},{"$f":"RL1d-UDL1d*CJ33-IF(CJ33>PosPUDL1,PUDL1d*(CJ33-PosPUDL1),0)-IF(CJ33>(PosPUDL1+3),-PUDL1d*(CJ33-PosPUDL1-3),0)-IF(CJ33>PosPUDL2,PUDL2d*(CJ33-PosPUDL2),0)-IF(CJ33>(PosPUDL2+LePUDL2),-PUDL2d*(CJ33-PosPUDL2-LePUDL2),0)-IF(CJ33>PosPLa1,PLa1d,0)-IF(CJ33>PosPLb1,PLb1d,0)","v":{"v":-12.453000000000014,"d":"-12.45"}},{"$f":"RL1d-UDL1d*CK33-IF(CK33>PosPUDL1,PUDL1d*(CK33-PosPUDL1),0)-IF(CK33>(PosPUDL1+3),-PUDL1d*(CK33-PosPUDL1-3),0)-IF(CK33>PosPUDL2,PUDL2d*(CK33-PosPUDL2),0)-IF(CK33>(PosPUDL2+LePUDL2),-PUDL2d*(CK33-PosPUDL2-LePUDL2),0)-IF(CK33>PosPLa1,PLa1d,0)-IF(CK33>PosPLb1,PLb1d,0)","v":{"v":-12.733800000000013,"d":"-12.73"}},{"$f":"RL1d-UDL1d*CL33-IF(CL33>PosPUDL1,PUDL1d*(CL33-PosPUDL1),0)-IF(CL33>(PosPUDL1+3),-PUDL1d*(CL33-PosPUDL1-3),0)-IF(CL33>PosPUDL2,PUDL2d*(CL33-PosPUDL2),0)-IF(CL33>(PosPUDL2+LePUDL2),-PUDL2d*(CL33-PosPUDL2-LePUDL2),0)-IF(CL33>PosPLa1,PLa1d,0)-IF(CL33>PosPLb1,PLb1d,0)","v":{"v":-13.014600000000016,"d":"-13.01"}},{"$f":"RL1d-UDL1d*CM33-IF(CM33>PosPUDL1,PUDL1d*(CM33-PosPUDL1),0)-IF(CM33>(PosPUDL1+3),-PUDL1d*(CM33-PosPUDL1-3),0)-IF(CM33>PosPUDL2,PUDL2d*(CM33-PosPUDL2),0)-IF(CM33>(PosPUDL2+LePUDL2),-PUDL2d*(CM33-PosPUDL2-LePUDL2),0)-IF(CM33>PosPLa1,PLa1d,0)-IF(CM33>PosPLb1,PLb1d,0)","v":{"v":-13.295400000000015,"d":"-13.30"}},{"$f":"RL1d-UDL1d*CN33-IF(CN33>PosPUDL1,PUDL1d*(CN33-PosPUDL1),0)-IF(CN33>(PosPUDL1+3),-PUDL1d*(CN33-PosPUDL1-3),0)-IF(CN33>PosPUDL2,PUDL2d*(CN33-PosPUDL2),0)-IF(CN33>(PosPUDL2+LePUDL2),-PUDL2d*(CN33-PosPUDL2-LePUDL2),0)-IF(CN33>PosPLa1,PLa1d,0)-IF(CN33>PosPLb1,PLb1d,0)","v":{"v":-13.576200000000014,"d":"-13.58"}},{"$f":"RL1d-UDL1d*CO33-IF(CO33>PosPUDL1,PUDL1d*(CO33-PosPUDL1),0)-IF(CO33>(PosPUDL1+3),-PUDL1d*(CO33-PosPUDL1-3),0)-IF(CO33>PosPUDL2,PUDL2d*(CO33-PosPUDL2),0)-IF(CO33>(PosPUDL2+LePUDL2),-PUDL2d*(CO33-PosPUDL2-LePUDL2),0)-IF(CO33>PosPLa1,PLa1d,0)-IF(CO33>PosPLb1,PLb1d,0)","v":{"v":-13.857000000000017,"d":"-13.86"}},{"$f":"RL1d-UDL1d*CP33-IF(CP33>PosPUDL1,PUDL1d*(CP33-PosPUDL1),0)-IF(CP33>(PosPUDL1+3),-PUDL1d*(CP33-PosPUDL1-3),0)-IF(CP33>PosPUDL2,PUDL2d*(CP33-PosPUDL2),0)-IF(CP33>(PosPUDL2+LePUDL2),-PUDL2d*(CP33-PosPUDL2-LePUDL2),0)-IF(CP33>PosPLa1,PLa1d,0)-IF(CP33>PosPLb1,PLb1d,0)","v":{"v":-14.137800000000016,"d":"-14.14"}},{"$f":"RL1d-UDL1d*CQ33-IF(CQ33>PosPUDL1,PUDL1d*(CQ33-PosPUDL1),0)-IF(CQ33>(PosPUDL1+3),-PUDL1d*(CQ33-PosPUDL1-3),0)-IF(CQ33>PosPUDL2,PUDL2d*(CQ33-PosPUDL2),0)-IF(CQ33>(PosPUDL2+LePUDL2),-PUDL2d*(CQ33-PosPUDL2-LePUDL2),0)-IF(CQ33>PosPLa1,PLa1d,0)-IF(CQ33>PosPLb1,PLb1d,0)","v":{"v":-14.418600000000016,"d":"-14.42"}},{"$f":"RL1d-UDL1d*CR33-IF(CR33>PosPUDL1,PUDL1d*(CR33-PosPUDL1),0)-IF(CR33>(PosPUDL1+3),-PUDL1d*(CR33-PosPUDL1-3),0)-IF(CR33>PosPUDL2,PUDL2d*(CR33-PosPUDL2),0)-IF(CR33>(PosPUDL2+LePUDL2),-PUDL2d*(CR33-PosPUDL2-LePUDL2),0)-IF(CR33>PosPLa1,PLa1d,0)-IF(CR33>PosPLb1,PLb1d,0)","v":{"v":-14.699400000000015,"d":"-14.70"}},{"$f":"RL1d-UDL1d*CS33-IF(CS33>PosPUDL1,PUDL1d*(CS33-PosPUDL1),0)-IF(CS33>(PosPUDL1+3),-PUDL1d*(CS33-PosPUDL1-3),0)-IF(CS33>PosPUDL2,PUDL2d*(CS33-PosPUDL2),0)-IF(CS33>(PosPUDL2+LePUDL2),-PUDL2d*(CS33-PosPUDL2-LePUDL2),0)-IF(CS33>PosPLa1,PLa1d,0)-IF(CS33>PosPLb1,PLb1d,0)","v":{"v":-14.980200000000018,"d":"-14.98"}},{"$f":"RL1d-UDL1d*CT33-IF(CT33>PosPUDL1,PUDL1d*(CT33-PosPUDL1),0)-IF(CT33>(PosPUDL1+3),-PUDL1d*(CT33-PosPUDL1-3),0)-IF(CT33>PosPUDL2,PUDL2d*(CT33-PosPUDL2),0)-IF(CT33>(PosPUDL2+LePUDL2),-PUDL2d*(CT33-PosPUDL2-LePUDL2),0)-IF(CT33>PosPLa1,PLa1d,0)-IF(CT33>PosPLb1,PLb1d,0)","v":{"v":-15.261000000000017,"d":"-15.26"}},{"$f":"RL1d-UDL1d*CU33-IF(CU33>PosPUDL1,PUDL1d*(CU33-PosPUDL1),0)-IF(CU33>(PosPUDL1+3),-PUDL1d*(CU33-PosPUDL1-3),0)-IF(CU33>PosPUDL2,PUDL2d*(CU33-PosPUDL2),0)-IF(CU33>(PosPUDL2+LePUDL2),-PUDL2d*(CU33-PosPUDL2-LePUDL2),0)-IF(CU33>PosPLa1,PLa1d,0)-IF(CU33>PosPLb1,PLb1d,0)","v":{"v":-15.541800000000016,"d":"-15.54"}},{"$f":"RL1d-UDL1d*CV33-IF(CV33>PosPUDL1,PUDL1d*(CV33-PosPUDL1),0)-IF(CV33>(PosPUDL1+3),-PUDL1d*(CV33-PosPUDL1-3),0)-IF(CV33>PosPUDL2,PUDL2d*(CV33-PosPUDL2),0)-IF(CV33>(PosPUDL2+LePUDL2),-PUDL2d*(CV33-PosPUDL2-LePUDL2),0)-IF(CV33>PosPLa1,PLa1d,0)-IF(CV33>PosPLb1,PLb1d,0)","v":{"v":-15.822600000000016,"d":"-15.82"}},{"$f":"RL1d-UDL1d*CW33-IF(CW33>PosPUDL1,PUDL1d*(CW33-PosPUDL1),0)-IF(CW33>(PosPUDL1+3),-PUDL1d*(CW33-PosPUDL1-3),0)-IF(CW33>PosPUDL2,PUDL2d*(CW33-PosPUDL2),0)-IF(CW33>(PosPUDL2+LePUDL2),-PUDL2d*(CW33-PosPUDL2-LePUDL2),0)-IF(CW33>PosPLa1,PLa1d,0)-IF(CW33>PosPLb1,PLb1d,0)","v":{"v":-16.10340000000002,"d":"-16.10"}},{"$f":"RL1d-UDL1d*CX33-IF(CX33>PosPUDL1,PUDL1d*(CX33-PosPUDL1),0)-IF(CX33>(PosPUDL1+3),-PUDL1d*(CX33-PosPUDL1-3),0)-IF(CX33>PosPUDL2,PUDL2d*(CX33-PosPUDL2),0)-IF(CX33>(PosPUDL2+LePUDL2),-PUDL2d*(CX33-PosPUDL2-LePUDL2),0)-IF(CX33>PosPLa1,PLa1d,0)-IF(CX33>PosPLb1,PLb1d,0)","v":{"v":-16.384200000000018,"d":"-16.38"}},{"$f":"RL1d-UDL1d*CY33-IF(CY33>PosPUDL1,PUDL1d*(CY33-PosPUDL1),0)-IF(CY33>(PosPUDL1+3),-PUDL1d*(CY33-PosPUDL1-3),0)-IF(CY33>PosPUDL2,PUDL2d*(CY33-PosPUDL2),0)-IF(CY33>(PosPUDL2+LePUDL2),-PUDL2d*(CY33-PosPUDL2-LePUDL2),0)-IF(CY33>PosPLa1,PLa1d,0)-IF(CY33>PosPLb1,PLb1d,0)","v":{"v":-16.665000000000017,"d":"-16.67"}}]
[null,"Shear live [kN]",{"$f":"RL1l","v":{"v":11.3125,"d":"11.31"}},{"$f":"RL1l-2*D33-IF(D33>PosPUDL1,PUDL1l*(D33-PosPUDL1),0)-IF(D33>(PosPUDL1+3),-PUDL1l*(D33-PosPUDL1-3),0)-IF(D33>PosPUDL2,PUDL2l*(D33-PosPUDL2),0)-IF(D33>(PosPUDL2+LePUDL2),-PUDL2l*(D33-PosPUDL2-LePUDL2),0)-IF(D33>PosPLa1,PLa1l,0)-IF(D33>PosPLb1,PLb1l,0)","v":{"v":11.1525,"d":"11.15"}},{"$f":"RL1l-2*E33-IF(E33>PosPUDL1,PUDL1l*(E33-PosPUDL1),0)-IF(E33>(PosPUDL1+3),-PUDL1l*(E33-PosPUDL1-3),0)-IF(E33>PosPUDL2,PUDL2l*(E33-PosPUDL2),0)-IF(E33>(PosPUDL2+LePUDL2),-PUDL2l*(E33-PosPUDL2-LePUDL2),0)-IF(E33>PosPLa1,PLa1l,0)-IF(E33>PosPLb1,PLb1l,0)","v":{"v":10.9925,"d":"10.99"}},{"$f":"RL1l-2*F33-IF(F33>PosPUDL1,PUDL1l*(F33-PosPUDL1),0)-IF(F33>(PosPUDL1+3),-PUDL1l*(F33-PosPUDL1-3),0)-IF(F33>PosPUDL2,PUDL2l*(F33-PosPUDL2),0)-IF(F33>(PosPUDL2+LePUDL2),-PUDL2l*(F33-PosPUDL2-LePUDL2),0)-IF(F33>PosPLa1,PLa1l,0)-IF(F33>PosPLb1,PLb1l,0)","v":{"v":10.8325,"d":"10.83"}},{"$f":"RL1l-2*G33-IF(G33>PosPUDL1,PUDL1l*(G33-PosPUDL1),0)-IF(G33>(PosPUDL1+3),-PUDL1l*(G33-PosPUDL1-3),0)-IF(G33>PosPUDL2,PUDL2l*(G33-PosPUDL2),0)-IF(G33>(PosPUDL2+LePUDL2),-PUDL2l*(G33-PosPUDL2-LePUDL2),0)-IF(G33>PosPLa1,PLa1l,0)-IF(G33>PosPLb1,PLb1l,0)","v":{"v":10.6725,"d":"10.67"}},{"$f":"RL1l-2*H33-IF(H33>PosPUDL1,PUDL1l*(H33-PosPUDL1),0)-IF(H33>(PosPUDL1+3),-PUDL1l*(H33-PosPUDL1-3),0)-IF(H33>PosPUDL2,PUDL2l*(H33-PosPUDL2),0)-IF(H33>(PosPUDL2+LePUDL2),-PUDL2l*(H33-PosPUDL2-LePUDL2),0)-IF(H33>PosPLa1,PLa1l,0)-IF(H33>PosPLb1,PLb1l,0)","v":{"v":10.5125,"d":"10.51"}},{"$f":"RL1l-2*I33-IF(I33>PosPUDL1,PUDL1l*(I33-PosPUDL1),0)-IF(I33>(PosPUDL1+3),-PUDL1l*(I33-PosPUDL1-3),0)-IF(I33>PosPUDL2,PUDL2l*(I33-PosPUDL2),0)-IF(I33>(PosPUDL2+LePUDL2),-PUDL2l*(I33-PosPUDL2-LePUDL2),0)-IF(I33>PosPLa1,PLa1l,0)-IF(I33>PosPLb1,PLb1l,0)","v":{"v":10.3525,"d":"10.35"}},{"$f":"RL1l-2*J33-IF(J33>PosPUDL1,PUDL1l*(J33-PosPUDL1),0)-IF(J33>(PosPUDL1+3),-PUDL1l*(J33-PosPUDL1-3),0)-IF(J33>PosPUDL2,PUDL2l*(J33-PosPUDL2),0)-IF(J33>(PosPUDL2+LePUDL2),-PUDL2l*(J33-PosPUDL2-LePUDL2),0)-IF(J33>PosPLa1,PLa1l,0)-IF(J33>PosPLb1,PLb1l,0)","v":{"v":10.192499999999999,"d":"10.19"}},{"$f":"RL1l-2*K33-IF(K33>PosPUDL1,PUDL1l*(K33-PosPUDL1),0)-IF(K33>(PosPUDL1+3),-PUDL1l*(K33-PosPUDL1-3),0)-IF(K33>PosPUDL2,PUDL2l*(K33-PosPUDL2),0)-IF(K33>(PosPUDL2+LePUDL2),-PUDL2l*(K33-PosPUDL2-LePUDL2),0)-IF(K33>PosPLa1,PLa1l,0)-IF(K33>PosPLb1,PLb1l,0)","v":{"v":10.0325,"d":"10.03"}},{"$f":"RL1l-2*L33-IF(L33>PosPUDL1,PUDL1l*(L33-PosPUDL1),0)-IF(L33>(PosPUDL1+3),-PUDL1l*(L33-PosPUDL1-3),0)-IF(L33>PosPUDL2,PUDL2l*(L33-PosPUDL2),0)-IF(L33>(PosPUDL2+LePUDL2),-PUDL2l*(L33-PosPUDL2-LePUDL2),0)-IF(L33>PosPLa1,PLa1l,0)-IF(L33>PosPLb1,PLb1l,0)","v":{"v":9.8725,"d":"9.87"}},{"$f":"RL1l-2*M33-IF(M33>PosPUDL1,PUDL1l*(M33-PosPUDL1),0)-IF(M33>(PosPUDL1+3),-PUDL1l*(M33-PosPUDL1-3),0)-IF(M33>PosPUDL2,PUDL2l*(M33-PosPUDL2),0)-IF(M33>(PosPUDL2+LePUDL2),-PUDL2l*(M33-PosPUDL2-LePUDL2),0)-IF(M33>PosPLa1,PLa1l,0)-IF(M33>PosPLb1,PLb1l,0)","v":{"v":9.7125,"d":"9.71"}},{"$f":"RL1l-2*N33-IF(N33>PosPUDL1,PUDL1l*(N33-PosPUDL1),0)-IF(N33>(PosPUDL1+3),-PUDL1l*(N33-PosPUDL1-3),0)-IF(N33>PosPUDL2,PUDL2l*(N33-PosPUDL2),0)-IF(N33>(PosPUDL2+LePUDL2),-PUDL2l*(N33-PosPUDL2-LePUDL2),0)-IF(N33>PosPLa1,PLa1l,0)-IF(N33>PosPLb1,PLb1l,0)","v":{"v":9.5525,"d":"9.55"}},{"$f":"RL1l-2*O33-IF(O33>PosPUDL1,PUDL1l*(O33-PosPUDL1),0)-IF(O33>(PosPUDL1+3),-PUDL1l*(O33-PosPUDL1-3),0)-IF(O33>PosPUDL2,PUDL2l*(O33-PosPUDL2),0)-IF(O33>(PosPUDL2+LePUDL2),-PUDL2l*(O33-PosPUDL2-LePUDL2),0)-IF(O33>PosPLa1,PLa1l,0)-IF(O33>PosPLb1,PLb1l,0)","v":{"v":9.3925,"d":"9.39"}},{"$f":"RL1l-2*P33-IF(P33>PosPUDL1,PUDL1l*(P33-PosPUDL1),0)-IF(P33>(PosPUDL1+3),-PUDL1l*(P33-PosPUDL1-3),0)-IF(P33>PosPUDL2,PUDL2l*(P33-PosPUDL2),0)-IF(P33>(PosPUDL2+LePUDL2),-PUDL2l*(P33-PosPUDL2-LePUDL2),0)-IF(P33>PosPLa1,PLa1l,0)-IF(P33>PosPLb1,PLb1l,0)","v":{"v":9.1925,"d":"9.19"}},{"$f":"RL1l-2*Q33-IF(Q33>PosPUDL1,PUDL1l*(Q33-PosPUDL1),0)-IF(Q33>(PosPUDL1+3),-PUDL1l*(Q33-PosPUDL1-3),0)-IF(Q33>PosPUDL2,PUDL2l*(Q33-PosPUDL2),0)-IF(Q33>(PosPUDL2+LePUDL2),-PUDL2l*(Q33-PosPUDL2-LePUDL2),0)-IF(Q33>PosPLa1,PLa1l,0)-IF(Q33>PosPLb1,PLb1l,0)","v":{"v":8.9525,"d":"8.95"}},{"$f":"RL1l-2*R33-IF(R33>PosPUDL1,PUDL1l*(R33-PosPUDL1),0)-IF(R33>(PosPUDL1+3),-PUDL1l*(R33-PosPUDL1-3),0)-IF(R33>PosPUDL2,PUDL2l*(R33-PosPUDL2),0)-IF(R33>(PosPUDL2+LePUDL2),-PUDL2l*(R33-PosPUDL2-LePUDL2),0)-IF(R33>PosPLa1,PLa1l,0)-IF(R33>PosPLb1,PLb1l,0)","v":{"v":8.7125,"d":"8.71"}},{"$f":"RL1l-2*S33-IF(S33>PosPUDL1,PUDL1l*(S33-PosPUDL1),0)-IF(S33>(PosPUDL1+3),-PUDL1l*(S33-PosPUDL1-3),0)-IF(S33>PosPUDL2,PUDL2l*(S33-PosPUDL2),0)-IF(S33>(PosPUDL2+LePUDL2),-PUDL2l*(S33-PosPUDL2-LePUDL2),0)-IF(S33>PosPLa1,PLa1l,0)-IF(S33>PosPLb1,PLb1l,0)","v":{"v":8.4725,"d":"8.47"}},{"$f":"RL1l-2*T33-IF(T33>PosPUDL1,PUDL1l*(T33-PosPUDL1),0)-IF(T33>(PosPUDL1+3),-PUDL1l*(T33-PosPUDL1-3),0)-IF(T33>PosPUDL2,PUDL2l*(T33-PosPUDL2),0)-IF(T33>(PosPUDL2+LePUDL2),-PUDL2l*(T33-PosPUDL2-LePUDL2),0)-IF(T33>PosPLa1,PLa1l,0)-IF(T33>PosPLb1,PLb1l,0)","v":{"v":8.2325,"d":"8.23"}},{"$f":"RL1l-2*U33-IF(U33>PosPUDL1,PUDL1l*(U33-PosPUDL1),0)-IF(U33>(PosPUDL1+3),-PUDL1l*(U33-PosPUDL1-3),0)-IF(U33>PosPUDL2,PUDL2l*(U33-PosPUDL2),0)-IF(U33>(PosPUDL2+LePUDL2),-PUDL2l*(U33-PosPUDL2-LePUDL2),0)-IF(U33>PosPLa1,PLa1l,0)-IF(U33>PosPLb1,PLb1l,0)","v":{"v":7.992499999999999,"d":"7.99"}},{"$f":"RL1l-2*V33-IF(V33>PosPUDL1,PUDL1l*(V33-PosPUDL1),0)-IF(V33>(PosPUDL1+3),-PUDL1l*(V33-PosPUDL1-3),0)-IF(V33>PosPUDL2,PUDL2l*(V33-PosPUDL2),0)-IF(V33>(PosPUDL2+LePUDL2),-PUDL2l*(V33-PosPUDL2-LePUDL2),0)-IF(V33>PosPLa1,PLa1l,0)-IF(V33>PosPLb1,PLb1l,0)","v":{"v":7.752499999999999,"d":"7.75"}},{"$f":"RL1l-2*W33-IF(W33>PosPUDL1,PUDL1l*(W33-PosPUDL1),0)-IF(W33>(PosPUDL1+3),-PUDL1l*(W33-PosPUDL1-3),0)-IF(W33>PosPUDL2,PUDL2l*(W33-PosPUDL2),0)-IF(W33>(PosPUDL2+LePUDL2),-PUDL2l*(W33-PosPUDL2-LePUDL2),0)-IF(W33>PosPLa1,PLa1l,0)-IF(W33>PosPLb1,PLb1l,0)","v":{"v":7.512499999999998,"d":"7.51"}},{"$f":"RL1l-2*X33-IF(X33>PosPUDL1,PUDL1l*(X33-PosPUDL1),0)-IF(X33>(PosPUDL1+3),-PUDL1l*(X33-PosPUDL1-3),0)-IF(X33>PosPUDL2,PUDL2l*(X33-PosPUDL2),0)-IF(X33>(PosPUDL2+LePUDL2),-PUDL2l*(X33-PosPUDL2-LePUDL2),0)-IF(X33>PosPLa1,PLa1l,0)-IF(X33>PosPLb1,PLb1l,0)","v":{"v":7.272499999999998,"d":"7.27"}},{"$f":"RL1l-2*Y33-IF(Y33>PosPUDL1,PUDL1l*(Y33-PosPUDL1),0)-IF(Y33>(PosPUDL1+3),-PUDL1l*(Y33-PosPUDL1-3),0)-IF(Y33>PosPUDL2,PUDL2l*(Y33-PosPUDL2),0)-IF(Y33>(PosPUDL2+LePUDL2),-PUDL2l*(Y33-PosPUDL2-LePUDL2),0)-IF(Y33>PosPLa1,PLa1l,0)-IF(Y33>PosPLb1,PLb1l,0)","v":{"v":7.032499999999998,"d":"7.03"}},{"$f":"RL1l-2*Z33-IF(Z33>PosPUDL1,PUDL1l*(Z33-PosPUDL1),0)-IF(Z33>(PosPUDL1+3),-PUDL1l*(Z33-PosPUDL1-3),0)-IF(Z33>PosPUDL2,PUDL2l*(Z33-PosPUDL2),0)-IF(Z33>(PosPUDL2+LePUDL2),-PUDL2l*(Z33-PosPUDL2-LePUDL2),0)-IF(Z33>PosPLa1,PLa1l,0)-IF(Z33>PosPLb1,PLb1l,0)","v":{"v":6.792499999999998,"d":"6.79"}},{"$f":"RL1l-2*AA33-IF(AA33>PosPUDL1,PUDL1l*(AA33-PosPUDL1),0)-IF(AA33>(PosPUDL1+3),-PUDL1l*(AA33-PosPUDL1-3),0)-IF(AA33>PosPUDL2,PUDL2l*(AA33-PosPUDL2),0)-IF(AA33>(PosPUDL2+LePUDL2),-PUDL2l*(AA33-PosPUDL2-LePUDL2),0)-IF(AA33>PosPLa1,PLa1l,0)-IF(AA33>PosPLb1,PLb1l,0)","v":{"v":6.5524999999999975,"d":"6.55"}},{"$f":"RL1l-2*AB33-IF(AB33>PosPUDL1,PUDL1l*(AB33-PosPUDL1),0)-IF(AB33>(PosPUDL1+3),-PUDL1l*(AB33-PosPUDL1-3),0)-IF(AB33>PosPUDL2,PUDL2l*(AB33-PosPUDL2),0)-IF(AB33>(PosPUDL2+LePUDL2),-PUDL2l*(AB33-PosPUDL2-LePUDL2),0)-IF(AB33>PosPLa1,PLa1l,0)-IF(AB33>PosPLb1,PLb1l,0)","v":{"v":6.312499999999998,"d":"6.31"}},{"$f":"RL1l-2*AC33-IF(AC33>PosPUDL1,PUDL1l*(AC33-PosPUDL1),0)-IF(AC33>(PosPUDL1+3),-PUDL1l*(AC33-PosPUDL1-3),0)-IF(AC33>PosPUDL2,PUDL2l*(AC33-PosPUDL2),0)-IF(AC33>(PosPUDL2+LePUDL2),-PUDL2l*(AC33-PosPUDL2-LePUDL2),0)-IF(AC33>PosPLa1,PLa1l,0)-IF(AC33>PosPLb1,PLb1l,0)","v":{"v":6.072499999999998,"d":"6.07"}},{"$f":"RL1l-2*AD33-IF(AD33>PosPUDL1,PUDL1l*(AD33-PosPUDL1),0)-IF(AD33>(PosPUDL1+3),-PUDL1l*(AD33-PosPUDL1-3),0)-IF(AD33>PosPUDL2,PUDL2l*(AD33-PosPUDL2),0)-IF(AD33>(PosPUDL2+LePUDL2),-PUDL2l*(AD33-PosPUDL2-LePUDL2),0)-IF(AD33>PosPLa1,PLa1l,0)-IF(AD33>PosPLb1,PLb1l,0)","v":{"v":5.832499999999998,"d":"5.83"}},{"$f":"RL1l-2*AE33-IF(AE33>PosPUDL1,PUDL1l*(AE33-PosPUDL1),0)-IF(AE33>(PosPUDL1+3),-PUDL1l*(AE33-PosPUDL1-3),0)-IF(AE33>PosPUDL2,PUDL2l*(AE33-PosPUDL2),0)-IF(AE33>(PosPUDL2+LePUDL2),-PUDL2l*(AE33-PosPUDL2-LePUDL2),0)-IF(AE33>PosPLa1,PLa1l,0)-IF(AE33>PosPLb1,PLb1l,0)","v":{"v":5.592499999999998,"d":"5.59"}},{"$f":"RL1l-2*AF33-IF(AF33>PosPUDL1,PUDL1l*(AF33-PosPUDL1),0)-IF(AF33>(PosPUDL1+3),-PUDL1l*(AF33-PosPUDL1-3),0)-IF(AF33>PosPUDL2,PUDL2l*(AF33-PosPUDL2),0)-IF(AF33>(PosPUDL2+LePUDL2),-PUDL2l*(AF33-PosPUDL2-LePUDL2),0)-IF(AF33>PosPLa1,PLa1l,0)-IF(AF33>PosPLb1,PLb1l,0)","v":{"v":5.352499999999997,"d":"5.35"}},{"$f":"RL1l-2*AG33-IF(AG33>PosPUDL1,PUDL1l*(AG33-PosPUDL1),0)-IF(AG33>(PosPUDL1+3),-PUDL1l*(AG33-PosPUDL1-3),0)-IF(AG33>PosPUDL2,PUDL2l*(AG33-PosPUDL2),0)-IF(AG33>(PosPUDL2+LePUDL2),-PUDL2l*(AG33-PosPUDL2-LePUDL2),0)-IF(AG33>PosPLa1,PLa1l,0)-IF(AG33>PosPLb1,PLb1l,0)","v":{"v":5.112499999999997,"d":"5.11"}},{"$f":"RL1l-2*AH33-IF(AH33>PosPUDL1,PUDL1l*(AH33-PosPUDL1),0)-IF(AH33>(PosPUDL1+3),-PUDL1l*(AH33-PosPUDL1-3),0)-IF(AH33>PosPUDL2,PUDL2l*(AH33-PosPUDL2),0)-IF(AH33>(PosPUDL2+LePUDL2),-PUDL2l*(AH33-PosPUDL2-LePUDL2),0)-IF(AH33>PosPLa1,PLa1l,0)-IF(AH33>PosPLb1,PLb1l,0)","v":{"v":4.872499999999997,"d":"4.87"}},{"$f":"RL1l-2*AI33-IF(AI33>PosPUDL1,PUDL1l*(AI33-PosPUDL1),0)-IF(AI33>(PosPUDL1+3),-PUDL1l*(AI33-PosPUDL1-3),0)-IF(AI33>PosPUDL2,PUDL2l*(AI33-PosPUDL2),0)-IF(AI33>(PosPUDL2+LePUDL2),-PUDL2l*(AI33-PosPUDL2-LePUDL2),0)-IF(AI33>PosPLa1,PLa1l,0)-IF(AI33>PosPLb1,PLb1l,0)","v":{"v":4.632499999999997,"d":"4.63"}},{"$f":"RL1l-2*AJ33-IF(AJ33>PosPUDL1,PUDL1l*(AJ33-PosPUDL1),0)-IF(AJ33>(PosPUDL1+3),-PUDL1l*(AJ33-PosPUDL1-3),0)-IF(AJ33>PosPUDL2,PUDL2l*(AJ33-PosPUDL2),0)-IF(AJ33>(PosPUDL2+LePUDL2),-PUDL2l*(AJ33-PosPUDL2-LePUDL2),0)-IF(AJ33>PosPLa1,PLa1l,0)-IF(AJ33>PosPLb1,PLb1l,0)","v":{"v":4.3924999999999965,"d":"4.39"}},{"$f":"RL1l-2*AK33-IF(AK33>PosPUDL1,PUDL1l*(AK33-PosPUDL1),0)-IF(AK33>(PosPUDL1+3),-PUDL1l*(AK33-PosPUDL1-3),0)-IF(AK33>PosPUDL2,PUDL2l*(AK33-PosPUDL2),0)-IF(AK33>(PosPUDL2+LePUDL2),-PUDL2l*(AK33-PosPUDL2-LePUDL2),0)-IF(AK33>PosPLa1,PLa1l,0)-IF(AK33>PosPLb1,PLb1l,0)","v":{"v":4.152499999999996,"d":"4.15"}},{"$f":"RL1l-2*AL33-IF(AL33>PosPUDL1,PUDL1l*(AL33-PosPUDL1),0)-IF(AL33>(PosPUDL1+3),-PUDL1l*(AL33-PosPUDL1-3),0)-IF(AL33>PosPUDL2,PUDL2l*(AL33-PosPUDL2),0)-IF(AL33>(PosPUDL2+LePUDL2),-PUDL2l*(AL33-PosPUDL2-LePUDL2),0)-IF(AL33>PosPLa1,PLa1l,0)-IF(AL33>PosPLb1,PLb1l,0)","v":{"v":3.9124999999999965,"d":"3.91"}},{"$f":"RL1l-2*AM33-IF(AM33>PosPUDL1,PUDL1l*(AM33-PosPUDL1),0)-IF(AM33>(PosPUDL1+3),-PUDL1l*(AM33-PosPUDL1-3),0)-IF(AM33>PosPUDL2,PUDL2l*(AM33-PosPUDL2),0)-IF(AM33>(PosPUDL2+LePUDL2),-PUDL2l*(AM33-PosPUDL2-LePUDL2),0)-IF(AM33>PosPLa1,PLa1l,0)-IF(AM33>PosPLb1,PLb1l,0)","v":{"v":3.6724999999999963,"d":"3.67"}},{"$f":"RL1l-2*AN33-IF(AN33>PosPUDL1,PUDL1l*(AN33-PosPUDL1),0)-IF(AN33>(PosPUDL1+3),-PUDL1l*(AN33-PosPUDL1-3),0)-IF(AN33>PosPUDL2,PUDL2l*(AN33-PosPUDL2),0)-IF(AN33>(PosPUDL2+LePUDL2),-PUDL2l*(AN33-PosPUDL2-LePUDL2),0)-IF(AN33>PosPLa1,PLa1l,0)-IF(AN33>PosPLb1,PLb1l,0)","v":{"v":3.432499999999996,"d":"3.43"}},{"$f":"RL1l-2*AO33-IF(AO33>PosPUDL1,PUDL1l*(AO33-PosPUDL1),0)-IF(AO33>(PosPUDL1+3),-PUDL1l*(AO33-PosPUDL1-3),0)-IF(AO33>PosPUDL2,PUDL2l*(AO33-PosPUDL2),0)-IF(AO33>(PosPUDL2+LePUDL2),-PUDL2l*(AO33-PosPUDL2-LePUDL2),0)-IF(AO33>PosPLa1,PLa1l,0)-IF(AO33>PosPLb1,PLb1l,0)","v":{"v":1.192499999999996,"d":"1.19"}},{"$f":"RL1l-2*AP33-IF(AP33>PosPUDL1,PUDL1l*(AP33-PosPUDL1),0)-IF(AP33>(PosPUDL1+3),-PUDL1l*(AP33-PosPUDL1-3),0)-IF(AP33>PosPUDL2,PUDL2l*(AP33-PosPUDL2),0)-IF(AP33>(PosPUDL2+LePUDL2),-PUDL2l*(AP33-PosPUDL2-LePUDL2),0)-IF(AP33>PosPLa1,PLa1l,0)-IF(AP33>PosPLb1,PLb1l,0)","v":{"v":0.9524999999999957,"d":"0.95"}},{"$f":"RL1l-2*AQ33-IF(AQ33>PosPUDL1,PUDL1l*(AQ33-PosPUDL1),0)-IF(AQ33>(PosPUDL1+3),-PUDL1l*(AQ33-PosPUDL1-3),0)-IF(AQ33>PosPUDL2,PUDL2l*(AQ33-PosPUDL2),0)-IF(AQ33>(PosPUDL2+LePUDL2),-PUDL2l*(AQ33-PosPUDL2-LePUDL2),0)-IF(AQ33>PosPLa1,PLa1l,0)-IF(AQ33>PosPLb1,PLb1l,0)","v":{"v":0.7124999999999955,"d":"0.71"}},{"$f":"RL1l-2*AR33-IF(AR33>PosPUDL1,PUDL1l*(AR33-PosPUDL1),0)-IF(AR33>(PosPUDL1+3),-PUDL1l*(AR33-PosPUDL1-3),0)-IF(AR33>PosPUDL2,PUDL2l*(AR33-PosPUDL2),0)-IF(AR33>(PosPUDL2+LePUDL2),-PUDL2l*(AR33-PosPUDL2-LePUDL2),0)-IF(AR33>PosPLa1,PLa1l,0)-IF(AR33>PosPLb1,PLb1l,0)","v":{"v":0.47249999999999526,"d":"0.47"}},{"$f":"RL1l-2*AS33-IF(AS33>PosPUDL1,PUDL1l*(AS33-PosPUDL1),0)-IF(AS33>(PosPUDL1+3),-PUDL1l*(AS33-PosPUDL1-3),0)-IF(AS33>PosPUDL2,PUDL2l*(AS33-PosPUDL2),0)-IF(AS33>(PosPUDL2+LePUDL2),-PUDL2l*(AS33-PosPUDL2-LePUDL2),0)-IF(AS33>PosPLa1,PLa1l,0)-IF(AS33>PosPLb1,PLb1l,0)","v":{"v":0.23249999999999504,"d":"0.23"}},{"$f":"RL1l-2*AT33-IF(AT33>PosPUDL1,PUDL1l*(AT33-PosPUDL1),0)-IF(AT33>(PosPUDL1+3),-PUDL1l*(AT33-PosPUDL1-3),0)-IF(AT33>PosPUDL2,PUDL2l*(AT33-PosPUDL2),0)-IF(AT33>(PosPUDL2+LePUDL2),-PUDL2l*(AT33-PosPUDL2-LePUDL2),0)-IF(AT33>PosPLa1,PLa1l,0)-IF(AT33>PosPLb1,PLb1l,0)","v":{"v":-0.007500000000005169,"d":"-0.01"}},{"$f":"RL1l-2*AU33-IF(AU33>PosPUDL1,PUDL1l*(AU33-PosPUDL1),0)-IF(AU33>(PosPUDL1+3),-PUDL1l*(AU33-PosPUDL1-3),0)-IF(AU33>PosPUDL2,PUDL2l*(AU33-PosPUDL2),0)-IF(AU33>(PosPUDL2+LePUDL2),-PUDL2l*(AU33-PosPUDL2-LePUDL2),0)-IF(AU33>PosPLa1,PLa1l,0)-IF(AU33>PosPLb1,PLb1l,0)","v":{"v":-0.24750000000000538,"d":"-0.25"}},{"$f":"RL1l-2*AV33-IF(AV33>PosPUDL1,PUDL1l*(AV33-PosPUDL1),0)-IF(AV33>(PosPUDL1+3),-PUDL1l*(AV33-PosPUDL1-3),0)-IF(AV33>PosPUDL2,PUDL2l*(AV33-PosPUDL2),0)-IF(AV33>(PosPUDL2+LePUDL2),-PUDL2l*(AV33-PosPUDL2-LePUDL2),0)-IF(AV33>PosPLa1,PLa1l,0)-IF(AV33>PosPLb1,PLb1l,0)","v":{"v":-0.4875000000000056,"d":"-0.49"}},{"$f":"RL1l-2*AW33-IF(AW33>PosPUDL1,PUDL1l*(AW33-PosPUDL1),0)-IF(AW33>(PosPUDL1+3),-PUDL1l*(AW33-PosPUDL1-3),0)-IF(AW33>PosPUDL2,PUDL2l*(AW33-PosPUDL2),0)-IF(AW33>(PosPUDL2+LePUDL2),-PUDL2l*(AW33-PosPUDL2-LePUDL2),0)-IF(AW33>PosPLa1,PLa1l,0)-IF(AW33>PosPLb1,PLb1l,0)","v":{"v":-0.7275000000000058,"d":"-0.73"}},{"$f":"RL1l-2*AX33-IF(AX33>PosPUDL1,PUDL1l*(AX33-PosPUDL1),0)-IF(AX33>(PosPUDL1+3),-PUDL1l*(AX33-PosPUDL1-3),0)-IF(AX33>PosPUDL2,PUDL2l*(AX33-PosPUDL2),0)-IF(AX33>(PosPUDL2+LePUDL2),-PUDL2l*(AX33-PosPUDL2-LePUDL2),0)-IF(AX33>PosPLa1,PLa1l,0)-IF(AX33>PosPLb1,PLb1l,0)","v":{"v":-0.967500000000006,"d":"-0.97"}},{"$f":"RL1l-2*AY33-IF(AY33>PosPUDL1,PUDL1l*(AY33-PosPUDL1),0)-IF(AY33>(PosPUDL1+3),-PUDL1l*(AY33-PosPUDL1-3),0)-IF(AY33>PosPUDL2,PUDL2l*(AY33-PosPUDL2),0)-IF(AY33>(PosPUDL2+LePUDL2),-PUDL2l*(AY33-PosPUDL2-LePUDL2),0)-IF(AY33>PosPLa1,PLa1l,0)-IF(AY33>PosPLb1,PLb1l,0)","v":{"v":-1.2075000000000062,"d":"-1.21"}},{"$f":"RL1l-2*AZ33-IF(AZ33>PosPUDL1,PUDL1l*(AZ33-PosPUDL1),0)-IF(AZ33>(PosPUDL1+3),-PUDL1l*(AZ33-PosPUDL1-3),0)-IF(AZ33>PosPUDL2,PUDL2l*(AZ33-PosPUDL2),0)-IF(AZ33>(PosPUDL2+LePUDL2),-PUDL2l*(AZ33-PosPUDL2-LePUDL2),0)-IF(AZ33>PosPLa1,PLa1l,0)-IF(AZ33>PosPLb1,PLb1l,0)","v":{"v":-1.4475000000000064,"d":"-1.45"}},{"$f":"RL1l-2*BA33-IF(BA33>PosPUDL1,PUDL1l*(BA33-PosPUDL1),0)-IF(BA33>(PosPUDL1+3),-PUDL1l*(BA33-PosPUDL1-3),0)-IF(BA33>PosPUDL2,PUDL2l*(BA33-PosPUDL2),0)-IF(BA33>(PosPUDL2+LePUDL2),-PUDL2l*(BA33-PosPUDL2-LePUDL2),0)-IF(BA33>PosPLa1,PLa1l,0)-IF(BA33>PosPLb1,PLb1l,0)","v":{"v":-1.6875000000000053,"d":"-1.69"}},{"$f":"RL1l-2*BB33-IF(BB33>PosPUDL1,PUDL1l*(BB33-PosPUDL1),0)-IF(BB33>(PosPUDL1+3),-PUDL1l*(BB33-PosPUDL1-3),0)-IF(BB33>PosPUDL2,PUDL2l*(BB33-PosPUDL2),0)-IF(BB33>(PosPUDL2+LePUDL2),-PUDL2l*(BB33-PosPUDL2-LePUDL2),0)-IF(BB33>PosPLa1,PLa1l,0)-IF(BB33>PosPLb1,PLb1l,0)","v":{"v":-1.8475000000000037,"d":"-1.85"}},{"$f":"RL1l-2*BC33-IF(BC33>PosPUDL1,PUDL1l*(BC33-PosPUDL1),0)-IF(BC33>(PosPUDL1+3),-PUDL1l*(BC33-PosPUDL1-3),0)-IF(BC33>PosPUDL2,PUDL2l*(BC33-PosPUDL2),0)-IF(BC33>(PosPUDL2+LePUDL2),-PUDL2l*(BC33-PosPUDL2-LePUDL2),0)-IF(BC33>PosPLa1,PLa1l,0)-IF(BC33>PosPLb1,PLb1l,0)","v":{"v":-2.007500000000004,"d":"-2.01"}},{"$f":"RL1l-2*BD33-IF(BD33>PosPUDL1,PUDL1l*(BD33-PosPUDL1),0)-IF(BD33>(PosPUDL1+3),-PUDL1l*(BD33-PosPUDL1-3),0)-IF(BD33>PosPUDL2,PUDL2l*(BD33-PosPUDL2),0)-IF(BD33>(PosPUDL2+LePUDL2),-PUDL2l*(BD33-PosPUDL2-LePUDL2),0)-IF(BD33>PosPLa1,PLa1l,0)-IF(BD33>PosPLb1,PLb1l,0)","v":{"v":-2.167500000000004,"d":"-2.17"}},{"$f":"RL1l-2*BE33-IF(BE33>PosPUDL1,PUDL1l*(BE33-PosPUDL1),0)-IF(BE33>(PosPUDL1+3),-PUDL1l*(BE33-PosPUDL1-3),0)-IF(BE33>PosPUDL2,PUDL2l*(BE33-PosPUDL2),0)-IF(BE33>(PosPUDL2+LePUDL2),-PUDL2l*(BE33-PosPUDL2-LePUDL2),0)-IF(BE33>PosPLa1,PLa1l,0)-IF(BE33>PosPLb1,PLb1l,0)","v":{"v":-2.327500000000004,"d":"-2.33"}},{"$f":"RL1l-2*BF33-IF(BF33>PosPUDL1,PUDL1l*(BF33-PosPUDL1),0)-IF(BF33>(PosPUDL1+3),-PUDL1l*(BF33-PosPUDL1-3),0)-IF(BF33>PosPUDL2,PUDL2l*(BF33-PosPUDL2),0)-IF(BF33>(PosPUDL2+LePUDL2),-PUDL2l*(BF33-PosPUDL2-LePUDL2),0)-IF(BF33>PosPLa1,PLa1l,0)-IF(BF33>PosPLb1,PLb1l,0)","v":{"v":-2.4875000000000043,"d":"-2.49"}},{"$f":"RL1l-2*BG33-IF(BG33>PosPUDL1,PUDL1l*(BG33-PosPUDL1),0)-IF(BG33>(PosPUDL1+3),-PUDL1l*(BG33-PosPUDL1-3),0)-IF(BG33>PosPUDL2,PUDL2l*(BG33-PosPUDL2),0)-IF(BG33>(PosPUDL2+LePUDL2),-PUDL2l*(BG33-PosPUDL2-LePUDL2),0)-IF(BG33>PosPLa1,PLa1l,0)-IF(BG33>PosPLb1,PLb1l,0)","v":{"v":-2.6475000000000044,"d":"-2.65"}},{"$f":"RL1l-2*BH33-IF(BH33>PosPUDL1,PUDL1l*(BH33-PosPUDL1),0)-IF(BH33>(PosPUDL1+3),-PUDL1l*(BH33-PosPUDL1-3),0)-IF(BH33>PosPUDL2,PUDL2l*(BH33-PosPUDL2),0)-IF(BH33>(PosPUDL2+LePUDL2),-PUDL2l*(BH33-PosPUDL2-LePUDL2),0)-IF(BH33>PosPLa1,PLa1l,0)-IF(BH33>PosPLb1,PLb1l,0)","v":{"v":-2.8075000000000045,"d":"-2.81"}},{"$f":"RL1l-2*BI33-IF(BI33>PosPUDL1,PUDL1l*(BI33-PosPUDL1),0)-IF(BI33>(PosPUDL1+3),-PUDL1l*(BI33-PosPUDL1-3),0)-IF(BI33>PosPUDL2,PUDL2l*(BI33-PosPUDL2),0)-IF(BI33>(PosPUDL2+LePUDL2),-PUDL2l*(BI33-PosPUDL2-LePUDL2),0)-IF(BI33>PosPLa1,PLa1l,0)-IF(BI33>PosPLb1,PLb1l,0)","v":{"v":-2.9675000000000047,"d":"-2.97"}},{"$f":"RL1l-2*BJ33-IF(BJ33>PosPUDL1,PUDL1l*(BJ33-PosPUDL1),0)-IF(BJ33>(PosPUDL1+3),-PUDL1l*(BJ33-PosPUDL1-3),0)-IF(BJ33>PosPUDL2,PUDL2l*(BJ33-PosPUDL2),0)-IF(BJ33>(PosPUDL2+LePUDL2),-PUDL2l*(BJ33-PosPUDL2-LePUDL2),0)-IF(BJ33>PosPLa1,PLa1l,0)-IF(BJ33>PosPLb1,PLb1l,0)","v":{"v":-3.127500000000005,"d":"-3.13"}},{"$f":"RL1l-2*BK33-IF(BK33>PosPUDL1,PUDL1l*(BK33-PosPUDL1),0)-IF(BK33>(PosPUDL1+3),-PUDL1l*(BK33-PosPUDL1-3),0)-IF(BK33>PosPUDL2,PUDL2l*(BK33-PosPUDL2),0)-IF(BK33>(PosPUDL2+LePUDL2),-PUDL2l*(BK33-PosPUDL2-LePUDL2),0)-IF(BK33>PosPLa1,PLa1l,0)-IF(BK33>PosPLb1,PLb1l,0)","v":{"v":-3.287500000000005,"d":"-3.29"}},{"$f":"RL1l-2*BL33-IF(BL33>PosPUDL1,PUDL1l*(BL33-PosPUDL1),0)-IF(BL33>(PosPUDL1+3),-PUDL1l*(BL33-PosPUDL1-3),0)-IF(BL33>PosPUDL2,PUDL2l*(BL33-PosPUDL2),0)-IF(BL33>(PosPUDL2+LePUDL2),-PUDL2l*(BL33-PosPUDL2-LePUDL2),0)-IF(BL33>PosPLa1,PLa1l,0)-IF(BL33>PosPLb1,PLb1l,0)","v":{"v":-3.447500000000005,"d":"-3.45"}},{"$f":"RL1l-2*BM33-IF(BM33>PosPUDL1,PUDL1l*(BM33-PosPUDL1),0)-IF(BM33>(PosPUDL1+3),-PUDL1l*(BM33-PosPUDL1-3),0)-IF(BM33>PosPUDL2,PUDL2l*(BM33-PosPUDL2),0)-IF(BM33>(PosPUDL2+LePUDL2),-PUDL2l*(BM33-PosPUDL2-LePUDL2),0)-IF(BM33>PosPLa1,PLa1l,0)-IF(BM33>PosPLb1,PLb1l,0)","v":{"v":-3.6075000000000053,"d":"-3.61"}},{"$f":"RL1l-2*BN33-IF(BN33>PosPUDL1,PUDL1l*(BN33-PosPUDL1),0)-IF(BN33>(PosPUDL1+3),-PUDL1l*(BN33-PosPUDL1-3),0)-IF(BN33>PosPUDL2,PUDL2l*(BN33-PosPUDL2),0)-IF(BN33>(PosPUDL2+LePUDL2),-PUDL2l*(BN33-PosPUDL2-LePUDL2),0)-IF(BN33>PosPLa1,PLa1l,0)-IF(BN33>PosPLb1,PLb1l,0)","v":{"v":-3.7675000000000054,"d":"-3.77"}},{"$f":"RL1l-2*BO33-IF(BO33>PosPUDL1,PUDL1l*(BO33-PosPUDL1),0)-IF(BO33>(PosPUDL1+3),-PUDL1l*(BO33-PosPUDL1-3),0)-IF(BO33>PosPUDL2,PUDL2l*(BO33-PosPUDL2),0)-IF(BO33>(PosPUDL2+LePUDL2),-PUDL2l*(BO33-PosPUDL2-LePUDL2),0)-IF(BO33>PosPLa1,PLa1l,0)-IF(BO33>PosPLb1,PLb1l,0)","v":{"v":-3.9275000000000055,"d":"-3.93"}},{"$f":"RL1l-2*BP33-IF(BP33>PosPUDL1,PUDL1l*(BP33-PosPUDL1),0)-IF(BP33>(PosPUDL1+3),-PUDL1l*(BP33-PosPUDL1-3),0)-IF(BP33>PosPUDL2,PUDL2l*(BP33-PosPUDL2),0)-IF(BP33>(PosPUDL2+LePUDL2),-PUDL2l*(BP33-PosPUDL2-LePUDL2),0)-IF(BP33>PosPLa1,PLa1l,0)-IF(BP33>PosPLb1,PLb1l,0)","v":{"v":-4.087500000000006,"d":"-4.09"}},{"$f":"RL1l-2*BQ33-IF(BQ33>PosPUDL1,PUDL1l*(BQ33-PosPUDL1),0)-IF(BQ33>(PosPUDL1+3),-PUDL1l*(BQ33-PosPUDL1-3),0)-IF(BQ33>PosPUDL2,PUDL2l*(BQ33-PosPUDL2),0)-IF(BQ33>(PosPUDL2+LePUDL2),-PUDL2l*(BQ33-PosPUDL2-LePUDL2),0)-IF(BQ33>PosPLa1,PLa1l,0)-IF(BQ33>PosPLb1,PLb1l,0)","v":{"v":-4.247500000000006,"d":"-4.25"}},{"$f":"RL1l-2*BR33-IF(BR33>PosPUDL1,PUDL1l*(BR33-PosPUDL1),0)-IF(BR33>(PosPUDL1+3),-PUDL1l*(BR33-PosPUDL1-3),0)-IF(BR33>PosPUDL2,PUDL2l*(BR33-PosPUDL2),0)-IF(BR33>(PosPUDL2+LePUDL2),-PUDL2l*(BR33-PosPUDL2-LePUDL2),0)-IF(BR33>PosPLa1,PLa1l,0)-IF(BR33>PosPLb1,PLb1l,0)","v":{"v":-4.407500000000006,"d":"-4.41"}},{"$f":"RL1l-2*BS33-IF(BS33>PosPUDL1,PUDL1l*(BS33-PosPUDL1),0)-IF(BS33>(PosPUDL1+3),-PUDL1l*(BS33-PosPUDL1-3),0)-IF(BS33>PosPUDL2,PUDL2l*(BS33-PosPUDL2),0)-IF(BS33>(PosPUDL2+LePUDL2),-PUDL2l*(BS33-PosPUDL2-LePUDL2),0)-IF(BS33>PosPLa1,PLa1l,0)-IF(BS33>PosPLb1,PLb1l,0)","v":{"v":-4.567500000000006,"d":"-4.57"}},{"$f":"RL1l-2*BT33-IF(BT33>PosPUDL1,PUDL1l*(BT33-PosPUDL1),0)-IF(BT33>(PosPUDL1+3),-PUDL1l*(BT33-PosPUDL1-3),0)-IF(BT33>PosPUDL2,PUDL2l*(BT33-PosPUDL2),0)-IF(BT33>(PosPUDL2+LePUDL2),-PUDL2l*(BT33-PosPUDL2-LePUDL2),0)-IF(BT33>PosPLa1,PLa1l,0)-IF(BT33>PosPLb1,PLb1l,0)","v":{"v":-4.727500000000006,"d":"-4.73"}},{"$f":"RL1l-2*BU33-IF(BU33>PosPUDL1,PUDL1l*(BU33-PosPUDL1),0)-IF(BU33>(PosPUDL1+3),-PUDL1l*(BU33-PosPUDL1-3),0)-IF(BU33>PosPUDL2,PUDL2l*(BU33-PosPUDL2),0)-IF(BU33>(PosPUDL2+LePUDL2),-PUDL2l*(BU33-PosPUDL2-LePUDL2),0)-IF(BU33>PosPLa1,PLa1l,0)-IF(BU33>PosPLb1,PLb1l,0)","v":{"v":-4.887500000000006,"d":"-4.89"}},{"$f":"RL1l-2*BV33-IF(BV33>PosPUDL1,PUDL1l*(BV33-PosPUDL1),0)-IF(BV33>(PosPUDL1+3),-PUDL1l*(BV33-PosPUDL1-3),0)-IF(BV33>PosPUDL2,PUDL2l*(BV33-PosPUDL2),0)-IF(BV33>(PosPUDL2+LePUDL2),-PUDL2l*(BV33-PosPUDL2-LePUDL2),0)-IF(BV33>PosPLa1,PLa1l,0)-IF(BV33>PosPLb1,PLb1l,0)","v":{"v":-5.0475000000000065,"d":"-5.05"}},{"$f":"RL1l-2*BW33-IF(BW33>PosPUDL1,PUDL1l*(BW33-PosPUDL1),0)-IF(BW33>(PosPUDL1+3),-PUDL1l*(BW33-PosPUDL1-3),0)-IF(BW33>PosPUDL2,PUDL2l*(BW33-PosPUDL2),0)-IF(BW33>(PosPUDL2+LePUDL2),-PUDL2l*(BW33-PosPUDL2-LePUDL2),0)-IF(BW33>PosPLa1,PLa1l,0)-IF(BW33>PosPLb1,PLb1l,0)","v":{"v":-5.207500000000007,"d":"-5.21"}},{"$f":"RL1l-2*BX33-IF(BX33>PosPUDL1,PUDL1l*(BX33-PosPUDL1),0)-IF(BX33>(PosPUDL1+3),-PUDL1l*(BX33-PosPUDL1-3),0)-IF(BX33>PosPUDL2,PUDL2l*(BX33-PosPUDL2),0)-IF(BX33>(PosPUDL2+LePUDL2),-PUDL2l*(BX33-PosPUDL2-LePUDL2),0)-IF(BX33>PosPLa1,PLa1l,0)-IF(BX33>PosPLb1,PLb1l,0)","v":{"v":-5.367500000000007,"d":"-5.37"}},{"$f":"RL1l-2*BY33-IF(BY33>PosPUDL1,PUDL1l*(BY33-PosPUDL1),0)-IF(BY33>(PosPUDL1+3),-PUDL1l*(BY33-PosPUDL1-3),0)-IF(BY33>PosPUDL2,PUDL2l*(BY33-PosPUDL2),0)-IF(BY33>(PosPUDL2+LePUDL2),-PUDL2l*(BY33-PosPUDL2-LePUDL2),0)-IF(BY33>PosPLa1,PLa1l,0)-IF(BY33>PosPLb1,PLb1l,0)","v":{"v":-5.527500000000007,"d":"-5.53"}},{"$f":"RL1l-2*BZ33-IF(BZ33>PosPUDL1,PUDL1l*(BZ33-PosPUDL1),0)-IF(BZ33>(PosPUDL1+3),-PUDL1l*(BZ33-PosPUDL1-3),0)-IF(BZ33>PosPUDL2,PUDL2l*(BZ33-PosPUDL2),0)-IF(BZ33>(PosPUDL2+LePUDL2),-PUDL2l*(BZ33-PosPUDL2-LePUDL2),0)-IF(BZ33>PosPLa1,PLa1l,0)-IF(BZ33>PosPLb1,PLb1l,0)","v":{"v":-5.687500000000007,"d":"-5.69"}},{"$f":"RL1l-2*CA33-IF(CA33>PosPUDL1,PUDL1l*(CA33-PosPUDL1),0)-IF(CA33>(PosPUDL1+3),-PUDL1l*(CA33-PosPUDL1-3),0)-IF(CA33>PosPUDL2,PUDL2l*(CA33-PosPUDL2),0)-IF(CA33>(PosPUDL2+LePUDL2),-PUDL2l*(CA33-PosPUDL2-LePUDL2),0)-IF(CA33>PosPLa1,PLa1l,0)-IF(CA33>PosPLb1,PLb1l,0)","v":{"v":-5.847500000000007,"d":"-5.85"}},{"$f":"RL1l-2*CB33-IF(CB33>PosPUDL1,PUDL1l*(CB33-PosPUDL1),0)-IF(CB33>(PosPUDL1+3),-PUDL1l*(CB33-PosPUDL1-3),0)-IF(CB33>PosPUDL2,PUDL2l*(CB33-PosPUDL2),0)-IF(CB33>(PosPUDL2+LePUDL2),-PUDL2l*(CB33-PosPUDL2-LePUDL2),0)-IF(CB33>PosPLa1,PLa1l,0)-IF(CB33>PosPLb1,PLb1l,0)","v":{"v":-6.007500000000007,"d":"-6.01"}},{"$f":"RL1l-2*CC33-IF(CC33>PosPUDL1,PUDL1l*(CC33-PosPUDL1),0)-IF(CC33>(PosPUDL1+3),-PUDL1l*(CC33-PosPUDL1-3),0)-IF(CC33>PosPUDL2,PUDL2l*(CC33-PosPUDL2),0)-IF(CC33>(PosPUDL2+LePUDL2),-PUDL2l*(CC33-PosPUDL2-LePUDL2),0)-IF(CC33>PosPLa1,PLa1l,0)-IF(CC33>PosPLb1,PLb1l,0)","v":{"v":-6.1675000000000075,"d":"-6.17"}},{"$f":"RL1l-2*CD33-IF(CD33>PosPUDL1,PUDL1l*(CD33-PosPUDL1),0)-IF(CD33>(PosPUDL1+3),-PUDL1l*(CD33-PosPUDL1-3),0)-IF(CD33>PosPUDL2,PUDL2l*(CD33-PosPUDL2),0)-IF(CD33>(PosPUDL2+LePUDL2),-PUDL2l*(CD33-PosPUDL2-LePUDL2),0)-IF(CD33>PosPLa1,PLa1l,0)-IF(CD33>PosPLb1,PLb1l,0)","v":{"v":-6.327500000000008,"d":"-6.33"}},{"$f":"RL1l-2*CE33-IF(CE33>PosPUDL1,PUDL1l*(CE33-PosPUDL1),0)-IF(CE33>(PosPUDL1+3),-PUDL1l*(CE33-PosPUDL1-3),0)-IF(CE33>PosPUDL2,PUDL2l*(CE33-PosPUDL2),0)-IF(CE33>(PosPUDL2+LePUDL2),-PUDL2l*(CE33-PosPUDL2-LePUDL2),0)-IF(CE33>PosPLa1,PLa1l,0)-IF(CE33>PosPLb1,PLb1l,0)","v":{"v":-6.487500000000008,"d":"-6.49"}},{"$f":"RL1l-2*CF33-IF(CF33>PosPUDL1,PUDL1l*(CF33-PosPUDL1),0)-IF(CF33>(PosPUDL1+3),-PUDL1l*(CF33-PosPUDL1-3),0)-IF(CF33>PosPUDL2,PUDL2l*(CF33-PosPUDL2),0)-IF(CF33>(PosPUDL2+LePUDL2),-PUDL2l*(CF33-PosPUDL2-LePUDL2),0)-IF(CF33>PosPLa1,PLa1l,0)-IF(CF33>PosPLb1,PLb1l,0)","v":{"v":-6.647500000000008,"d":"-6.65"}},{"$f":"RL1l-2*CG33-IF(CG33>PosPUDL1,PUDL1l*(CG33-PosPUDL1),0)-IF(CG33>(PosPUDL1+3),-PUDL1l*(CG33-PosPUDL1-3),0)-IF(CG33>PosPUDL2,PUDL2l*(CG33-PosPUDL2),0)-IF(CG33>(PosPUDL2+LePUDL2),-PUDL2l*(CG33-PosPUDL2-LePUDL2),0)-IF(CG33>PosPLa1,PLa1l,0)-IF(CG33>PosPLb1,PLb1l,0)","v":{"v":-6.807500000000008,"d":"-6.81"}},{"$f":"RL1l-2*CH33-IF(CH33>PosPUDL1,PUDL1l*(CH33-PosPUDL1),0)-IF(CH33>(PosPUDL1+3),-PUDL1l*(CH33-PosPUDL1-3),0)-IF(CH33>PosPUDL2,PUDL2l*(CH33-PosPUDL2),0)-IF(CH33>(PosPUDL2+LePUDL2),-PUDL2l*(CH33-PosPUDL2-LePUDL2),0)-IF(CH33>PosPLa1,PLa1l,0)-IF(CH33>PosPLb1,PLb1l,0)","v":{"v":-6.967500000000008,"d":"-6.97"}},{"$f":"RL1l-2*CI33-IF(CI33>PosPUDL1,PUDL1l*(CI33-PosPUDL1),0)-IF(CI33>(PosPUDL1+3),-PUDL1l*(CI33-PosPUDL1-3),0)-IF(CI33>PosPUDL2,PUDL2l*(CI33-PosPUDL2),0)-IF(CI33>(PosPUDL2+LePUDL2),-PUDL2l*(CI33-PosPUDL2-LePUDL2),0)-IF(CI33>PosPLa1,PLa1l,0)-IF(CI33>PosPLb1,PLb1l,0)","v":{"v":-7.127500000000008,"d":"-7.13"}},{"$f":"RL1l-2*CJ33-IF(CJ33>PosPUDL1,PUDL1l*(CJ33-PosPUDL1),0)-IF(CJ33>(PosPUDL1+3),-PUDL1l*(CJ33-PosPUDL1-3),0)-IF(CJ33>PosPUDL2,PUDL2l*(CJ33-PosPUDL2),0)-IF(CJ33>(PosPUDL2+LePUDL2),-PUDL2l*(CJ33-PosPUDL2-LePUDL2),0)-IF(CJ33>PosPLa1,PLa1l,0)-IF(CJ33>PosPLb1,PLb1l,0)","v":{"v":-7.2875000000000085,"d":"-7.29"}},{"$f":"RL1l-2*CK33-IF(CK33>PosPUDL1,PUDL1l*(CK33-PosPUDL1),0)-IF(CK33>(PosPUDL1+3),-PUDL1l*(CK33-PosPUDL1-3),0)-IF(CK33>PosPUDL2,PUDL2l*(CK33-PosPUDL2),0)-IF(CK33>(PosPUDL2+LePUDL2),-PUDL2l*(CK33-PosPUDL2-LePUDL2),0)-IF(CK33>PosPLa1,PLa1l,0)-IF(CK33>PosPLb1,PLb1l,0)","v":{"v":-7.447500000000009,"d":"-7.45"}},{"$f":"RL1l-2*CL33-IF(CL33>PosPUDL1,PUDL1l*(CL33-PosPUDL1),0)-IF(CL33>(PosPUDL1+3),-PUDL1l*(CL33-PosPUDL1-3),0)-IF(CL33>PosPUDL2,PUDL2l*(CL33-PosPUDL2),0)-IF(CL33>(PosPUDL2+LePUDL2),-PUDL2l*(CL33-PosPUDL2-LePUDL2),0)-IF(CL33>PosPLa1,PLa1l,0)-IF(CL33>PosPLb1,PLb1l,0)","v":{"v":-7.607500000000009,"d":"-7.61"}},{"$f":"RL1l-2*CM33-IF(CM33>PosPUDL1,PUDL1l*(CM33-PosPUDL1),0)-IF(CM33>(PosPUDL1+3),-PUDL1l*(CM33-PosPUDL1-3),0)-IF(CM33>PosPUDL2,PUDL2l*(CM33-PosPUDL2),0)-IF(CM33>(PosPUDL2+LePUDL2),-PUDL2l*(CM33-PosPUDL2-LePUDL2),0)-IF(CM33>PosPLa1,PLa1l,0)-IF(CM33>PosPLb1,PLb1l,0)","v":{"v":-7.767500000000009,"d":"-7.77"}},{"$f":"RL1l-2*CN33-IF(CN33>PosPUDL1,PUDL1l*(CN33-PosPUDL1),0)-IF(CN33>(PosPUDL1+3),-PUDL1l*(CN33-PosPUDL1-3),0)-IF(CN33>PosPUDL2,PUDL2l*(CN33-PosPUDL2),0)-IF(CN33>(PosPUDL2+LePUDL2),-PUDL2l*(CN33-PosPUDL2-LePUDL2),0)-IF(CN33>PosPLa1,PLa1l,0)-IF(CN33>PosPLb1,PLb1l,0)","v":{"v":-7.927500000000009,"d":"-7.93"}},{"$f":"RL1l-2*CO33-IF(CO33>PosPUDL1,PUDL1l*(CO33-PosPUDL1),0)-IF(CO33>(PosPUDL1+3),-PUDL1l*(CO33-PosPUDL1-3),0)-IF(CO33>PosPUDL2,PUDL2l*(CO33-PosPUDL2),0)-IF(CO33>(PosPUDL2+LePUDL2),-PUDL2l*(CO33-PosPUDL2-LePUDL2),0)-IF(CO33>PosPLa1,PLa1l,0)-IF(CO33>PosPLb1,PLb1l,0)","v":{"v":-8.08750000000001,"d":"-8.09"}},{"$f":"RL1l-2*CP33-IF(CP33>PosPUDL1,PUDL1l*(CP33-PosPUDL1),0)-IF(CP33>(PosPUDL1+3),-PUDL1l*(CP33-PosPUDL1-3),0)-IF(CP33>PosPUDL2,PUDL2l*(CP33-PosPUDL2),0)-IF(CP33>(PosPUDL2+LePUDL2),-PUDL2l*(CP33-PosPUDL2-LePUDL2),0)-IF(CP33>PosPLa1,PLa1l,0)-IF(CP33>PosPLb1,PLb1l,0)","v":{"v":-8.24750000000001,"d":"-8.25"}},{"$f":"RL1l-2*CQ33-IF(CQ33>PosPUDL1,PUDL1l*(CQ33-PosPUDL1),0)-IF(CQ33>(PosPUDL1+3),-PUDL1l*(CQ33-PosPUDL1-3),0)-IF(CQ33>PosPUDL2,PUDL2l*(CQ33-PosPUDL2),0)-IF(CQ33>(PosPUDL2+LePUDL2),-PUDL2l*(CQ33-PosPUDL2-LePUDL2),0)-IF(CQ33>PosPLa1,PLa1l,0)-IF(CQ33>PosPLb1,PLb1l,0)","v":{"v":-8.40750000000001,"d":"-8.41"}},{"$f":"RL1l-2*CR33-IF(CR33>PosPUDL1,PUDL1l*(CR33-PosPUDL1),0)-IF(CR33>(PosPUDL1+3),-PUDL1l*(CR33-PosPUDL1-3),0)-IF(CR33>PosPUDL2,PUDL2l*(CR33-PosPUDL2),0)-IF(CR33>(PosPUDL2+LePUDL2),-PUDL2l*(CR33-PosPUDL2-LePUDL2),0)-IF(CR33>PosPLa1,PLa1l,0)-IF(CR33>PosPLb1,PLb1l,0)","v":{"v":-8.56750000000001,"d":"-8.57"}},{"$f":"RL1l-2*CS33-IF(CS33>PosPUDL1,PUDL1l*(CS33-PosPUDL1),0)-IF(CS33>(PosPUDL1+3),-PUDL1l*(CS33-PosPUDL1-3),0)-IF(CS33>PosPUDL2,PUDL2l*(CS33-PosPUDL2),0)-IF(CS33>(PosPUDL2+LePUDL2),-PUDL2l*(CS33-PosPUDL2-LePUDL2),0)-IF(CS33>PosPLa1,PLa1l,0)-IF(CS33>PosPLb1,PLb1l,0)","v":{"v":-8.72750000000001,"d":"-8.73"}},{"$f":"RL1l-2*CT33-IF(CT33>PosPUDL1,PUDL1l*(CT33-PosPUDL1),0)-IF(CT33>(PosPUDL1+3),-PUDL1l*(CT33-PosPUDL1-3),0)-IF(CT33>PosPUDL2,PUDL2l*(CT33-PosPUDL2),0)-IF(CT33>(PosPUDL2+LePUDL2),-PUDL2l*(CT33-PosPUDL2-LePUDL2),0)-IF(CT33>PosPLa1,PLa1l,0)-IF(CT33>PosPLb1,PLb1l,0)","v":{"v":-8.88750000000001,"d":"-8.89"}},{"$f":"RL1l-2*CU33-IF(CU33>PosPUDL1,PUDL1l*(CU33-PosPUDL1),0)-IF(CU33>(PosPUDL1+3),-PUDL1l*(CU33-PosPUDL1-3),0)-IF(CU33>PosPUDL2,PUDL2l*(CU33-PosPUDL2),0)-IF(CU33>(PosPUDL2+LePUDL2),-PUDL2l*(CU33-PosPUDL2-LePUDL2),0)-IF(CU33>PosPLa1,PLa1l,0)-IF(CU33>PosPLb1,PLb1l,0)","v":{"v":-9.04750000000001,"d":"-9.05"}},{"$f":"RL1l-2*CV33-IF(CV33>PosPUDL1,PUDL1l*(CV33-PosPUDL1),0)-IF(CV33>(PosPUDL1+3),-PUDL1l*(CV33-PosPUDL1-3),0)-IF(CV33>PosPUDL2,PUDL2l*(CV33-PosPUDL2),0)-IF(CV33>(PosPUDL2+LePUDL2),-PUDL2l*(CV33-PosPUDL2-LePUDL2),0)-IF(CV33>PosPLa1,PLa1l,0)-IF(CV33>PosPLb1,PLb1l,0)","v":{"v":-9.20750000000001,"d":"-9.21"}},{"$f":"RL1l-2*CW33-IF(CW33>PosPUDL1,PUDL1l*(CW33-PosPUDL1),0)-IF(CW33>(PosPUDL1+3),-PUDL1l*(CW33-PosPUDL1-3),0)-IF(CW33>PosPUDL2,PUDL2l*(CW33-PosPUDL2),0)-IF(CW33>(PosPUDL2+LePUDL2),-PUDL2l*(CW33-PosPUDL2-LePUDL2),0)-IF(CW33>PosPLa1,PLa1l,0)-IF(CW33>PosPLb1,PLb1l,0)","v":{"v":-9.36750000000001,"d":"-9.37"}},{"$f":"RL1l-2*CX33-IF(CX33>PosPUDL1,PUDL1l*(CX33-PosPUDL1),0)-IF(CX33>(PosPUDL1+3),-PUDL1l*(CX33-PosPUDL1-3),0)-IF(CX33>PosPUDL2,PUDL2l*(CX33-PosPUDL2),0)-IF(CX33>(PosPUDL2+LePUDL2),-PUDL2l*(CX33-PosPUDL2-LePUDL2),0)-IF(CX33>PosPLa1,PLa1l,0)-IF(CX33>PosPLb1,PLb1l,0)","v":{"v":-9.52750000000001,"d":"-9.53"}},{"$f":"RL1l-2*CY33-IF(CY33>PosPUDL1,PUDL1l*(CY33-PosPUDL1),0)-IF(CY33>(PosPUDL1+3),-PUDL1l*(CY33-PosPUDL1-3),0)-IF(CY33>PosPUDL2,PUDL2l*(CY33-PosPUDL2),0)-IF(CY33>(PosPUDL2+LePUDL2),-PUDL2l*(CY33-PosPUDL2-LePUDL2),0)-IF(CY33>PosPLa1,PLa1l,0)-IF(CY33>PosPLb1,PLb1l,0)","v":{"v":-9.68750000000001,"d":"-9.69"}}]
[]
[]
[null,null,"DEFLECTION: MACAULAY'S METHOD"]
[]
[null,"RULES","EIw'\" = -M"]
[null,null,"rotation: EIw' = Eiφ = -ʃMdx+A"]
[null,null,"deflection: EIw = -ʃʃMdx+Ax+B"]
[]
[null,null,"DEAD (2nd integral)"]
[null,"Step",{"v":0,"d":"0.0"},{"$f":"8/100","v":{"v":0.08,"d":"0.1"}},{"$f":"D47+8/100","v":{"v":0.16,"d":"0.2"}},{"$f":"E47+8/100","v":{"v":0.24,"d":"0.2"}},{"$f":"F47+8/100","v":{"v":0.32,"d":"0.3"}},{"$f":"G47+8/100","v":0.4},{"$f":"H47+8/100","v":{"v":0.48000000000000004,"d":"0.5"}},{"$f":"I47+8/100","v":{"v":0.56,"d":"0.6"}},{"$f":"J47+8/100","v":{"v":0.64,"d":"0.6"}},{"$f":"K47+8/100","v":{"v":0.72,"d":"0.7"}},{"$f":"L47+8/100","v":{"v":0.7999999999999999,"d":"0.8"}},{"$f":"M47+8/100","v":{"v":0.8799999999999999,"d":"0.9"}},{"$f":"N47+8/100","v":{"v":0.9599999999999999,"d":"1.0"}},{"$f":"O47+8/100","v":{"v":1.0399999999999998,"d":"1.0"}},{"$f":"P47+8/100","v":{"v":1.1199999999999999,"d":"1.1"}},{"$f":"Q47+8/100","v":1.2},{"$f":"R47+8/100","v":{"v":1.28,"d":"1.3"}},{"$f":"S47+8/100","v":{"v":1.36,"d":"1.4"}},{"$f":"T47+8/100","v":{"v":1.4400000000000002,"d":"1.4"}},{"$f":"U47+8/100","v":{"v":1.5200000000000002,"d":"1.5"}},{"$f":"V47+8/100","v":{"v":1.6000000000000003,"d":"1.6"}},{"$f":"W47+8/100","v":{"v":1.6800000000000004,"d":"1.7"}},{"$f":"X47+8/100","v":{"v":1.7600000000000005,"d":"1.8"}},{"$f":"Y47+8/100","v":{"v":1.8400000000000005,"d":"1.8"}},{"$f":"Z47+8/100","v":{"v":1.9200000000000006,"d":"1.9"}},{"$f":"AA47+8/100","v":{"v":2.0000000000000004,"d":"2.0"}},{"$f":"AB47+8/100","v":{"v":2.0800000000000005,"d":"2.1"}},{"$f":"AC47+8/100","v":{"v":2.1600000000000006,"d":"2.2"}},{"$f":"AD47+8/100","v":{"v":2.2400000000000007,"d":"2.2"}},{"$f":"AE47+8/100","v":{"v":2.3200000000000007,"d":"2.3"}},{"$f":"AF47+8/100","v":{"v":2.400000000000001,"d":"2.4"}},{"$f":"AG47+8/100","v":{"v":2.480000000000001,"d":"2.5"}},{"$f":"AH47+8/100","v":{"v":2.560000000000001,"d":"2.6"}},{"$f":"AI47+8/100","v":{"v":2.640000000000001,"d":"2.6"}},{"$f":"AJ47+8/100","v":{"v":2.720000000000001,"d":"2.7"}},{"$f":"AK47+8/100","v":{"v":2.800000000000001,"d":"2.8"}},{"$f":"AL47+8/100","v":{"v":2.8800000000000012,"d":"2.9"}},{"$f":"AM47+8/100","v":{"v":2.9600000000000013,"d":"3.0"}},{"$f":"AN47+8/100","v":{"v":3.0400000000000014,"d":"3.0"}},{"$f":"AO47+8/100","v":{"v":3.1200000000000014,"d":"3.1"}},{"$f":"AP47+8/100","v":{"v":3.2000000000000015,"d":"3.2"}},{"$f":"AQ47+8/100","v":{"v":3.2800000000000016,"d":"3.3"}},{"$f":"AR47+8/100","v":{"v":3.3600000000000017,"d":"3.4"}},{"$f":"AS47+8/100","v":{"v":3.4400000000000017,"d":"3.4"}},{"$f":"AT47+8/100","v":{"v":3.520000000000002,"d":"3.5"}},{"$f":"AU47+8/100","v":{"v":3.600000000000002,"d":"3.6"}},{"$f":"AV47+8/100","v":{"v":3.680000000000002,"d":"3.7"}},{"$f":"AW47+8/100","v":{"v":3.760000000000002,"d":"3.8"}},{"$f":"AX47+8/100","v":{"v":3.840000000000002,"d":"3.8"}},{"$f":"AY47+8/100","v":{"v":3.920000000000002,"d":"3.9"}},{"$f":"AZ47+8/100","v":{"v":4.000000000000002,"d":"4.0"}},{"$f":"BA47+8/100","v":{"v":4.080000000000002,"d":"4.1"}},{"$f":"BB47+8/100","v":{"v":4.160000000000002,"d":"4.2"}},{"$f":"BC47+8/100","v":{"v":4.240000000000002,"d":"4.2"}},{"$f":"BD47+8/100","v":{"v":4.320000000000002,"d":"4.3"}},{"$f":"BE47+8/100","v":{"v":4.400000000000002,"d":"4.4"}},{"$f":"BF47+8/100","v":{"v":4.480000000000002,"d":"4.5"}},{"$f":"BG47+8/100","v":{"v":4.560000000000002,"d":"4.6"}},{"$f":"BH47+8/100","v":{"v":4.640000000000002,"d":"4.6"}},{"$f":"BI47+8/100","v":{"v":4.720000000000002,"d":"4.7"}},{"$f":"BJ47+8/100","v":{"v":4.8000000000000025,"d":"4.8"}},{"$f":"BK47+8/100","v":{"v":4.880000000000003,"d":"4.9"}},{"$f":"BL47+8/100","v":{"v":4.960000000000003,"d":"5.0"}},{"$f":"BM47+8/100","v":{"v":5.040000000000003,"d":"5.0"}},{"$f":"BN47+8/100","v":{"v":5.120000000000003,"d":"5.1"}},{"$f":"BO47+8/100","v":{"v":5.200000000000003,"d":"5.2"}},{"$f":"BP47+8/100","v":{"v":5.280000000000003,"d":"5.3"}},{"$f":"BQ47+8/100","v":{"v":5.360000000000003,"d":"5.4"}},{"$f":"BR47+8/100","v":{"v":5.440000000000003,"d":"5.4"}},{"$f":"BS47+8/100","v":{"v":5.520000000000003,"d":"5.5"}},{"$f":"BT47+8/100","v":{"v":5.600000000000003,"d":"5.6"}},{"$f":"BU47+8/100","v":{"v":5.680000000000003,"d":"5.7"}},{"$f":"BV47+8/100","v":{"v":5.760000000000003,"d":"5.8"}},{"$f":"BW47+8/100","v":{"v":5.840000000000003,"d":"5.8"}},{"$f":"BX47+8/100","v":{"v":5.9200000000000035,"d":"5.9"}},{"$f":"BY47+8/100","v":{"v":6.0000000000000036,"d":"6.0"}},{"$f":"BZ47+8/100","v":{"v":6.080000000000004,"d":"6.1"}},{"$f":"CA47+8/100","v":{"v":6.160000000000004,"d":"6.2"}},{"$f":"CB47+8/100","v":{"v":6.240000000000004,"d":"6.2"}},{"$f":"CC47+8/100","v":{"v":6.320000000000004,"d":"6.3"}},{"$f":"CD47+8/100","v":{"v":6.400000000000004,"d":"6.4"}},{"$f":"CE47+8/100","v":{"v":6.480000000000004,"d":"6.5"}},{"$f":"CF47+8/100","v":{"v":6.560000000000004,"d":"6.6"}},{"$f":"CG47+8/100","v":{"v":6.640000000000004,"d":"6.6"}},{"$f":"CH47+8/100","v":{"v":6.720000000000004,"d":"6.7"}},{"$f":"CI47+8/100","v":{"v":6.800000000000004,"d":"6.8"}},{"$f":"CJ47+8/100","v":{"v":6.880000000000004,"d":"6.9"}},{"$f":"CK47+8/100","v":{"v":6.960000000000004,"d":"7.0"}},{"$f":"CL47+8/100","v":{"v":7.0400000000000045,"d":"7.0"}},{"$f":"CM47+8/100","v":{"v":7.1200000000000045,"d":"7.1"}},{"$f":"CN47+8/100","v":{"v":7.200000000000005,"d":"7.2"}},{"$f":"CO47+8/100","v":{"v":7.280000000000005,"d":"7.3"}},{"$f":"CP47+8/100","v":{"v":7.360000000000005,"d":"7.4"}},{"$f":"CQ47+8/100","v":{"v":7.440000000000005,"d":"7.4"}},{"$f":"CR47+8/100","v":{"v":7.520000000000005,"d":"7.5"}},{"$f":"CS47+8/100","v":{"v":7.600000000000005,"d":"7.6"}},{"$f":"CT47+8/100","v":{"v":7.680000000000005,"d":"7.7"}},{"$f":"CU47+8/100","v":{"v":7.760000000000005,"d":"7.8"}},{"$f":"CV47+8/100","v":{"v":7.840000000000005,"d":"7.8"}},{"$f":"CW47+8/100","v":{"v":7.920000000000005,"d":"7.9"}},{"$f":"CX47+8/100","v":{"v":8.000000000000005,"d":"8.0"}}]
[null,"Reaction",{"$f":"-RL1d*C47^3/6","v":{"v":0,"d":"0.0"}},{"v":-0.001656746666666667,"d":"-0.0"},{"v":-0.013253973333333335,"d":"-0.0"},{"v":-0.04473215999999999,"d":"-0.0"},{"v":-0.10603178666666668,"d":"-0.1"},{"v":-0.20709333333333338,"d":"-0.2"},{"v":-0.3578572800000001,"d":"-0.4"},{"v":-0.5682641066666668,"d":"-0.6"},{"v":-0.8482542933333335,"d":"-0.8"},{"v":-1.2077683199999998,"d":"-1.2"},{"v":-1.6567466666666661,"d":"-1.7"},{"v":-2.205129813333332,"d":"-2.2"},{"v":-2.862858239999999,"d":"-2.9"},{"v":-3.6398724266666647,"d":"-3.6"},{"v":-4.546112853333331,"d":"-4.5"},{"v":-5.591519999999999,"d":"-5.6"},{"v":-6.786034346666668,"d":"-6.8"},{"v":-8.139596373333335,"d":"-8.1"},{"v":-9.662146560000002,"d":"-9.7"},{"v":-11.363625386666671,"d":"-11.4"},{"v":-13.25397333333334,"d":"-13.3"},{"v":-15.343130880000011,"d":"-15.3"},{"v":-17.64103850666668,"d":"-17.6"},{"v":-20.15763669333335,"d":"-20.2"},{"v":-22.90286592000002,"d":"-22.9"},{"v":-25.886666666666684,"d":"-25.9"},{"v":-29.11897941333335,"d":"-29.1"},{"v":-32.609744640000024,"d":"-32.6"},{"v":-36.36890282666669,"d":"-36.4"},{"v":-40.40639445333337,"d":"-40.4"},{"v":-44.73216000000004,"d":"-44.7"},{"v":-49.35613994666672,"d":"-49.4"},{"$f":"-RL1d*AI47^3/6","v":{"v":-54.28827477333339,"d":"-54.3"}},{"v":-59.53850496000006,"d":"-59.5"},{"v":-65.11677098666674,"d":"-65.1"},{"v":-71.03301333333341,"d":"-71.0"},{"v":-77.2971724800001,"d":"-77.3"},{"v":-83.91918890666678,"d":"-83.9"},{"v":-90.90900309333347,"d":"-90.9"},{"v":-98.27655552000014,"d":"-98.3"},{"v":-106.0317866666668,"d":"-106.0"},{"v":-114.1846370133335,"d":"-114.2"},{"v":-122.74504704000019,"d":"-122.7"},{"v":-131.72295722666686,"d":"-131.7"},{"v":-141.12830805333354,"d":"-141.1"},{"v":-150.97104000000022,"d":"-151.0"},{"v":-161.26109354666693,"d":"-161.3"},{"v":-172.0084091733336,"d":"-172.0"},{"v":-183.22292736000028,"d":"-183.2"},{"v":-194.91458858666695,"d":"-194.9"},{"v":-207.0933333333336,"d":"-207.1"},{"v":-219.7691020800003,"d":"-219.8"},{"v":-232.951835306667,"d":"-233.0"},{"v":-246.65147349333367,"d":"-246.7"},{"v":-260.8779571200004,"d":"-260.9"},{"v":-275.641226666667,"d":"-275.6"},{"v":-290.95122261333375,"d":"-291.0"},{"v":-306.81788544000045,"d":"-306.8"},{"v":-323.2511556266672,"d":"-323.3"},{"v":-340.26097365333385,"d":"-340.3"},{"v":-357.85728000000057,"d":"-357.9"},{"v":-376.0500151466672,"d":"-376.1"},{"v":-394.8491195733339,"d":"-394.8"},{"v":-414.26453376000063,"d":"-414.3"},{"$f":"-RL1d*BO47^3/6","v":{"v":-434.30619818666736,"d":"-434.3"}},{"v":-454.98405333333403,"d":"-455.0"},{"v":-476.3080396800008,"d":"-476.3"},{"v":-498.2880977066675,"d":"-498.3"},{"v":-520.9341678933342,"d":"-520.9"},{"v":-544.2561907200009,"d":"-544.3"},{"v":-568.2641066666675,"d":"-568.3"},{"v":-592.9678562133344,"d":"-593.0"},{"v":-618.3773798400011,"d":"-618.4"},{"v":-644.5026180266677,"d":"-644.5"},{"v":-671.3535112533344,"d":"-671.4"},{"v":-698.9400000000013,"d":"-698.9"},{"v":-727.2720247466679,"d":"-727.3"},{"v":-756.3595259733347,"d":"-756.4"},{"v":-786.2124441600014,"d":"-786.2"},{"v":-816.8407197866682,"d":"-816.8"},{"v":-848.2542933333348,"d":"-848.3"},{"v":-880.4631052800015,"d":"-880.5"},{"v":-913.4770961066682,"d":"-913.5"},{"v":-947.306206293335,"d":"-947.3"},{"v":-981.9603763200017,"d":"-982.0"},{"v":-1017.4495466666685,"d":"-1017.4"},{"v":-1053.7836578133354,"d":"-1053.8"},{"v":-1090.972650240002,"d":"-1091.0"},{"v":-1129.0264644266688,"d":"-1129.0"},{"v":-1167.9550408533357,"d":"-1168.0"},{"v":-1207.7683200000022,"d":"-1207.8"},{"v":-1248.4762423466689,"d":"-1248.5"},{"v":-1290.0887483733356,"d":"-1290.1"},{"v":-1332.6157785600024,"d":"-1332.6"},{"v":-1376.0672733866693,"d":"-1376.1"},{"v":-1420.453173333336,"d":"-1420.5"},{"$f":"-RL1d*CU47^3/6","v":{"v":-1465.7834188800027,"d":"-1465.8"}},{"$f":"-RL1d*CV47^3/6","v":{"v":-1512.0679505066698,"d":"-1512.1"}},{"$f":"-RL1d*CW47^3/6","v":{"v":-1559.3167086933363,"d":"-1559.3"}},{"$f":"-RL1d*CX47^3/6","v":{"v":-1607.539633920003,"d":"-1607.5"}},{"$f":"-RL1d*CY47^3/6","v":{"v":-1656.7466666666699,"d":"-1656.7"}}]
[null,"UDL",{"$f":"UDL1d*C47^4/24","v":{"v":0,"d":"0.0"}},{"v":5.9903999999999994E-6,"d":"0.0"},{"v":9.5846399999999991E-5,"d":"0.0"},{"v":4.8522239999999997E-4,"d":"0.0"},{"v":1.5335423999999999E-3,"d":"0.0"},{"v":3.7440000000000012E-3,"d":"0.0"},{"v":7.763558400000003E-3,"d":"0.0"},{"v":0.014382950400000002,"d":"0.0"},{"v":0.024536678399999998,"d":"0.0"},{"v":0.039303014399999996,"d":"0.0"},{"v":0.05990399999999998,"d":"0.1"},{"v":0.08770544639999996,"d":"0.1"},{"v":0.12421693439999992,"d":"0.1"},{"v":0.17109181439999988,"d":"0.2"},{"v":0.23012720639999987,"d":"0.2"},{"v":0.303264,"d":"0.3"},{"v":0.39258685439999996,"d":"0.4"},{"v":0.5003241984000001,"d":"0.5"},{"v":0.6288482304000002,"d":"0.6"},{"v":0.7806749184000005,"d":"0.8"},{"v":0.9584640000000006,"d":"1.0"},{"v":1.165018982400001,"d":"1.2"},{"v":1.4032871424000015,"d":"1.4"},{"v":1.6763595264000017,"d":"1.7"},{"v":1.987470950400002,"d":"2.0"},{"v":2.340000000000002,"d":"2.3"},{"v":2.737469030400003,"d":"2.7"},{"v":3.1835441664000026,"d":"3.2"},{"v":3.682035302400003,"d":"3.7"},{"v":4.236896102400005,"d":"4.2"},{"v":4.852224000000007,"d":"4.9"},{"v":5.5322601984000075,"d":"5.5"},{"$f":"UDL1d*AI47^4/24","v":{"v":6.281389670400009,"d":"6.3"}},{"v":7.104141158400011,"d":"7.1"},{"v":8.005187174400012,"d":"8.0"},{"v":8.989344000000013,"d":"9.0"},{"v":10.061571686400015,"d":"10.1"},{"v":11.226974054400022,"d":"11.2"},{"v":12.490798694400025,"d":"12.5"},{"v":13.858436966400028,"d":"13.9"},{"v":15.335424000000026,"d":"15.3"},{"v":16.92743869440003,"d":"16.9"},{"v":18.640303718400034,"d":"18.6"},{"v":20.479985510400038,"d":"20.5"},{"v":22.452594278400042,"d":"22.5"},{"v":24.56438400000005,"d":"24.6"},{"v":26.821752422400056,"d":"26.8"},{"v":29.231241062400063,"d":"29.2"},{"v":31.799535206400066,"d":"31.8"},{"v":34.53346391040007,"d":"34.5"},{"v":37.44000000000006,"d":"37.4"},{"v":40.52626007040006,"d":"40.5"},{"v":43.79950448640008,"d":"43.8"},{"v":47.26713738240008,"d":"47.3"},{"v":50.9367066624001,"d":"50.9"},{"v":54.815904000000096,"d":"54.8"},{"v":58.91256483840012,"d":"58.9"},{"v":63.23466839040011,"d":"63.2"},{"v":67.79033763840015,"d":"67.8"},{"v":72.58783933440014,"d":"72.6"},{"v":77.63558400000015,"d":"77.6"},{"v":82.94212592640017,"d":"82.9"},{"v":88.51616317440018,"d":"88.5"},{"v":94.36653757440018,"d":"94.4"},{"$f":"UDL1d*BO47^4/24","v":{"v":100.50223472640023,"d":"100.5"}},{"v":106.93238400000024,"d":"106.9"},{"v":113.66625853440024,"d":"113.7"},{"v":120.71327523840027,"d":"120.7"},{"v":128.08299479040028,"d":"128.1"},{"v":135.78512163840028,"d":"135.8"},{"v":143.8295040000003,"d":"143.8"},{"v":152.2261338624003,"d":"152.2"},{"v":160.98514698240038,"d":"161.0"},{"v":170.11682288640037,"d":"170.1"},{"v":179.63158487040042,"d":"179.6"},{"v":189.54000000000045,"d":"189.5"},{"v":199.85277911040043,"d":"199.9"},{"v":210.58077680640054,"d":"210.6"},{"v":221.73499146240047,"d":"221.7"},{"v":233.32656522240055,"d":"233.3"},{"v":245.3667840000006,"d":"245.4"},{"v":257.86707747840063,"d":"257.9"},{"v":270.8390191104006,"d":"270.8"},{"v":284.29432611840065,"d":"284.3"},{"v":298.2448594944007,"d":"298.2"},{"v":312.70262400000075,"d":"312.7"},{"v":327.67976816640083,"d":"327.7"},{"v":343.18858429440075,"d":"343.2"},{"v":359.2415084544009,"d":"359.2"},{"v":375.851120486401,"d":"375.9"},{"v":393.030144000001,"d":"393.0"},{"v":410.791446374401,"d":"410.8"},{"v":429.148038758401,"d":"429.1"},{"v":448.1130760704011,"d":"448.1"},{"v":467.6998569984012,"d":"467.7"},{"v":487.9218240000012,"d":"487.9"},{"v":508.7925633024013,"d":"508.8"},{"v":530.3258049024015,"d":"530.3"},{"v":552.5354225664014,"d":"552.5"},{"v":575.4354338304015,"d":"575.4"},{"v":599.0400000000016,"d":"599.0"}]
[null,"PUDL a",{"$f":"IF(PosPUDL1<C47,PUDL1d*(C47-PosPUDL1)^4/24,0)","v":{"v":0,"d":"0.0"}},{"v":0,"d":"0.0"},{"v":0,"d":"0.0"},{"v":0,"d":"0.0"},{"v":0,"d":"0.0"},{"v":0,"d":"0.0"},{"v":0,"d":"0.0"},{"v":0,"d":"0.0"},{"v":0,"d":"0.0"},{"v":0,"d":"0.0"},{"v":0,"d":"0.0"},{"v":0,"d":"0.0"},{"v":0,"d":"0.0"},{"v":2.1333333333332934E-7,"d":"0.0"},{"v":1.7279999999999933E-5,"d":"0.0"},{"v":1.333333333333332E-4,"d":"0.0"},{"v":5.1221333333333345E-4,"d":"0.0"},{"v":1.3996800000000015E-3,"d":"0.0"},{"v":3.1234133333333386E-3,"d":"0.0"},{"v":0.006093013333333345,"d":"0.0"},{"v":0.010800000000000023,"d":"0.0"},{"v":0.017817813333333373,"d":"0.0"},{"v":0.027801813333333397,"d":"0.0"},{"v":0.04148928000000011,"d":"0.0"},{"v":0.05969941333333348,"d":"0.1"},{"v":0.08333333333333348,"d":"0.1"},{"v":0.11337408000000022,"d":"0.1"},{"v":0.15088661333333367,"d":"0.2"},{"v":0.19701781333333376,"d":"0.2"},{"v":0.2529964800000006,"d":"0.3"},{"v":0.32013333333333405,"d":"0.3"},{"v":0.39982101333333425,"d":"0.4"},{"$f":"IF(PosPUDL1<AI47,PUDL1d*(AI47-PosPUDL1)^4/24,0)","v":{"v":0.49353408000000115,"d":"0.5"}},{"v":0.6028290133333347,"d":"0.6"},{"v":0.7293442133333352,"d":"0.7"},{"v":0.8748000000000022,"d":"0.9"},{"v":1.040998613333336,"d":"1.0"},{"v":1.2298242133333366,"d":"1.2"},{"v":1.443242880000004,"d":"1.4"},{"v":1.683302613333338,"d":"1.7"},{"v":1.9521333333333388,"d":"2.0"},{"v":2.2519468800000064,"d":"2.3"},{"v":2.58503701333334,"d":"2.6"},{"v":2.9537794133333417,"d":"3.0"},{"v":3.36063168000001,"d":"3.4"},{"v":3.8081333333333443,"d":"3.8"},{"v":4.298905813333346,"d":"4.3"},{"v":4.835652480000014,"d":"4.8"},{"v":5.4211586133333505,"d":"5.4"},{"v":6.058291413333351,"d":"6.1"},{"v":6.750000000000017,"d":"6.8"},{"v":7.499315413333353,"d":"7.5"},{"v":8.309350613333354,"d":"8.3"},{"v":9.183300480000023,"d":"9.2"},{"v":10.124441813333357,"d":"10.1"},{"v":11.136133333333362,"d":"11.1"},{"v":12.221815680000029,"d":"12.2"},{"v":13.385011413333368,"d":"13.4"},{"v":14.629325013333371,"d":"14.6"},{"v":15.95844288000004,"d":"16.0"},{"v":17.376133333333378,"d":"17.4"},{"v":18.886246613333388,"d":"18.9"},{"v":20.492714880000054,"d":"20.5"},{"v":22.19955221333339,"d":"22.2"},{"$f":"IF(PosPUDL1<BO47,PUDL1d*(BO47-PosPUDL1)^4/24,0)","v":{"v":24.010854613333404,"d":"24.0"}},{"v":25.930800000000076,"d":"25.9"},{"v":27.96364821333341,"d":"28.0"},{"v":30.11374101333342,"d":"30.1"},{"v":32.38550208000009,"d":"32.4"},{"v":34.783437013333426,"d":"34.8"},{"v":37.312133333333435,"d":"37.3"},{"v":39.976260480000114,"d":"40.0"},{"v":42.78056981333345,"d":"42.8"},{"v":45.72989461333345,"d":"45.7"},{"v":48.82915008000014,"d":"48.8"},{"v":52.083333333333485,"d":"52.1"},{"v":55.49752341333348,"d":"55.5"},{"v":59.07688128000017,"d":"59.1"},{"v":62.82664981333351,"d":"62.8"},{"v":66.75215381333352,"d":"66.8"},{"v":70.85880000000022,"d":"70.9"},{"v":75.15207701333354,"d":"75.2"},{"v":79.63755541333357,"d":"79.6"},{"v":84.32088768000024,"d":"84.3"},{"v":89.20780821333358,"d":"89.2"},{"v":94.30413333333361,"d":"94.3"},{"v":99.61576128000031,"d":"99.6"},{"v":105.14867221333363,"d":"105.1"},{"v":110.90892821333368,"d":"110.9"},{"v":116.90267328000034,"d":"116.9"},{"v":123.13613333333369,"d":"123.1"},{"v":129.6156162133337,"d":"129.6"},{"v":136.3475116800004,"d":"136.3"},{"v":143.33829141333376,"d":"143.3"},{"v":150.59450901333375,"d":"150.6"},{"v":158.12280000000047,"d":"158.1"},{"v":165.92988181333385,"d":"165.9"},{"v":174.02255381333387,"d":"174.0"},{"v":182.40769728000058,"d":"182.4"},{"v":191.0922754133339,"d":"191.1"},{"v":200.0833333333339,"d":"200.1"}]
[null,"PUDL a contra",{"$f":"-IF(C47>(PosPUDL1+3),PUDL1d*(C47-PosPUDL1-3)^4/24,0)","v":{"v":0,"d":"0.0"}},{"$f":"-IF(D47>(PosPUDL1+3),PUDL1d*(D47-PosPUDL1-3)^4/24,0)","v":{"v":0,"d":"0.0"}},{"$f":"-IF(E47>(PosPUDL1+3),PUDL1d*(E47-PosPUDL1-3)^4/24,0)","v":{"v":0,"d":"0.0"}},{"$f":"-IF(F47>(PosPUDL1+3),PUDL1d*(F47-PosPUDL1-3)^4/24,0)","v":{"v":0,"d":"0.0"}},{"$f":"-IF(G47>(PosPUDL1+3),PUDL1d*(G47-PosPUDL1-3)^4/24,0)","v":{"v":0,"d":"0.0"}},{"$f":"-IF(H47>(PosPUDL1+3),PUDL1d*(H47-PosPUDL1-3)^4/24,0)","v":{"v":0,"d":"0.0"}},{"$f":"-IF(I47>(PosPUDL1+3),PUDL1d*(I47-PosPUDL1-3)^4/24,0)","v":{"v":0,"d":"0.0"}},{"$f":"-IF(J47>(PosPUDL1+3),PUDL1d*(J47-PosPUDL1-3)^4/24,0)","v":{"v":0,"d":"0.0"}},{"$f":"-IF(K47>(PosPUDL1+3),PUDL1d*(K47-PosPUDL1-3)^4/24,0)","v":{"v":0,"d":"0.0"}},{"$f":"-IF(L47>(PosPUDL1+3),PUDL1d*(L47-PosPUDL1-3)^4/24,0)","v":{"v":0,"d":"0.0"}},{"$f":"-IF(M47>(PosPUDL1+3),PUDL1d*(M47-PosPUDL1-3)^4/24,0)","v":{"v":0,"d":"0.0"}},{"$f":"-IF(N47>(PosPUDL1+3),PUDL1d*(N47-PosPUDL1-3)^4/24,0)","v":{"v":0,"d":"0.0"}},{"$f":"-IF(O47>(PosPUDL1+3),PUDL1d*(O47-PosPUDL1-3)^4/24,0)","v":{"v":0,"d":"0.0"}},{"$f":"-IF(P47>(PosPUDL1+3),PUDL1d*(P47-PosPUDL1-3)^4/24,0)","v":{"v":0,"d":"0.0"}},{"$f":"-IF(Q47>(PosPUDL1+3),PUDL1d*(Q47-PosPUDL1-3)^4/24,0)","v":{"v":0,"d":"0.0"}},{"$f":"-IF(R47>(PosPUDL1+3),PUDL1d*(R47-PosPUDL1-3)^4/24,0)","v":{"v":0,"d":"0.0"}},{"$f":"-IF(S47>(PosPUDL1+3),PUDL1d*(S47-PosPUDL1-3)^4/24,0)","v":{"v":0,"d":"0.0"}},{"$f":"-IF(T47>(PosPUDL1+3),PUDL1d*(T47-PosPUDL1-3)^4/24,0)","v":{"v":0,"d":"0.0"}},{"$f":"-IF(U47>(PosPUDL1+3),PUDL1d*(U47-PosPUDL1-3)^4/24,0)","v":{"v":0,"d":"0.0"}},{"$f":"-IF(V47>(PosPUDL1+3),PUDL1d*(V47-PosPUDL1-3)^4/24,0)","v":{"v":0,"d":"0.0"}},{"$f":"-IF(W47>(PosPUDL1+3),PUDL1d*(W47-PosPUDL1-3)^4/24,0)","v":{"v":0,"d":"0.0"}},{"$f":"-IF(X47>(PosPUDL1+3),PUDL1d*(X47-PosPUDL1-3)^4/24,0)","v":{"v":0,"d":"0.0"}},{"$f":"-IF(Y47>(PosPUDL1+3),PUDL1d*(Y47-PosPUDL1-3)^4/24,0)","v":{"v":0,"d":"0.0"}},{"$f":"-IF(Z47>(PosPUDL1+3),PUDL1d*(Z47-PosPUDL1-3)^4/24,0)","v":{"v":0,"d":"0.0"}},{"$f":"-IF(AA47>(PosPUDL1+3),PUDL1d*(AA47-PosPUDL1-3)^4/24,0)","v":{"v":0,"d":"0.0"}},{"$f":"-IF(AB47>(PosPUDL1+3),PUDL1d*(AB47-PosPUDL1-3)^4/24,0)","v":{"v":0,"d":"0.0"}},{"$f":"-IF(AC47>(PosPUDL1+3),PUDL1d*(AC47-PosPUDL1-3)^4/24,0)","v":{"v":0,"d":"0.0"}},{"$f":"-IF(AD47>(PosPUDL1+3),PUDL1d*(AD47-PosPUDL1-3)^4/24,0)","v":{"v":0,"d":"0.0"}},{"$f":"-IF(AE47>(PosPUDL1+3),PUDL1d*(AE47-PosPUDL1-3)^4/24,0)","v":{"v":0,"d":"0.0"}},{"$f":"-IF(AF47>(PosPUDL1+3),PUDL1d*(AF47-PosPUDL1-3)^4/24,0)","v":{"v":0,"d":"0.0"}},{"$f":"-IF(AG47>(PosPUDL1+3),PUDL1d*(AG47-PosPUDL1-3)^4/24,0)","v":{"v":0,"d":"0.0"}},{"$f":"-IF(AH47>(PosPUDL1+3),PUDL1d*(AH47-PosPUDL1-3)^4/24,0)","v":{"v":0,"d":"0.0"}},{"$f":"-IF(AI47>(PosPUDL1+3),PUDL1d*(AI47-PosPUDL1-3)^4/24,0)","v":{"v":0,"d":"0.0"}},{"$f":"-IF(AJ47>(PosPUDL1+3),PUDL1d*(AJ47-PosPUDL1-3)^4/24,0)","v":{"v":0,"d":"0.0"}},{"$f":"-IF(AK47>(PosPUDL1+3),PUDL1d*(AK47-PosPUDL1-3)^4/24,0)","v":{"v":0,"d":"0.0"}},{"$f":"-IF(AL47>(PosPUDL1+3),PUDL1d*(AL47-PosPUDL1-3)^4/24,0)","v":{"v":0,"d":"0.0"}},{"$f":"-IF(AM47>(PosPUDL1+3),PUDL1d*(AM47-PosPUDL1-3)^4/24,0)","v":{"v":0,"d":"0.0"}},{"$f":"-IF(AN47>(PosPUDL1+3),PUDL1d*(AN47-PosPUDL1-3)^4/24,0)","v":{"v":0,"d":"0.0"}},{"$f":"-IF(AO47>(PosPUDL1+3),PUDL1d*(AO47-PosPUDL1-3)^4/24,0)","v":{"v":0,"d":"0.0"}},{"$f":"-IF(AP47>(PosPUDL1+3),PUDL1d*(AP47-PosPUDL1-3)^4/24,0)","v":{"v":0,"d":"0.0"}},{"$f":"-IF(AQ47>(PosPUDL1+3),PUDL1d*(AQ47-PosPUDL1-3)^4/24,0)","v":{"v":0,"d":"0.0"}},{"$f":"-IF(AR47>(PosPUDL1+3),PUDL1d*(AR47-PosPUDL1-3)^4/24,0)","v":{"v":0,"d":"0.0"}},{"$f":"-IF(AS47>(PosPUDL1+3),PUDL1d*(AS47-PosPUDL1-3)^4/24,0)","v":{"v":0,"d":"0.0"}},{"$f":"-IF(AT47>(PosPUDL1+3),PUDL1d*(AT47-PosPUDL1-3)^4/24,0)","v":{"v":0,"d":"0.0"}},{"$f":"-IF(AU47>(PosPUDL1+3),PUDL1d*(AU47-PosPUDL1-3)^4/24,0)","v":{"v":0,"d":"0.0"}},{"$f":"-IF(AV47>(PosPUDL1+3),PUDL1d*(AV47-PosPUDL1-3)^4/24,0)","v":{"v":0,"d":"0.0"}},{"$f":"-IF(AW47>(PosPUDL1+3),PUDL1d*(AW47-PosPUDL1-3)^4/24,0)","v":{"v":0,"d":"0.0"}},{"$f":"-IF(AX47>(PosPUDL1+3),PUDL1d*(AX47-PosPUDL1-3)^4/24,0)","v":{"v":0,"d":"0.0"}},{"$f":"-IF(AY47>(PosPUDL1+3),PUDL1d*(AY47-PosPUDL1-3)^4/24,0)","v":{"v":0,"d":"0.0"}},{"$f":"-IF(AZ47>(PosPUDL1+3),PUDL1d*(AZ47-PosPUDL1-3)^4/24,0)","v":{"v":0,"d":"0.0"}},{"$f":"-IF(BA47>(PosPUDL1+3),PUDL1d*(BA47-PosPUDL1-3)^4/24,0)","v":{"v":0,"d":"0.0"}},{"$f":"-IF(BB47>(PosPUDL1+3),PUDL1d*(BB47-PosPUDL1-3)^4/24,0)","v":{"v":-3.4133333333336485E-6,"d":"-0.0"}},{"$f":"-IF(BC47>(PosPUDL1+3),PUDL1d*(BC47-PosPUDL1-3)^4/24,0)","v":{"v":-5.4613333333335957E-5,"d":"-0.0"}},{"$f":"-IF(BD47>(PosPUDL1+3),PUDL1d*(BD47-PosPUDL1-3)^4/24,0)","v":{"v":-2.7648000000000917E-4,"d":"-0.0"}},{"$f":"-IF(BE47>(PosPUDL1+3),PUDL1d*(BE47-PosPUDL1-3)^4/24,0)","v":{"v":-8.738133333333559E-4,"d":"-0.0"}},{"$f":"-IF(BF47>(PosPUDL1+3),PUDL1d*(BF47-PosPUDL1-3)^4/24,0)","v":{"v":-2.1333333333333785E-3,"d":"-0.0"}},{"$f":"-IF(BG47>(PosPUDL1+3),PUDL1d*(BG47-PosPUDL1-3)^4/24,0)","v":{"v":-0.004423680000000081,"d":"-0.0"}},{"$f":"-IF(BH47>(PosPUDL1+3),PUDL1d*(BH47-PosPUDL1-3)^4/24,0)","v":{"v":-0.008195413333333465,"d":"-0.0"}},{"$f":"-IF(BI47>(PosPUDL1+3),PUDL1d*(BI47-PosPUDL1-3)^4/24,0)","v":{"v":-0.01398101333333354,"d":"-0.0"}},{"$f":"-IF(BJ47>(PosPUDL1+3),PUDL1d*(BJ47-PosPUDL1-3)^4/24,0)","v":{"v":-0.022394880000000308,"d":"-0.0"}},{"$f":"-IF(BK47>(PosPUDL1+3),PUDL1d*(BK47-PosPUDL1-3)^4/24,0)","v":{"v":-0.03413333333333376,"d":"-0.0"}},{"$f":"-IF(BL47>(PosPUDL1+3),PUDL1d*(BL47-PosPUDL1-3)^4/24,0)","v":{"v":-0.04997461333333392,"d":"-0.0"}},{"$f":"-IF(BM47>(PosPUDL1+3),PUDL1d*(BM47-PosPUDL1-3)^4/24,0)","v":{"v":-0.07077888000000078,"d":"-0.1"}},{"$f":"-IF(BN47>(PosPUDL1+3),PUDL1d*(BN47-PosPUDL1-3)^4/24,0)","v":{"v":-0.09748821333333435,"d":"-0.1"}},{"$f":"-IF(BO47>(PosPUDL1+3),PUDL1d*(BO47-PosPUDL1-3)^4/24,0)","v":{"v":-0.1311266133333346,"d":"-0.1"}},{"$f":"-IF(BP47>(PosPUDL1+3),PUDL1d*(BP47-PosPUDL1-3)^4/24,0)","v":{"v":-0.17280000000000165,"d":"-0.2"}},{"$f":"-IF(BQ47>(PosPUDL1+3),PUDL1d*(BQ47-PosPUDL1-3)^4/24,0)","v":{"v":-0.22369621333333536,"d":"-0.2"}},{"$f":"-IF(BR47>(PosPUDL1+3),PUDL1d*(BR47-PosPUDL1-3)^4/24,0)","v":{"v":-0.28508501333333586,"d":"-0.3"}},{"$f":"-IF(BS47>(PosPUDL1+3),PUDL1d*(BS47-PosPUDL1-3)^4/24,0)","v":{"v":-0.35831808000000304,"d":"-0.4"}},{"$f":"-IF(BT47>(PosPUDL1+3),PUDL1d*(BT47-PosPUDL1-3)^4/24,0)","v":{"v":-0.44482901333333696,"d":"-0.4"}},{"$f":"-IF(BU47>(PosPUDL1+3),PUDL1d*(BU47-PosPUDL1-3)^4/24,0)","v":{"v":-0.5461333333333377,"d":"-0.5"}},{"$f":"-IF(BV47>(PosPUDL1+3),PUDL1d*(BV47-PosPUDL1-3)^4/24,0)","v":{"v":-0.6638284800000053,"d":"-0.7"}},{"$f":"-IF(BW47>(PosPUDL1+3),PUDL1d*(BW47-PosPUDL1-3)^4/24,0)","v":{"v":-0.7995938133333395,"d":"-0.8"}},{"$f":"-IF(BX47>(PosPUDL1+3),PUDL1d*(BX47-PosPUDL1-3)^4/24,0)","v":{"v":-0.9551906133333404,"d":"-1.0"}},{"$f":"-IF(BY47>(PosPUDL1+3),PUDL1d*(BY47-PosPUDL1-3)^4/24,0)","v":{"v":-1.132462080000008,"d":"-1.1"}},{"$f":"-IF(BZ47>(PosPUDL1+3),PUDL1d*(BZ47-PosPUDL1-3)^4/24,0)","v":{"v":-1.3333333333333428,"d":"-1.3"}},{"$f":"-IF(CA47>(PosPUDL1+3),PUDL1d*(CA47-PosPUDL1-3)^4/24,0)","v":{"v":-1.559811413333344,"d":"-1.6"}},{"$f":"-IF(CB47>(PosPUDL1+3),PUDL1d*(CB47-PosPUDL1-3)^4/24,0)","v":{"v":-1.813985280000013,"d":"-1.8"}},{"$f":"-IF(CC47>(PosPUDL1+3),PUDL1d*(CC47-PosPUDL1-3)^4/24,0)","v":{"v":-2.0980258133333476,"d":"-2.1"}},{"$f":"-IF(CD47>(PosPUDL1+3),PUDL1d*(CD47-PosPUDL1-3)^4/24,0)","v":{"v":-2.414185813333349,"d":"-2.4"}},{"$f":"-IF(CE47>(PosPUDL1+3),PUDL1d*(CE47-PosPUDL1-3)^4/24,0)","v":{"v":-2.7648000000000175,"d":"-2.8"}},{"$f":"-IF(CF47>(PosPUDL1+3),PUDL1d*(CF47-PosPUDL1-3)^4/24,0)","v":{"v":-3.1522850133333535,"d":"-3.2"}},{"$f":"-IF(CG47>(PosPUDL1+3),PUDL1d*(CG47-PosPUDL1-3)^4/24,0)","v":{"v":-3.579139413333356,"d":"-3.6"}},{"$f":"-IF(CH47>(PosPUDL1+3),PUDL1d*(CH47-PosPUDL1-3)^4/24,0)","v":{"v":-4.047943680000025,"d":"-4.0"}},{"$f":"-IF(CI47>(PosPUDL1+3),PUDL1d*(CI47-PosPUDL1-3)^4/24,0)","v":{"v":-4.561360213333361,"d":"-4.6"}},{"$f":"-IF(CJ47>(PosPUDL1+3),PUDL1d*(CJ47-PosPUDL1-3)^4/24,0)","v":{"v":-5.122133333333364,"d":"-5.1"}},{"$f":"-IF(CK47>(PosPUDL1+3),PUDL1d*(CK47-PosPUDL1-3)^4/24,0)","v":{"v":-5.7330892800000335,"d":"-5.7"}},{"$f":"-IF(CL47>(PosPUDL1+3),PUDL1d*(CL47-PosPUDL1-3)^4/24,0)","v":{"v":-6.397136213333372,"d":"-6.4"}},{"$f":"-IF(CM47>(PosPUDL1+3),PUDL1d*(CM47-PosPUDL1-3)^4/24,0)","v":{"v":-7.117264213333375,"d":"-7.1"}},{"$f":"-IF(CN47>(PosPUDL1+3),PUDL1d*(CN47-PosPUDL1-3)^4/24,0)","v":{"v":-7.896545280000048,"d":"-7.9"}},{"$f":"-IF(CO47>(PosPUDL1+3),PUDL1d*(CO47-PosPUDL1-3)^4/24,0)","v":{"v":-8.738133333333385,"d":"-8.7"}},{"$f":"-IF(CP47>(PosPUDL1+3),PUDL1d*(CP47-PosPUDL1-3)^4/24,0)","v":{"v":-9.645264213333387,"d":"-9.6"}},{"$f":"-IF(CQ47>(PosPUDL1+3),PUDL1d*(CQ47-PosPUDL1-3)^4/24,0)","v":{"v":-10.62125568000006,"d":"-10.6"}},{"$f":"-IF(CR47>(PosPUDL1+3),PUDL1d*(CR47-PosPUDL1-3)^4/24,0)","v":{"v":-11.669507413333397,"d":"-11.7"}},{"$f":"-IF(CS47>(PosPUDL1+3),PUDL1d*(CS47-PosPUDL1-3)^4/24,0)","v":{"v":-12.793501013333406,"d":"-12.8"}},{"$f":"-IF(CT47>(PosPUDL1+3),PUDL1d*(CT47-PosPUDL1-3)^4/24,0)","v":{"v":-13.996800000000079,"d":"-14.0"}},{"$f":"-IF(CU47>(PosPUDL1+3),PUDL1d*(CU47-PosPUDL1-3)^4/24,0)","v":{"v":-15.283049813333418,"d":"-15.3"}},{"$f":"-IF(CV47>(PosPUDL1+3),PUDL1d*(CV47-PosPUDL1-3)^4/24,0)","v":{"v":-16.655977813333426,"d":"-16.7"}},{"$f":"-IF(CW47>(PosPUDL1+3),PUDL1d*(CW47-PosPUDL1-3)^4/24,0)","v":{"v":-18.1193932800001,"d":"-18.1"}},{"$f":"-IF(CX47>(PosPUDL1+3),PUDL1d*(CX47-PosPUDL1-3)^4/24,0)","v":{"v":-19.67718741333344,"d":"-19.7"}},{"$f":"-IF(CY47>(PosPUDL1+3),PUDL1d*(CY47-PosPUDL1-3)^4/24,0)","v":{"v":-21.333333333333446,"d":"-21.3"}}]
[null,"PUDL b",{"$f":"IF(PosPUDL2<C47,PUDL2d*(C47-PosPUDL2)^4/24,0)","v":{"v":0,"d":"0.0"}},{"v":0,"d":"0.0"},{"v":0,"d":"0.0"},{"v":0,"d":"0.0"},{"v":0,"d":"0.0"},{"v":0,"d":"0.0"},{"v":0,"d":"0.0"},{"v":0,"d":"0.0"},{"v":0,"d":"0.0"},{"v":0,"d":"0.0"},{"v":0,"d":"0.0"},{"v":0,"d":"0.0"},{"v":0,"d":"0.0"},{"v":0,"d":"0.0"},{"v":0,"d":"0.0"},{"v":0,"d":"0.0"},{"v":0,"d":"0.0"},{"v":0,"d":"0.0"},{"v":0,"d":"0.0"},{"v":0,"d":"0.0"},{"v":0,"d":"0.0"},{"v":0,"d":"0.0"},{"v":0,"d":"0.0"},{"v":0,"d":"0.0"},{"v":0,"d":"0.0"},{"v":0,"d":"0.0"},{"v":0,"d":"0.0"},{"v":0,"d":"0.0"},{"v":0,"d":"0.0"},{"v":0,"d":"0.0"},{"v":0,"d":"0.0"},{"v":0,"d":"0.0"},{"$f":"IF(PosPUDL2<AI47,PUDL2d*(AI47-PosPUDL2)^4/24,0)","v":{"v":0,"d":"0.0"}},{"v":0,"d":"0.0"},{"v":0,"d":"0.0"},{"v":0,"d":"0.0"},{"v":0,"d":"0.0"},{"v":0,"d":"0.0"},{"v":0,"d":"0.0"},{"v":0,"d":"0.0"},{"v":0,"d":"0.0"},{"v":0,"d":"0.0"},{"v":0,"d":"0.0"},{"v":0,"d":"0.0"},{"v":0,"d":"0.0"},{"v":0,"d":"0.0"},{"v":0,"d":"0.0"},{"v":0,"d":"0.0"},{"v":0,"d":"0.0"},{"v":0,"d":"0.0"},{"v":0,"d":"0.0"},{"v":0,"d":"0.0"},{"v":0,"d":"0.0"},{"v":0,"d":"0.0"},{"v":0,"d":"0.0"},{"v":0,"d":"0.0"},{"v":0,"d":"0.0"},{"v":0,"d":"0.0"},{"v":0,"d":"0.0"},{"v":0,"d":"0.0"},{"v":0,"d":"0.0"},{"v":0,"d":"0.0"},{"v":0,"d":"0.0"},{"v":0,"d":"0.0"},{"$f":"IF(PosPUDL2<BO47,PUDL2d*(BO47-PosPUDL2)^4/24,0)","v":{"v":0,"d":"0.0"}},{"v":0,"d":"0.0"},{"v":0,"d":"0.0"},{"v":0,"d":"0.0"},{"v":0,"d":"0.0"},{"v":0,"d":"0.0"},{"v":0,"d":"0.0"},{"v":0,"d":"0.0"},{"v":0,"d":"0.0"},{"v":0,"d":"0.0"},{"v":0,"d":"0.0"},{"v":0,"d":"0.0"},{"v":0,"d":"0.0"},{"v":0,"d":"0.0"},{"v":0,"d":"0.0"},{"v":0,"d":"0.0"},{"v":0,"d":"0.0"},{"v":0,"d":"0.0"},{"v":0,"d":"0.0"},{"v":0,"d":"0.0"},{"v":0,"d":"0.0"},{"v":0,"d":"0.0"},{"v":0,"d":"0.0"},{"v":0,"d":"0.0"},{"v":0,"d":"0.0"},{"v":0,"d":"0.0"},{"v":0,"d":"0.0"},{"v":0,"d":"0.0"},{"v":0,"d":"0.0"},{"v":0,"d":"0.0"},{"v":0,"d":"0.0"},{"v":0,"d":"0.0"},{"v":0,"d":"0.0"},{"v":0,"d":"0.0"},{"v":0,"d":"0.0"},{"v":0,"d":"0.0"},{"v":0,"d":"0.0"}]
[null,"PUDL b contra",{"$f":"-IF(C47>(PosPUDL2+LePUDL2),PUDL2d*(C47-PosPUDL2-LePUDL2)^4/24,0)","v":{"v":0,"d":"0.0"}},{"v":0,"d":"0.0"},{"v":0,"d":"0.0"},{"v":0,"d":"0.0"},{"v":0,"d":"0.0"},{"v":0,"d":"0.0"},{"v":0,"d":"0.0"},{"v":0,"d":"0.0"},{"v":0,"d":"0.0"},{"v":0,"d":"0.0"},{"v":0,"d":"0.0"},{"v":0,"d":"0.0"},{"v":0,"d":"0.0"},{"v":0,"d":"0.0"},{"v":0,"d":"0.0"},{"v":0,"d":"0.0"},{"v":0,"d":"0.0"},{"v":0,"d":"0.0"},{"v":0,"d":"0.0"},{"v":0,"d":"0.0"},{"v":0,"d":"0.0"},{"v":0,"d":"0.0"},{"v":0,"d":"0.0"},{"v":0,"d":"0.0"},{"v":0,"d":"0.0"},{"v":0,"d":"0.0"},{"v":0,"d":"0.0"},{"v":0,"d":"0.0"},{"v":0,"d":"0.0"},{"v":0,"d":"0.0"},{"v":0,"d":"0.0"},{"v":0,"d":"0.0"},{"$f":"-IF(AI47>(PosPUDL2+LePUDL2),PUDL2d*(AI47-PosPUDL2-LePUDL2)^4/24,0)","v":{"v":0,"d":"0.0"}},{"v":0,"d":"0.0"},{"v":0,"d":"0.0"},{"v":0,"d":"0.0"},{"v":0,"d":"0.0"},{"v":0,"d":"0.0"},{"v":0,"d":"0.0"},{"v":0,"d":"0.0"},{"v":0,"d":"0.0"},{"v":0,"d":"0.0"},{"v":0,"d":"0.0"},{"v":0,"d":"0.0"},{"v":0,"d":"0.0"},{"v":0,"d":"0.0"},{"v":0,"d":"0.0"},{"v":0,"d":"0.0"},{"v":0,"d":"0.0"},{"v":0,"d":"0.0"},{"v":0,"d":"0.0"},{"v":0,"d":"0.0"},{"v":0,"d":"0.0"},{"v":0,"d":"0.0"},{"v":0,"d":"0.0"},{"v":0,"d":"0.0"},{"v":0,"d":"0.0"},{"v":0,"d":"0.0"},{"v":0,"d":"0.0"},{"v":0,"d":"0.0"},{"v":0,"d":"0.0"},{"v":0,"d":"0.0"},{"v":0,"d":"0.0"},{"v":0,"d":"0.0"},{"$f":"-IF(BO47>(PosPUDL2+LePUDL2),PUDL2d*(BO47-PosPUDL2-LePUDL2)^4/24,0)","v":{"v":0,"d":"0.0"}},{"v":0,"d":"0.0"},{"v":0,"d":"0.0"},{"v":0,"d":"0.0"},{"v":0,"d":"0.0"},{"v":0,"d":"0.0"},{"v":0,"d":"0.0"},{"v":0,"d":"0.0"},{"v":0,"d":"0.0"},{"v":0,"d":"0.0"},{"v":0,"d":"0.0"},{"v":0,"d":"0.0"},{"v":0,"d":"0.0"},{"v":0,"d":"0.0"},{"v":0,"d":"0.0"},{"v":0,"d":"0.0"},{"v":0,"d":"0.0"},{"v":0,"d":"0.0"},{"v":0,"d":"0.0"},{"v":0,"d":"0.0"},{"v":0,"d":"0.0"},{"v":0,"d":"0.0"},{"v":0,"d":"0.0"},{"v":0,"d":"0.0"},{"v":0,"d":"0.0"},{"v":0,"d":"0.0"},{"v":0,"d":"0.0"},{"v":0,"d":"0.0"},{"v":0,"d":"0.0"},{"v":0,"d":"0.0"},{"v":0,"d":"0.0"},{"v":0,"d":"0.0"},{"v":0,"d":"0.0"},{"v":0,"d":"0.0"},{"v":0,"d":"0.0"},{"v":0,"d":"0.0"},{"v":0,"d":"0.0"}]
[null,"PLa",{"$f":"IF(C47>PosPLa1,PLa1d*(C47-PosPLa1)^3/6,0)","v":{"v":0,"d":"0.0"}},{"v":0,"d":"0.0"},{"v":0,"d":"0.0"},{"v":0,"d":"0.0"},{"v":0,"d":"0.0"},{"v":0,"d":"0.0"},{"v":0,"d":"0.0"},{"v":0,"d":"0.0"},{"v":0,"d":"0.0"},{"v":0,"d":"0.0"},{"v":0,"d":"0.0"},{"v":0,"d":"0.0"},{"v":0,"d":"0.0"},{"v":0,"d":"0.0"},{"v":0,"d":"0.0"},{"v":0,"d":"0.0"},{"v":0,"d":"0.0"},{"v":0,"d":"0.0"},{"v":0,"d":"0.0"},{"v":0,"d":"0.0"},{"v":0,"d":"0.0"},{"v":0,"d":"0.0"},{"v":0,"d":"0.0"},{"v":0,"d":"0.0"},{"v":0,"d":"0.0"},{"v":0,"d":"0.0"},{"v":0,"d":"0.0"},{"v":0,"d":"0.0"},{"v":0,"d":"0.0"},{"v":0,"d":"0.0"},{"v":0,"d":"0.0"},{"v":0,"d":"0.0"},{"$f":"IF(AI47>PosPLa1,PLa1d*(AI47-PosPLa1)^3/6,0)","v":{"v":0,"d":"0.0"}},{"v":0,"d":"0.0"},{"v":0,"d":"0.0"},{"v":0,"d":"0.0"},{"v":0,"d":"0.0"},{"v":0,"d":"0.0"},{"v":2.133333333333552E-5,"d":"0.0"},{"v":5.7600000000002072E-4,"d":"0.0"},{"v":0.002666666666666727,"d":"0.0"},{"v":0.007317333333333457,"d":"0.0"},{"v":0.015552000000000213,"d":"0.0"},{"v":0.028394666666667002,"d":"0.0"},{"v":0.04686933333333382,"d":"0.0"},{"v":0.07200000000000067,"d":"0.1"},{"v":0.10481066666666757,"d":"0.1"},{"v":0.14632533333333447,"d":"0.1"},{"v":0.19756800000000144,"d":"0.2"},{"v":0.2595626666666685,"d":"0.3"},{"v":0.3333333333333351,"d":"0.3"},{"v":0.4199040000000022,"d":"0.4"},{"v":0.5202986666666692,"d":"0.5"},{"v":0.6355413333333364,"d":"0.6"},{"v":0.7666560000000037,"d":"0.8"},{"v":0.9146666666666708,"d":"0.9"},{"v":1.080597333333338,"d":"1.1"},{"v":1.2654720000000057,"d":"1.3"},{"v":1.4703146666666729,"d":"1.5"},{"v":1.6961493333333404,"d":"1.7"},{"v":1.9440000000000082,"d":"1.9"},{"v":2.2148906666666757,"d":"2.2"},{"v":2.5098453333333435,"d":"2.5"},{"v":2.829888000000011,"d":"2.8"},{"$f":"IF(BO47>PosPLa1,PLa1d*(BO47-PosPLa1)^3/6,0)","v":{"v":3.1760426666666794,"d":"3.2"}},{"v":3.549333333333347,"d":"3.5"},{"v":3.950784000000015,"d":"4.0"},{"v":4.381418666666683,"d":"4.4"},{"v":4.842261333333352,"d":"4.8"},{"v":5.334336000000019,"d":"5.3"},{"v":5.8586666666666884,"d":"5.9"},{"v":6.416277333333357,"d":"6.4"},{"v":7.008192000000025,"d":"7.0"},{"v":7.635434666666694,"d":"7.6"},{"v":8.299029333333364,"d":"8.3"},{"v":9.000000000000032,"d":"9.0"},{"v":9.739370666666701,"d":"9.7"},{"v":10.51816533333337,"d":"10.5"},{"v":11.33740800000004,"d":"11.3"},{"v":12.19812266666671,"d":"12.2"},{"v":13.101333333333379,"d":"13.1"},{"v":14.048064000000046,"d":"14.0"},{"v":15.039338666666717,"d":"15.0"},{"v":16.076181333333388,"d":"16.1"},{"v":17.15961600000006,"d":"17.2"},{"v":18.290666666666727,"d":"18.3"},{"v":19.4703573333334,"d":"19.5"},{"v":20.69971200000007,"d":"20.7"},{"v":21.97975466666674,"d":"22.0"},{"v":23.311509333333415,"d":"23.3"},{"v":24.696000000000083,"d":"24.7"},{"v":26.13425066666675,"d":"26.1"},{"v":27.627285333333422,"d":"27.6"},{"v":29.176128000000094,"d":"29.2"},{"v":30.781802666666767,"d":"30.8"},{"v":32.445333333333444,"d":"32.4"},{"v":34.167744000000106,"d":"34.2"},{"v":35.950058666666784,"d":"36.0"},{"v":37.79330133333345,"d":"37.8"},{"v":39.69849600000013,"d":"39.7"},{"v":41.6666666666668,"d":"41.7"}]
[null,"PLb",{"$f":"IF(C47>PosPLb1,PLb1d*(C47-PosPLb1)^3/6,0)","v":{"v":0,"d":"0.0"}},{"v":0,"d":"0.0"},{"v":0,"d":"0.0"},{"v":0,"d":"0.0"},{"v":0,"d":"0.0"},{"v":0,"d":"0.0"},{"v":0,"d":"0.0"},{"v":0,"d":"0.0"},{"v":0,"d":"0.0"},{"v":0,"d":"0.0"},{"v":0,"d":"0.0"},{"v":0,"d":"0.0"},{"v":0,"d":"0.0"},{"v":0,"d":"0.0"},{"v":0,"d":"0.0"},{"v":0,"d":"0.0"},{"v":0,"d":"0.0"},{"v":0,"d":"0.0"},{"v":0,"d":"0.0"},{"v":0,"d":"0.0"},{"v":0,"d":"0.0"},{"v":0,"d":"0.0"},{"v":0,"d":"0.0"},{"v":0,"d":"0.0"},{"v":0,"d":"0.0"},{"v":0,"d":"0.0"},{"v":0,"d":"0.0"},{"v":0,"d":"0.0"},{"v":0,"d":"0.0"},{"v":0,"d":"0.0"},{"v":0,"d":"0.0"},{"v":0,"d":"0.0"},{"$f":"IF(AI47>PosPLb1,PLb1d*(AI47-PosPLb1)^3/6,0)","v":{"v":0,"d":"0.0"}},{"v":0,"d":"0.0"},{"v":0,"d":"0.0"},{"v":0,"d":"0.0"},{"v":0,"d":"0.0"},{"v":0,"d":"0.0"},{"v":0,"d":"0.0"},{"v":0,"d":"0.0"},{"v":0,"d":"0.0"},{"v":0,"d":"0.0"},{"v":0,"d":"0.0"},{"v":0,"d":"0.0"},{"v":0,"d":"0.0"},{"v":0,"d":"0.0"},{"v":0,"d":"0.0"},{"v":0,"d":"0.0"},{"v":0,"d":"0.0"},{"v":0,"d":"0.0"},{"v":0,"d":"0.0"},{"v":0,"d":"0.0"},{"v":0,"d":"0.0"},{"v":0,"d":"0.0"},{"v":0,"d":"0.0"},{"v":0,"d":"0.0"},{"v":0,"d":"0.0"},{"v":0,"d":"0.0"},{"v":0,"d":"0.0"},{"v":0,"d":"0.0"},{"v":0,"d":"0.0"},{"v":0,"d":"0.0"},{"v":0,"d":"0.0"},{"v":0,"d":"0.0"},{"$f":"IF(BO47>PosPLb1,PLb1d*(BO47-PosPLb1)^3/6,0)","v":{"v":0,"d":"0.0"}},{"v":0,"d":"0.0"},{"v":0,"d":"0.0"},{"v":0,"d":"0.0"},{"v":0,"d":"0.0"},{"v":0,"d":"0.0"},{"v":0,"d":"0.0"},{"v":0,"d":"0.0"},{"v":0,"d":"0.0"},{"v":0,"d":"0.0"},{"v":0,"d":"0.0"},{"v":0,"d":"0.0"},{"v":0,"d":"0.0"},{"v":0,"d":"0.0"},{"v":0,"d":"0.0"},{"v":0,"d":"0.0"},{"v":0,"d":"0.0"},{"v":0,"d":"0.0"},{"v":0,"d":"0.0"},{"v":0,"d":"0.0"},{"v":0,"d":"0.0"},{"v":0,"d":"0.0"},{"v":0,"d":"0.0"},{"v":0,"d":"0.0"},{"v":0,"d":"0.0"},{"v":0,"d":"0.0"},{"v":0,"d":"0.0"},{"v":0,"d":"0.0"},{"v":0,"d":"0.0"},{"v":0,"d":"0.0"},{"v":0,"d":"0.0"},{"v":0,"d":"0.0"},{"v":0,"d":"0.0"},{"v":0,"d":"0.0"},{"v":0,"d":"0.0"},{"v":0,"d":"0.0"},{"v":0,"d":"0.0"}]
[null,"Ax+B",{"$f":"$D$58*C47+$D$59","v":{"v":0,"d":"0.0"}},{"$f":"$D$58*D47+$D$59","v":{"v":8.372900000000012,"d":"8.4"}},{"v":16.745800000000024,"d":"16.7"},{"v":25.118700000000032,"d":"25.1"},{"v":33.49160000000005,"d":"33.5"},{"v":41.864500000000056,"d":"41.9"},{"v":50.23740000000007,"d":"50.2"},{"v":58.61030000000008,"d":"58.6"},{"v":66.9832000000001,"d":"67.0"},{"v":75.3561000000001,"d":"75.4"},{"v":83.7290000000001,"d":"83.7"},{"v":92.10190000000011,"d":"92.1"},{"v":100.47480000000012,"d":"100.5"},{"v":108.84770000000012,"d":"108.8"},{"v":117.22060000000015,"d":"117.2"},{"v":125.59350000000016,"d":"125.6"},{"v":133.9664000000002,"d":"134.0"},{"v":142.3393000000002,"d":"142.3"},{"v":150.71220000000022,"d":"150.7"},{"v":159.08510000000024,"d":"159.1"},{"v":167.45800000000025,"d":"167.5"},{"v":175.83090000000027,"d":"175.8"},{"v":184.20380000000029,"d":"184.2"},{"v":192.5767000000003,"d":"192.6"},{"v":200.94960000000032,"d":"200.9"},{"v":209.32250000000033,"d":"209.3"},{"v":217.69540000000035,"d":"217.7"},{"v":226.06830000000036,"d":"226.1"},{"v":234.44120000000038,"d":"234.4"},{"v":242.8141000000004,"d":"242.8"},{"v":251.1870000000004,"d":"251.2"},{"v":259.5599000000004,"d":"259.6"},{"v":267.93280000000044,"d":"267.9"},{"v":276.30570000000046,"d":"276.3"},{"v":284.6786000000005,"d":"284.7"},{"v":293.0515000000005,"d":"293.1"},{"v":301.4244000000005,"d":"301.4"},{"v":309.7973000000005,"d":"309.8"},{"v":318.17020000000053,"d":"318.2"},{"v":326.5431000000006,"d":"326.5"},{"v":334.9160000000006,"d":"334.9"},{"v":343.28890000000064,"d":"343.3"},{"v":351.66180000000065,"d":"351.7"},{"v":360.03470000000067,"d":"360.0"},{"v":368.4076000000007,"d":"368.4"},{"v":376.7805000000007,"d":"376.8"},{"v":385.1534000000007,"d":"385.2"},{"v":393.52630000000073,"d":"393.5"},{"v":401.89920000000075,"d":"401.9"},{"v":410.27210000000076,"d":"410.3"},{"v":418.6450000000007,"d":"418.6"},{"v":427.01790000000074,"d":"427.0"},{"v":435.39080000000075,"d":"435.4"},{"v":443.76370000000077,"d":"443.8"},{"v":452.1366000000008,"d":"452.1"},{"v":460.50950000000086,"d":"460.5"},{"v":468.88240000000087,"d":"468.9"},{"v":477.2553000000009,"d":"477.3"},{"v":485.6282000000009,"d":"485.6"},{"v":494.0011000000009,"d":"494.0"},{"v":502.37400000000093,"d":"502.4"},{"v":510.74690000000095,"d":"510.7"},{"v":519.119800000001,"d":"519.1"},{"v":527.4927000000009,"d":"527.5"},{"v":535.865600000001,"d":"535.9"},{"$f":"$D$58*BP47+$D$59","v":{"v":544.2385000000011,"d":"544.2"}},{"v":552.611400000001,"d":"552.6"},{"v":560.9843000000011,"d":"561.0"},{"v":569.3572000000011,"d":"569.4"},{"v":577.7301000000011,"d":"577.7"},{"v":586.1030000000011,"d":"586.1"},{"v":594.4759000000012,"d":"594.5"},{"v":602.8488000000011,"d":"602.8"},{"v":611.2217000000012,"d":"611.2"},{"v":619.5946000000012,"d":"619.6"},{"v":627.9675000000012,"d":"628.0"},{"v":636.3404000000012,"d":"636.3"},{"v":644.7133000000013,"d":"644.7"},{"v":653.0862000000012,"d":"653.1"},{"v":661.4591000000013,"d":"661.5"},{"v":669.8320000000012,"d":"669.8"},{"v":678.2049000000013,"d":"678.2"},{"v":686.5778000000013,"d":"686.6"},{"v":694.9507000000013,"d":"695.0"},{"v":703.3236000000013,"d":"703.3"},{"v":711.6965000000014,"d":"711.7"},{"v":720.0694000000015,"d":"720.1"},{"v":728.4423000000014,"d":"728.4"},{"v":736.8152000000015,"d":"736.8"},{"v":745.1881000000014,"d":"745.2"},{"v":753.5610000000015,"d":"753.6"},{"v":761.9339000000015,"d":"761.9"},{"v":770.3068000000015,"d":"770.3"},{"v":778.6797000000015,"d":"778.7"},{"v":787.0526000000016,"d":"787.1"},{"v":795.4255000000015,"d":"795.4"},{"v":803.7984000000016,"d":"803.8"},{"v":812.1713000000016,"d":"812.2"},{"v":820.5442000000016,"d":"820.5"},{"v":828.9171000000016,"d":"828.9"},{"v":837.2900000000017,"d":"837.3"},null,{"$f":"SUM(CY48:CY55)","v":{"v":-837.2900000000011,"d":"-837.3"}}]
[]
[null,null,"Constant A",{"$f":"-DA56/8","v":{"v":104.66125000000014,"d":"104.7"}}]
[null,null,"Constant B",{"v":0,"d":"0.0"}]
[]
[null,null,"LIVE (2nd integral)"]
[null,"Step",{"v":0,"d":"0.0"},{"$f":"8/100","v":{"v":0.08,"d":"0.1"}},{"$f":"D62+8/100","v":{"v":0.16,"d":"0.2"}},{"$f":"E62+8/100","v":{"v":0.24,"d":"0.2"}},{"$f":"F62+8/100","v":{"v":0.32,"d":"0.3"}},{"$f":"G62+8/100","v":0.4},{"$f":"H62+8/100","v":{"v":0.48000000000000004,"d":"0.5"}},{"$f":"I62+8/100","v":{"v":0.56,"d":"0.6"}},{"$f":"J62+8/100","v":{"v":0.64,"d":"0.6"}},{"$f":"K62+8/100","v":{"v":0.72,"d":"0.7"}},{"$f":"L62+8/100","v":{"v":0.7999999999999999,"d":"0.8"}},{"$f":"M62+8/100","v":{"v":0.8799999999999999,"d":"0.9"}},{"$f":"N62+8/100","v":{"v":0.9599999999999999,"d":"1.0"}},{"$f":"O62+8/100","v":{"v":1.0399999999999998,"d":"1.0"}},{"$f":"P62+8/100","v":{"v":1.1199999999999999,"d":"1.1"}},{"$f":"Q62+8/100","v":1.2},{"$f":"R62+8/100","v":{"v":1.28,"d":"1.3"}},{"$f":"S62+8/100","v":{"v":1.36,"d":"1.4"}},{"$f":"T62+8/100","v":{"v":1.4400000000000002,"d":"1.4"}},{"$f":"U62+8/100","v":{"v":1.5200000000000002,"d":"1.5"}},{"$f":"V62+8/100","v":{"v":1.6000000000000003,"d":"1.6"}},{"$f":"W62+8/100","v":{"v":1.6800000000000004,"d":"1.7"}},{"$f":"X62+8/100","v":{"v":1.7600000000000005,"d":"1.8"}},{"$f":"Y62+8/100","v":{"v":1.8400000000000005,"d":"1.8"}},{"$f":"Z62+8/100","v":{"v":1.9200000000000006,"d":"1.9"}},{"$f":"AA62+8/100","v":{"v":2.0000000000000004,"d":"2.0"}},{"$f":"AB62+8/100","v":{"v":2.0800000000000005,"d":"2.1"}},{"$f":"AC62+8/100","v":{"v":2.1600000000000006,"d":"2.2"}},{"$f":"AD62+8/100","v":{"v":2.2400000000000007,"d":"2.2"}},{"$f":"AE62+8/100","v":{"v":2.3200000000000007,"d":"2.3"}},{"$f":"AF62+8/100","v":{"v":2.400000000000001,"d":"2.4"}},{"$f":"AG62+8/100","v":{"v":2.480000000000001,"d":"2.5"}},{"$f":"AH62+8/100","v":{"v":2.560000000000001,"d":"2.6"}},{"$f":"AI62+8/100","v":{"v":2.640000000000001,"d":"2.6"}},{"$f":"AJ62+8/100","v":{"v":2.720000000000001,"d":"2.7"}},{"$f":"AK62+8/100","v":{"v":2.800000000000001,"d":"2.8"}},{"$f":"AL62+8/100","v":{"v":2.8800000000000012,"d":"2.9"}},{"$f":"AM62+8/100","v":{"v":2.9600000000000013,"d":"3.0"}},{"$f":"AN62+8/100","v":{"v":3.0400000000000014,"d":"3.0"}},{"$f":"AO62+8/100","v":{"v":3.1200000000000014,"d":"3.1"}},{"$f":"AP62+8/100","v":{"v":3.2000000000000015,"d":"3.2"}},{"$f":"AQ62+8/100","v":{"v":3.2800000000000016,"d":"3.3"}},{"$f":"AR62+8/100","v":{"v":3.3600000000000017,"d":"3.4"}},{"$f":"AS62+8/100","v":{"v":3.4400000000000017,"d":"3.4"}},{"$f":"AT62+8/100","v":{"v":3.520000000000002,"d":"3.5"}},{"$f":"AU62+8/100","v":{"v":3.600000000000002,"d":"3.6"}},{"$f":"AV62+8/100","v":{"v":3.680000000000002,"d":"3.7"}},{"$f":"AW62+8/100","v":{"v":3.760000000000002,"d":"3.8"}},{"$f":"AX62+8/100","v":{"v":3.840000000000002,"d":"3.8"}},{"$f":"AY62+8/100","v":{"v":3.920000000000002,"d":"3.9"}},{"$f":"AZ62+8/100","v":{"v":4.000000000000002,"d":"4.0"}},{"$f":"BA62+8/100","v":{"v":4.080000000000002,"d":"4.1"}},{"$f":"BB62+8/100","v":{"v":4.160000000000002,"d":"4.2"}},{"$f":"BC62+8/100","v":{"v":4.240000000000002,"d":"4.2"}},{"$f":"BD62+8/100","v":{"v":4.320000000000002,"d":"4.3"}},{"$f":"BE62+8/100","v":{"v":4.400000000000002,"d":"4.4"}},{"$f":"BF62+8/100","v":{"v":4.480000000000002,"d":"4.5"}},{"$f":"BG62+8/100","v":{"v":4.560000000000002,"d":"4.6"}},{"$f":"BH62+8/100","v":{"v":4.640000000000002,"d":"4.6"}},{"$f":"BI62+8/100","v":{"v":4.720000000000002,"d":"4.7"}},{"$f":"BJ62+8/100","v":{"v":4.8000000000000025,"d":"4.8"}},{"$f":"BK62+8/100","v":{"v":4.880000000000003,"d":"4.9"}},{"$f":"BL62+8/100","v":{"v":4.960000000000003,"d":"5.0"}},{"$f":"BM62+8/100","v":{"v":5.040000000000003,"d":"5.0"}},{"$f":"BN62+8/100","v":{"v":5.120000000000003,"d":"5.1"}},{"$f":"BO62+8/100","v":{"v":5.200000000000003,"d":"5.2"}},{"$f":"BP62+8/100","v":{"v":5.280000000000003,"d":"5.3"}},{"$f":"BQ62+8/100","v":{"v":5.360000000000003,"d":"5.4"}},{"$f":"BR62+8/100","v":{"v":5.440000000000003,"d":"5.4"}},{"$f":"BS62+8/100","v":{"v":5.520000000000003,"d":"5.5"}},{"$f":"BT62+8/100","v":{"v":5.600000000000003,"d":"5.6"}},{"$f":"BU62+8/100","v":{"v":5.680000000000003,"d":"5.7"}},{"$f":"BV62+8/100","v":{"v":5.760000000000003,"d":"5.8"}},{"$f":"BW62+8/100","v":{"v":5.840000000000003,"d":"5.8"}},{"$f":"BX62+8/100","v":{"v":5.9200000000000035,"d":"5.9"}},{"$f":"BY62+8/100","v":{"v":6.0000000000000036,"d":"6.0"}},{"$f":"BZ62+8/100","v":{"v":6.080000000000004,"d":"6.1"}},{"$f":"CA62+8/100","v":{"v":6.160000000000004,"d":"6.2"}},{"$f":"CB62+8/100","v":{"v":6.240000000000004,"d":"6.2"}},{"$f":"CC62+8/100","v":{"v":6.320000000000004,"d":"6.3"}},{"$f":"CD62+8/100","v":{"v":6.400000000000004,"d":"6.4"}},{"$f":"CE62+8/100","v":{"v":6.480000000000004,"d":"6.5"}},{"$f":"CF62+8/100","v":{"v":6.560000000000004,"d":"6.6"}},{"$f":"CG62+8/100","v":{"v":6.640000000000004,"d":"6.6"}},{"$f":"CH62+8/100","v":{"v":6.720000000000004,"d":"6.7"}},{"$f":"CI62+8/100","v":{"v":6.800000000000004,"d":"6.8"}},{"$f":"CJ62+8/100","v":{"v":6.880000000000004,"d":"6.9"}},{"$f":"CK62+8/100","v":{"v":6.960000000000004,"d":"7.0"}},{"$f":"CL62+8/100","v":{"v":7.0400000000000045,"d":"7.0"}},{"$f":"CM62+8/100","v":{"v":7.1200000000000045,"d":"7.1"}},{"$f":"CN62+8/100","v":{"v":7.200000000000005,"d":"7.2"}},{"$f":"CO62+8/100","v":{"v":7.280000000000005,"d":"7.3"}},{"$f":"CP62+8/100","v":{"v":7.360000000000005,"d":"7.4"}},{"$f":"CQ62+8/100","v":{"v":7.440000000000005,"d":"7.4"}},{"$f":"CR62+8/100","v":{"v":7.520000000000005,"d":"7.5"}},{"$f":"CS62+8/100","v":{"v":7.600000000000005,"d":"7.6"}},{"$f":"CT62+8/100","v":{"v":7.680000000000005,"d":"7.7"}},{"$f":"CU62+8/100","v":{"v":7.760000000000005,"d":"7.8"}},{"$f":"CV62+8/100","v":{"v":7.840000000000005,"d":"7.8"}},{"$f":"CW62+8/100","v":{"v":7.920000000000005,"d":"7.9"}},{"$f":"CX62+8/100","v":{"v":8.000000000000005,"d":"8.0"}}]
[null,"Reaction",{"$f":"-RL1l*C62^3/6","v":{"v":0,"d":"0.0"}},{"v":-9.6533333333333356E-4,"d":"-0.0"},{"v":-7.7226666666666685E-3,"d":"-0.0"},{"v":-0.026064,"d":"-0.0"},{"v":-0.06178133333333335,"d":"-0.1"},{"v":-0.1206666666666667,"d":"-0.1"},{"v":-0.20851200000000006,"d":"-0.2"},{"v":-0.3311093333333334,"d":"-0.3"},{"v":-0.4942506666666668,"d":"-0.5"},{"v":-0.7037279999999999,"d":"-0.7"},{"v":-0.9653333333333332,"d":"-1.0"},{"v":-1.2848586666666661,"d":"-1.3"},{"v":-1.6680959999999994,"d":"-1.7"},{"v":-2.1208373333333324,"d":"-2.1"},{"v":-2.6488746666666656,"d":"-2.6"},{"v":-3.2579999999999996,"d":"-3.3"},{"v":-3.9540053333333343,"d":"-4.0"},{"v":-4.742682666666668,"d":"-4.7"},{"v":-5.629824000000002,"d":"-5.6"},{"v":-6.621221333333337,"d":"-6.6"},{"v":-7.72266666666667,"d":"-7.7"},{"v":-8.939952000000007,"d":"-8.9"},{"v":-10.278869333333342,"d":"-10.3"},{"v":-11.745210666666678,"d":"-11.7"},{"v":-13.34476800000001,"d":"-13.3"},{"v":-15.083333333333343,"d":"-15.1"},{"v":-16.966698666666677,"d":"-17.0"},{"v":-19.000656000000014,"d":"-19.0"},{"v":-21.19099733333335,"d":"-21.2"},{"v":-23.543514666666685,"d":"-23.5"},{"v":-26.064000000000025,"d":"-26.1"},{"v":-28.758245333333363,"d":"-28.8"},{"$f":"-RL1l*AI62^3/6","v":{"v":-31.632042666666695,"d":"-31.6"}},{"v":-34.691184000000035,"d":"-34.7"},{"v":-37.94146133333338,"d":"-37.9"},{"v":-41.388666666666715,"d":"-41.4"},{"v":-45.03859200000006,"d":"-45.0"},{"v":-48.8970293333334,"d":"-48.9"},{"v":-52.96977066666674,"d":"-53.0"},{"v":-57.262608000000085,"d":"-57.3"},{"v":-61.781333333333414,"d":"-61.8"},{"v":-66.53173866666677,"d":"-66.5"},{"v":-71.51961600000011,"d":"-71.5"},{"v":-76.75075733333345,"d":"-76.8"},{"v":-82.23095466666679,"d":"-82.2"},{"v":-87.96600000000014,"d":"-88.0"},{"v":-93.96168533333349,"d":"-94.0"},{"v":-100.22380266666683,"d":"-100.2"},{"v":-106.75814400000017,"d":"-106.8"},{"v":-113.57050133333352,"d":"-113.6"},{"v":-120.66666666666681,"d":"-120.7"},{"v":-128.05243200000018,"d":"-128.1"},{"v":-135.73358933333353,"d":"-135.7"},{"v":-143.71593066666688,"d":"-143.7"},{"v":-152.00524800000025,"d":"-152.0"},{"v":-160.60733333333354,"d":"-160.6"},{"v":-169.52797866666694,"d":"-169.5"},{"v":-178.77297600000028,"d":"-178.8"},{"v":-188.34811733333365,"d":"-188.3"},{"v":-198.25919466666699,"d":"-198.3"},{"v":-208.5120000000003,"d":"-208.5"},{"v":-219.11232533333364,"d":"-219.1"},{"v":-230.06596266666702,"d":"-230.1"},{"v":-241.3787040000004,"d":"-241.4"},{"$f":"-RL1l*BO62^3/6","v":{"v":-253.05634133333376,"d":"-253.1"}},{"v":-265.10466666666713,"d":"-265.1"},{"v":-277.52947200000045,"d":"-277.5"},{"v":-290.33654933333383,"d":"-290.3"},{"v":-303.5316906666672,"d":"-303.5"},{"v":-317.12068800000054,"d":"-317.1"},{"v":-331.1093333333339,"d":"-331.1"},{"v":-345.5034186666672,"d":"-345.5"},{"v":-360.30873600000064,"d":"-360.3"},{"v":-375.531077333334,"d":"-375.5"},{"v":-391.17623466666737,"d":"-391.2"},{"v":-407.25000000000074,"d":"-407.3"},{"v":-423.7581653333341,"d":"-423.8"},{"v":-440.7065226666675,"d":"-440.7"},{"v":-458.10086400000085,"d":"-458.1"},{"v":-475.9469813333342,"d":"-475.9"},{"v":-494.25066666666754,"d":"-494.3"},{"v":-513.0177120000009,"d":"-513.0"},{"v":-532.2539093333343,"d":"-532.3"},{"v":-551.9650506666677,"d":"-552.0"},{"v":-572.1569280000011,"d":"-572.2"},{"v":-592.8353333333345,"d":"-592.8"},{"v":-614.0060586666679,"d":"-614.0"},{"v":-635.6748960000011,"d":"-635.7"},{"v":-657.8476373333345,"d":"-657.8"},{"v":-680.530074666668,"d":"-680.5"},{"v":-703.7280000000014,"d":"-703.7"},{"v":-727.4472053333348,"d":"-727.4"},{"v":-751.693482666668,"d":"-751.7"},{"v":-776.4726240000015,"d":"-776.5"},{"v":-801.790421333335,"d":"-801.8"},{"v":-827.6526666666682,"d":"-827.7"},{"$f":"-RL1l*CU62^3/6","v":{"v":-854.0651520000016,"d":"-854.1"}},{"$f":"-RL1l*CV62^3/6","v":{"v":-881.0336693333352,"d":"-881.0"}},{"$f":"-RL1l*CW62^3/6","v":{"v":-908.5640106666684,"d":"-908.6"}},{"$f":"-RL1l*CX62^3/6","v":{"v":-936.6619680000018,"d":"-936.7"}},{"$f":"-RL1l*CY62^3/6","v":{"v":-965.3333333333353,"d":"-965.3"}}]
[null,"UDL",{"$f":"2*C62^4/24","v":{"v":0,"d":"0.0"}},{"$f":"2*D62^4/24","v":{"v":3.4133333333333334E-6,"d":"0.0"}},{"$f":"2*E62^4/24","v":{"v":5.4613333333333334E-5,"d":"0.0"}},{"$f":"2*F62^4/24","v":{"v":0.00027648,"d":"0.0"}},{"$f":"2*G62^4/24","v":{"v":8.7381333333333335E-4,"d":"0.0"}},{"$f":"2*H62^4/24","v":{"v":2.1333333333333343E-3,"d":"0.0"}},{"$f":"2*I62^4/24","v":{"v":0.004423680000000002,"d":"0.0"}},{"$f":"2*J62^4/24","v":{"v":0.008195413333333335,"d":"0.0"}},{"$f":"2*K62^4/24","v":{"v":0.013981013333333334,"d":"0.0"}},{"$f":"2*L62^4/24","v":{"v":0.022394879999999995,"d":"0.0"}},{"$f":"2*M62^4/24","v":{"v":0.03413333333333332,"d":"0.0"}},{"$f":"2*N62^4/24","v":{"v":0.04997461333333331,"d":"0.0"}},{"$f":"2*O62^4/24","v":{"v":0.07077887999999996,"d":"0.1"}},{"$f":"2*P62^4/24","v":{"v":0.09748821333333328,"d":"0.1"}},{"$f":"2*Q62^4/24","v":{"v":0.13112661333333328,"d":"0.1"}},{"$f":"2*R62^4/24","v":{"v":0.17279999999999998,"d":"0.2"}},{"$f":"2*S62^4/24","v":{"v":0.22369621333333334,"d":"0.2"}},{"$f":"2*T62^4/24","v":{"v":0.2850850133333334,"d":"0.3"}},{"$f":"2*U62^4/24","v":{"v":0.3583180800000001,"d":"0.4"}},{"$f":"2*V62^4/24","v":{"v":0.4448290133333337,"d":"0.4"}},{"$f":"2*W62^4/24","v":{"v":0.5461333333333337,"d":"0.5"}},{"$f":"2*X62^4/24","v":{"v":0.6638284800000006,"d":"0.7"}},{"$f":"2*Y62^4/24","v":{"v":0.7995938133333342,"d":"0.8"}},{"$f":"2*Z62^4/24","v":{"v":0.9551906133333344,"d":"1.0"}},{"$f":"2*AA62^4/24","v":{"v":1.1324620800000014,"d":"1.1"}},{"$f":"2*AB62^4/24","v":{"v":1.3333333333333346,"d":"1.3"}},{"$f":"2*AC62^4/24","v":{"v":1.5598114133333352,"d":"1.6"}},{"$f":"2*AD62^4/24","v":{"v":1.8139852800000016,"d":"1.8"}},{"$f":"2*AE62^4/24","v":{"v":2.098025813333335,"d":"2.1"}},{"$f":"2*AF62^4/24","v":{"v":2.414185813333336,"d":"2.4"}},{"$f":"2*AG62^4/24","v":{"v":2.764800000000004,"d":"2.8"}},{"$f":"2*AH62^4/24","v":{"v":3.1522850133333384,"d":"3.2"}},{"$f":"2*AI62^4/24","v":{"v":3.5791394133333387,"d":"3.6"}},{"$f":"2*AJ62^4/24","v":{"v":4.047943680000006,"d":"4.0"}},{"$f":"2*AK62^4/24","v":{"v":4.561360213333341,"d":"4.6"}},{"$f":"2*AL62^4/24","v":{"v":5.122133333333341,"d":"5.1"}},{"$f":"2*AM62^4/24","v":{"v":5.733089280000009,"d":"5.7"}},{"$f":"2*AN62^4/24","v":{"v":6.397136213333346,"d":"6.4"}},{"$f":"2*AO62^4/24","v":{"v":7.117264213333347,"d":"7.1"}},{"$f":"2*AP62^4/24","v":{"v":7.896545280000016,"d":"7.9"}},{"$f":"2*AQ62^4/24","v":{"v":8.73813333333335,"d":"8.7"}},{"$f":"2*AR62^4/24","v":{"v":9.645264213333352,"d":"9.6"}},{"$f":"2*AS62^4/24","v":{"v":10.62125568000002,"d":"10.6"}},{"$f":"2*AT62^4/24","v":{"v":11.669507413333356,"d":"11.7"}},{"$f":"2*AU62^4/24","v":{"v":12.793501013333357,"d":"12.8"}},{"$f":"2*AV62^4/24","v":{"v":13.996800000000029,"d":"14.0"}},{"$f":"2*AW62^4/24","v":{"v":15.283049813333365,"d":"15.3"}},{"$f":"2*AX62^4/24","v":{"v":16.65597781333337,"d":"16.7"}},{"$f":"2*AY62^4/24","v":{"v":18.119393280000036,"d":"18.1"}},{"$f":"2*AZ62^4/24","v":{"v":19.677187413333375,"d":"19.7"}},{"$f":"2*BA62^4/24","v":{"v":21.33333333333337,"d":"21.3"}},{"$f":"2*BB62^4/24","v":{"v":23.091886080000037,"d":"23.1"}},{"$f":"2*BC62^4/24","v":{"v":24.95698261333338,"d":"25.0"}},{"$f":"2*BD62^4/24","v":{"v":26.932841813333383,"d":"26.9"}},{"$f":"2*BE62^4/24","v":{"v":29.023764480000057,"d":"29.0"}},{"$f":"2*BF62^4/24","v":{"v":31.23413333333339,"d":"31.2"}},{"$f":"2*BG62^4/24","v":{"v":33.568413013333405,"d":"33.6"}},{"$f":"2*BH62^4/24","v":{"v":36.03115008000007,"d":"36.0"}},{"$f":"2*BI62^4/24","v":{"v":38.62697301333342,"d":"38.6"}},{"$f":"2*BJ62^4/24","v":{"v":41.36059221333342,"d":"41.4"}},{"$f":"2*BK62^4/24","v":{"v":44.236800000000095,"d":"44.2"}},{"$f":"2*BL62^4/24","v":{"v":47.26047061333343,"d":"47.3"}},{"$f":"2*BM62^4/24","v":{"v":50.43656021333344,"d":"50.4"}},{"$f":"2*BN62^4/24","v":{"v":53.77010688000011,"d":"53.8"}},{"$f":"2*BO62^4/24","v":{"v":57.26623061333347,"d":"57.3"}},{"$f":"2*BP62^4/24","v":{"v":60.93013333333348,"d":"60.9"}},{"$f":"2*BQ62^4/24","v":{"v":64.76709888000015,"d":"64.8"}},{"$f":"2*BR62^4/24","v":{"v":68.7824930133335,"d":"68.8"}},{"$f":"2*BS62^4/24","v":{"v":72.9817634133335,"d":"73.0"}},{"$f":"2*BT62^4/24","v":{"v":77.37043968000017,"d":"77.4"}},{"$f":"2*BU62^4/24","v":{"v":81.95413333333352,"d":"82.0"}},{"$f":"2*BV62^4/24","v":{"v":86.73853781333351,"d":"86.7"}},{"$f":"2*BW62^4/24","v":{"v":91.72942848000024,"d":"91.7"}},{"$f":"2*BX62^4/24","v":{"v":96.93266261333355,"d":"96.9"}},{"$f":"2*BY62^4/24","v":{"v":102.35417941333357,"d":"102.4"}},{"$f":"2*BZ62^4/24","v":{"v":108.00000000000027,"d":"108.0"}},{"$f":"2*CA62^4/24","v":{"v":113.8762274133336,"d":"113.9"}},{"$f":"2*CB62^4/24","v":{"v":119.98904661333364,"d":"120.0"}},{"$f":"2*CC62^4/24","v":{"v":126.3447244800003,"d":"126.3"}},{"$f":"2*CD62^4/24","v":{"v":132.94960981333367,"d":"132.9"}},{"$f":"2*CE62^4/24","v":{"v":139.81013333333368,"d":"139.8"}},{"$f":"2*CF62^4/24","v":{"v":146.93280768000037,"d":"146.9"}},{"$f":"2*CG62^4/24","v":{"v":154.3242274133337,"d":"154.3"}},{"$f":"2*CH62^4/24","v":{"v":161.9910690133337,"d":"162.0"}},{"$f":"2*CI62^4/24","v":{"v":169.94009088000044,"d":"169.9"}},{"$f":"2*CJ62^4/24","v":{"v":178.1781333333338,"d":"178.2"}},{"$f":"2*CK62^4/24","v":{"v":186.7121186133338,"d":"186.7"}},{"$f":"2*CL62^4/24","v":{"v":195.54905088000046,"d":"195.5"}},{"$f":"2*CM62^4/24","v":{"v":204.69601621333388,"d":"204.7"}},{"$f":"2*CN62^4/24","v":{"v":214.1601826133339,"d":"214.2"}},{"$f":"2*CO62^4/24","v":{"v":223.94880000000057,"d":"223.9"}},{"$f":"2*CP62^4/24","v":{"v":234.06920021333394,"d":"234.1"}},{"$f":"2*CQ62^4/24","v":{"v":244.52879701333393,"d":"244.5"}},{"$f":"2*CR62^4/24","v":{"v":255.33508608000065,"d":"255.3"}},{"$f":"2*CS62^4/24","v":{"v":266.495645013334,"d":"266.5"}},{"$f":"2*CT62^4/24","v":{"v":278.01813333333405,"d":"278.0"}},{"$f":"2*CU62^4/24","v":{"v":289.91029248000075,"d":"289.9"}},{"$f":"2*CV62^4/24","v":{"v":302.1799458133342,"d":"302.2"}},{"$f":"2*CW62^4/24","v":{"v":314.83499861333416,"d":"314.8"}},{"$f":"2*CX62^4/24","v":{"v":327.8834380800009,"d":"327.9"}},{"$f":"2*CY62^4/24","v":{"v":341.3333333333342,"d":"341.3"}}]
[null,"PUDL a",{"$f":"IF(PosPUDL1<C62,PUDL1l*(C62-PosPUDL1)^4/24,0)","v":{"v":0,"d":"0.0"}},{"v":0,"d":"0.0"},{"v":0,"d":"0.0"},{"v":0,"d":"0.0"},{"v":0,"d":"0.0"},{"v":0,"d":"0.0"},{"v":0,"d":"0.0"},{"v":0,"d":"0.0"},{"v":0,"d":"0.0"},{"v":0,"d":"0.0"},{"v":0,"d":"0.0"},{"v":0,"d":"0.0"},{"v":0,"d":"0.0"},{"v":1.0666666666666467E-7,"d":"0.0"},{"v":8.6399999999999664E-6,"d":"0.0"},{"v":6.66666666666666e-05,"d":"0.0"},{"v":2.5610666666666673E-4,"d":"0.0"},{"v":6.9984000000000073E-4,"d":"0.0"},{"v":1.5617066666666693E-3,"d":"0.0"},{"v":3.0465066666666724E-3,"d":"0.0"},{"v":5.4000000000000116E-3,"d":"0.0"},{"v":0.008908906666666687,"d":"0.0"},{"v":0.013900906666666699,"d":"0.0"},{"v":0.020744640000000054,"d":"0.0"},{"v":0.02984970666666674,"d":"0.0"},{"v":0.04166666666666674,"d":"0.0"},{"v":0.05668704000000011,"d":"0.1"},{"v":0.07544330666666683,"d":"0.1"},{"v":0.09850890666666688,"d":"0.1"},{"v":0.1264982400000003,"d":"0.1"},{"v":0.16006666666666702,"d":"0.2"},{"v":0.19991050666666713,"d":"0.2"},{"$f":"IF(PosPUDL1<AI62,PUDL1l*(AI62-PosPUDL1)^4/24,0)","v":{"v":0.24676704000000058,"d":"0.2"}},{"v":0.30141450666666736,"d":"0.3"},{"v":0.3646721066666676,"d":"0.4"},{"v":0.4374000000000011,"d":"0.4"},{"v":0.520499306666668,"d":"0.5"},{"v":0.6149121066666683,"d":"0.6"},{"v":0.721621440000002,"d":"0.7"},{"v":0.841651306666669,"d":"0.8"},{"v":0.9760666666666694,"d":"1.0"},{"v":1.1259734400000032,"d":"1.1"},{"v":1.29251850666667,"d":"1.3"},{"v":1.4768897066666709,"d":"1.5"},{"v":1.680315840000005,"d":"1.7"},{"v":1.9040666666666721,"d":"1.9"},{"v":2.149452906666673,"d":"2.1"},{"v":2.417826240000007,"d":"2.4"},{"v":2.7105793066666752,"d":"2.7"},{"v":3.0291457066666756,"d":"3.0"},{"v":3.3750000000000084,"d":"3.4"},{"v":3.7496577066666763,"d":"3.7"},{"v":4.154675306666677,"d":"4.2"},{"v":4.591650240000011,"d":"4.6"},{"v":5.062220906666679,"d":"5.1"},{"v":5.568066666666681,"d":"5.6"},{"v":6.1109078400000145,"d":"6.1"},{"v":6.692505706666684,"d":"6.7"},{"v":7.314662506666686,"d":"7.3"},{"v":7.97922144000002,"d":"8.0"},{"v":8.688066666666689,"d":"8.7"},{"v":9.443123306666694,"d":"9.4"},{"v":10.246357440000027,"d":"10.2"},{"v":11.099776106666695,"d":"11.1"},{"$f":"IF(PosPUDL1<BO62,PUDL1l*(BO62-PosPUDL1)^4/24,0)","v":{"v":12.005427306666702,"d":"12.0"}},{"v":12.965400000000038,"d":"13.0"},{"v":13.981824106666705,"d":"14.0"},{"v":15.05687050666671,"d":"15.1"},{"v":16.192751040000044,"d":"16.2"},{"v":17.391718506666713,"d":"17.4"},{"v":18.656066666666717,"d":"18.7"},{"v":19.988130240000057,"d":"20.0"},{"v":21.390284906666725,"d":"21.4"},{"v":22.864947306666725,"d":"22.9"},{"v":24.41457504000007,"d":"24.4"},{"v":26.041666666666742,"d":"26.0"},{"v":27.74876170666674,"d":"27.7"},{"v":29.538440640000086,"d":"29.5"},{"v":31.413324906666755,"d":"31.4"},{"v":33.37607690666676,"d":"33.4"},{"v":35.42940000000011,"d":"35.4"},{"v":37.57603850666677,"d":"37.6"},{"v":39.818777706666786,"d":"39.8"},{"v":42.16044384000012,"d":"42.2"},{"v":44.60390410666679,"d":"44.6"},{"v":47.152066666666805,"d":"47.2"},{"v":49.80788064000016,"d":"49.8"},{"v":52.57433610666681,"d":"52.6"},{"v":55.45446410666684,"d":"55.5"},{"v":58.45133664000017,"d":"58.5"},{"v":61.568066666666844,"d":"61.6"},{"v":64.80780810666685,"d":"64.8"},{"v":68.1737558400002,"d":"68.2"},{"v":71.66914570666688,"d":"71.7"},{"v":75.29725450666687,"d":"75.3"},{"v":79.06140000000023,"d":"79.1"},{"v":82.96494090666693,"d":"83.0"},{"v":87.01127690666694,"d":"87.0"},{"v":91.20384864000029,"d":"91.2"},{"v":95.54613770666695,"d":"95.5"},{"v":100.04166666666696,"d":"100.0"}]
[null,"PUDL a contra",{"$f":"-IF(C62>(PosPUDL1+3),PUDL1l*(C62-PosPUDL1-3)^4/24,0)","v":{"v":0,"d":"0.0"}},{"$f":"-IF(D62>(PosPUDL1+3),PUDL1l*(D62-PosPUDL1-3)^4/24,0)","v":{"v":0,"d":"0.0"}},{"$f":"-IF(E62>(PosPUDL1+3),PUDL1l*(E62-PosPUDL1-3)^4/24,0)","v":{"v":0,"d":"0.0"}},{"$f":"-IF(F62>(PosPUDL1+3),PUDL1l*(F62-PosPUDL1-3)^4/24,0)","v":{"v":0,"d":"0.0"}},{"$f":"-IF(G62>(PosPUDL1+3),PUDL1l*(G62-PosPUDL1-3)^4/24,0)","v":{"v":0,"d":"0.0"}},{"$f":"-IF(H62>(PosPUDL1+3),PUDL1l*(H62-PosPUDL1-3)^4/24,0)","v":{"v":0,"d":"0.0"}},{"$f":"-IF(I62>(PosPUDL1+3),PUDL1l*(I62-PosPUDL1-3)^4/24,0)","v":{"v":0,"d":"0.0"}},{"$f":"-IF(J62>(PosPUDL1+3),PUDL1l*(J62-PosPUDL1-3)^4/24,0)","v":{"v":0,"d":"0.0"}},{"$f":"-IF(K62>(PosPUDL1+3),PUDL1l*(K62-PosPUDL1-3)^4/24,0)","v":{"v":0,"d":"0.0"}},{"$f":"-IF(L62>(PosPUDL1+3),PUDL1l*(L62-PosPUDL1-3)^4/24,0)","v":{"v":0,"d":"0.0"}},{"$f":"-IF(M62>(PosPUDL1+3),PUDL1l*(M62-PosPUDL1-3)^4/24,0)","v":{"v":0,"d":"0.0"}},{"$f":"-IF(N62>(PosPUDL1+3),PUDL1l*(N62-PosPUDL1-3)^4/24,0)","v":{"v":0,"d":"0.0"}},{"$f":"-IF(O62>(PosPUDL1+3),PUDL1l*(O62-PosPUDL1-3)^4/24,0)","v":{"v":0,"d":"0.0"}},{"$f":"-IF(P62>(PosPUDL1+3),PUDL1l*(P62-PosPUDL1-3)^4/24,0)","v":{"v":0,"d":"0.0"}},{"$f":"-IF(Q62>(PosPUDL1+3),PUDL1l*(Q62-PosPUDL1-3)^4/24,0)","v":{"v":0,"d":"0.0"}},{"$f":"-IF(R62>(PosPUDL1+3),PUDL1l*(R62-PosPUDL1-3)^4/24,0)","v":{"v":0,"d":"0.0"}},{"$f":"-IF(S62>(PosPUDL1+3),PUDL1l*(S62-PosPUDL1-3)^4/24,0)","v":{"v":0,"d":"0.0"}},{"$f":"-IF(T62>(PosPUDL1+3),PUDL1l*(T62-PosPUDL1-3)^4/24,0)","v":{"v":0,"d":"0.0"}},{"$f":"-IF(U62>(PosPUDL1+3),PUDL1l*(U62-PosPUDL1-3)^4/24,0)","v":{"v":0,"d":"0.0"}},{"$f":"-IF(V62>(PosPUDL1+3),PUDL1l*(V62-PosPUDL1-3)^4/24,0)","v":{"v":0,"d":"0.0"}},{"$f":"-IF(W62>(PosPUDL1+3),PUDL1l*(W62-PosPUDL1-3)^4/24,0)","v":{"v":0,"d":"0.0"}},{"$f":"-IF(X62>(PosPUDL1+3),PUDL1l*(X62-PosPUDL1-3)^4/24,0)","v":{"v":0,"d":"0.0"}},{"$f":"-IF(Y62>(PosPUDL1+3),PUDL1l*(Y62-PosPUDL1-3)^4/24,0)","v":{"v":0,"d":"0.0"}},{"$f":"-IF(Z62>(PosPUDL1+3),PUDL1l*(Z62-PosPUDL1-3)^4/24,0)","v":{"v":0,"d":"0.0"}},{"$f":"-IF(AA62>(PosPUDL1+3),PUDL1l*(AA62-PosPUDL1-3)^4/24,0)","v":{"v":0,"d":"0.0"}},{"$f":"-IF(AB62>(PosPUDL1+3),PUDL1l*(AB62-PosPUDL1-3)^4/24,0)","v":{"v":0,"d":"0.0"}},{"$f":"-IF(AC62>(PosPUDL1+3),PUDL1l*(AC62-PosPUDL1-3)^4/24,0)","v":{"v":0,"d":"0.0"}},{"$f":"-IF(AD62>(PosPUDL1+3),PUDL1l*(AD62-PosPUDL1-3)^4/24,0)","v":{"v":0,"d":"0.0"}},{"$f":"-IF(AE62>(PosPUDL1+3),PUDL1l*(AE62-PosPUDL1-3)^4/24,0)","v":{"v":0,"d":"0.0"}},{"$f":"-IF(AF62>(PosPUDL1+3),PUDL1l*(AF62-PosPUDL1-3)^4/24,0)","v":{"v":0,"d":"0.0"}},{"$f":"-IF(AG62>(PosPUDL1+3),PUDL1l*(AG62-PosPUDL1-3)^4/24,0)","v":{"v":0,"d":"0.0"}},{"$f":"-IF(AH62>(PosPUDL1+3),PUDL1l*(AH62-PosPUDL1-3)^4/24,0)","v":{"v":0,"d":"0.0"}},{"$f":"-IF(AI62>(PosPUDL1+3),PUDL1l*(AI62-PosPUDL1-3)^4/24,0)","v":{"v":0,"d":"0.0"}},{"$f":"-IF(AJ62>(PosPUDL1+3),PUDL1l*(AJ62-PosPUDL1-3)^4/24,0)","v":{"v":0,"d":"0.0"}},{"$f":"-IF(AK62>(PosPUDL1+3),PUDL1l*(AK62-PosPUDL1-3)^4/24,0)","v":{"v":0,"d":"0.0"}},{"$f":"-IF(AL62>(PosPUDL1+3),PUDL1l*(AL62-PosPUDL1-3)^4/24,0)","v":{"v":0,"d":"0.0"}},{"$f":"-IF(AM62>(PosPUDL1+3),PUDL1l*(AM62-PosPUDL1-3)^4/24,0)","v":{"v":0,"d":"0.0"}},{"$f":"-IF(AN62>(PosPUDL1+3),PUDL1l*(AN62-PosPUDL1-3)^4/24,0)","v":{"v":0,"d":"0.0"}},{"$f":"-IF(AO62>(PosPUDL1+3),PUDL1l*(AO62-PosPUDL1-3)^4/24,0)","v":{"v":0,"d":"0.0"}},{"$f":"-IF(AP62>(PosPUDL1+3),PUDL1l*(AP62-PosPUDL1-3)^4/24,0)","v":{"v":0,"d":"0.0"}},{"$f":"-IF(AQ62>(PosPUDL1+3),PUDL1l*(AQ62-PosPUDL1-3)^4/24,0)","v":{"v":0,"d":"0.0"}},{"$f":"-IF(AR62>(PosPUDL1+3),PUDL1l*(AR62-PosPUDL1-3)^4/24,0)","v":{"v":0,"d":"0.0"}},{"$f":"-IF(AS62>(PosPUDL1+3),PUDL1l*(AS62-PosPUDL1-3)^4/24,0)","v":{"v":0,"d":"0.0"}},{"$f":"-IF(AT62>(PosPUDL1+3),PUDL1l*(AT62-PosPUDL1-3)^4/24,0)","v":{"v":0,"d":"0.0"}},{"$f":"-IF(AU62>(PosPUDL1+3),PUDL1l*(AU62-PosPUDL1-3)^4/24,0)","v":{"v":0,"d":"0.0"}},{"$f":"-IF(AV62>(PosPUDL1+3),PUDL1l*(AV62-PosPUDL1-3)^4/24,0)","v":{"v":0,"d":"0.0"}},{"$f":"-IF(AW62>(PosPUDL1+3),PUDL1l*(AW62-PosPUDL1-3)^4/24,0)","v":{"v":0,"d":"0.0"}},{"$f":"-IF(AX62>(PosPUDL1+3),PUDL1l*(AX62-PosPUDL1-3)^4/24,0)","v":{"v":0,"d":"0.0"}},{"$f":"-IF(AY62>(PosPUDL1+3),PUDL1l*(AY62-PosPUDL1-3)^4/24,0)","v":{"v":0,"d":"0.0"}},{"$f":"-IF(AZ62>(PosPUDL1+3),PUDL1l*(AZ62-PosPUDL1-3)^4/24,0)","v":{"v":0,"d":"0.0"}},{"$f":"-IF(BA62>(PosPUDL1+3),PUDL1l*(BA62-PosPUDL1-3)^4/24,0)","v":{"v":0,"d":"0.0"}},{"$f":"-IF(BB62>(PosPUDL1+3),PUDL1l*(BB62-PosPUDL1-3)^4/24,0)","v":{"v":-1.7066666666668243E-6,"d":"-0.0"}},{"$f":"-IF(BC62>(PosPUDL1+3),PUDL1l*(BC62-PosPUDL1-3)^4/24,0)","v":{"v":-2.7306666666667978E-5,"d":"-0.0"}},{"$f":"-IF(BD62>(PosPUDL1+3),PUDL1l*(BD62-PosPUDL1-3)^4/24,0)","v":{"v":-1.3824000000000459E-4,"d":"-0.0"}},{"$f":"-IF(BE62>(PosPUDL1+3),PUDL1l*(BE62-PosPUDL1-3)^4/24,0)","v":{"v":-4.3690666666667795E-4,"d":"-0.0"}},{"$f":"-IF(BF62>(PosPUDL1+3),PUDL1l*(BF62-PosPUDL1-3)^4/24,0)","v":{"v":-1.0666666666666893E-3,"d":"-0.0"}},{"$f":"-IF(BG62>(PosPUDL1+3),PUDL1l*(BG62-PosPUDL1-3)^4/24,0)","v":{"v":-2.2118400000000404E-3,"d":"-0.0"}},{"$f":"-IF(BH62>(PosPUDL1+3),PUDL1l*(BH62-PosPUDL1-3)^4/24,0)","v":{"v":-0.004097706666666733,"d":"-0.0"}},{"$f":"-IF(BI62>(PosPUDL1+3),PUDL1l*(BI62-PosPUDL1-3)^4/24,0)","v":{"v":-6.99050666666677E-3,"d":"-0.0"}},{"$f":"-IF(BJ62>(PosPUDL1+3),PUDL1l*(BJ62-PosPUDL1-3)^4/24,0)","v":{"v":-0.011197440000000154,"d":"-0.0"}},{"$f":"-IF(BK62>(PosPUDL1+3),PUDL1l*(BK62-PosPUDL1-3)^4/24,0)","v":{"v":-0.01706666666666688,"d":"-0.0"}},{"$f":"-IF(BL62>(PosPUDL1+3),PUDL1l*(BL62-PosPUDL1-3)^4/24,0)","v":{"v":-0.02498730666666696,"d":"-0.0"}},{"$f":"-IF(BM62>(PosPUDL1+3),PUDL1l*(BM62-PosPUDL1-3)^4/24,0)","v":{"v":-0.03538944000000039,"d":"-0.0"}},{"$f":"-IF(BN62>(PosPUDL1+3),PUDL1l*(BN62-PosPUDL1-3)^4/24,0)","v":{"v":-0.048744106666667175,"d":"-0.0"}},{"$f":"-IF(BO62>(PosPUDL1+3),PUDL1l*(BO62-PosPUDL1-3)^4/24,0)","v":{"v":-0.0655633066666673,"d":"-0.1"}},{"$f":"-IF(BP62>(PosPUDL1+3),PUDL1l*(BP62-PosPUDL1-3)^4/24,0)","v":{"v":-0.08640000000000082,"d":"-0.1"}},{"$f":"-IF(BQ62>(PosPUDL1+3),PUDL1l*(BQ62-PosPUDL1-3)^4/24,0)","v":{"v":-0.11184810666666768,"d":"-0.1"}},{"$f":"-IF(BR62>(PosPUDL1+3),PUDL1l*(BR62-PosPUDL1-3)^4/24,0)","v":{"v":-0.14254250666666793,"d":"-0.1"}},{"$f":"-IF(BS62>(PosPUDL1+3),PUDL1l*(BS62-PosPUDL1-3)^4/24,0)","v":{"v":-0.17915904000000152,"d":"-0.2"}},{"$f":"-IF(BT62>(PosPUDL1+3),PUDL1l*(BT62-PosPUDL1-3)^4/24,0)","v":{"v":-0.22241450666666848,"d":"-0.2"}},{"$f":"-IF(BU62>(PosPUDL1+3),PUDL1l*(BU62-PosPUDL1-3)^4/24,0)","v":{"v":-0.27306666666666884,"d":"-0.3"}},{"$f":"-IF(BV62>(PosPUDL1+3),PUDL1l*(BV62-PosPUDL1-3)^4/24,0)","v":{"v":-0.33191424000000264,"d":"-0.3"}},{"$f":"-IF(BW62>(PosPUDL1+3),PUDL1l*(BW62-PosPUDL1-3)^4/24,0)","v":{"v":-0.3997969066666697,"d":"-0.4"}},{"$f":"-IF(BX62>(PosPUDL1+3),PUDL1l*(BX62-PosPUDL1-3)^4/24,0)","v":{"v":-0.4775953066666702,"d":"-0.5"}},{"$f":"-IF(BY62>(PosPUDL1+3),PUDL1l*(BY62-PosPUDL1-3)^4/24,0)","v":{"v":-0.566231040000004,"d":"-0.6"}},{"$f":"-IF(BZ62>(PosPUDL1+3),PUDL1l*(BZ62-PosPUDL1-3)^4/24,0)","v":{"v":-0.6666666666666714,"d":"-0.7"}},{"$f":"-IF(CA62>(PosPUDL1+3),PUDL1l*(CA62-PosPUDL1-3)^4/24,0)","v":{"v":-0.779905706666672,"d":"-0.8"}},{"$f":"-IF(CB62>(PosPUDL1+3),PUDL1l*(CB62-PosPUDL1-3)^4/24,0)","v":{"v":-0.9069926400000065,"d":"-0.9"}},{"$f":"-IF(CC62>(PosPUDL1+3),PUDL1l*(CC62-PosPUDL1-3)^4/24,0)","v":{"v":-1.0490129066666738,"d":"-1.0"}},{"$f":"-IF(CD62>(PosPUDL1+3),PUDL1l*(CD62-PosPUDL1-3)^4/24,0)","v":{"v":-1.2070929066666745,"d":"-1.2"}},{"$f":"-IF(CE62>(PosPUDL1+3),PUDL1l*(CE62-PosPUDL1-3)^4/24,0)","v":{"v":-1.3824000000000087,"d":"-1.4"}},{"$f":"-IF(CF62>(PosPUDL1+3),PUDL1l*(CF62-PosPUDL1-3)^4/24,0)","v":{"v":-1.5761425066666768,"d":"-1.6"}},{"$f":"-IF(CG62>(PosPUDL1+3),PUDL1l*(CG62-PosPUDL1-3)^4/24,0)","v":{"v":-1.789569706666678,"d":"-1.8"}},{"$f":"-IF(CH62>(PosPUDL1+3),PUDL1l*(CH62-PosPUDL1-3)^4/24,0)","v":{"v":-2.0239718400000126,"d":"-2.0"}},{"$f":"-IF(CI62>(PosPUDL1+3),PUDL1l*(CI62-PosPUDL1-3)^4/24,0)","v":{"v":-2.2806801066666806,"d":"-2.3"}},{"$f":"-IF(CJ62>(PosPUDL1+3),PUDL1l*(CJ62-PosPUDL1-3)^4/24,0)","v":{"v":-2.561066666666682,"d":"-2.6"}},{"$f":"-IF(CK62>(PosPUDL1+3),PUDL1l*(CK62-PosPUDL1-3)^4/24,0)","v":{"v":-2.8665446400000167,"d":"-2.9"}},{"$f":"-IF(CL62>(PosPUDL1+3),PUDL1l*(CL62-PosPUDL1-3)^4/24,0)","v":{"v":-3.198568106666686,"d":"-3.2"}},{"$f":"-IF(CM62>(PosPUDL1+3),PUDL1l*(CM62-PosPUDL1-3)^4/24,0)","v":{"v":-3.5586321066666873,"d":"-3.6"}},{"$f":"-IF(CN62>(PosPUDL1+3),PUDL1l*(CN62-PosPUDL1-3)^4/24,0)","v":{"v":-3.948272640000024,"d":"-3.9"}},{"$f":"-IF(CO62>(PosPUDL1+3),PUDL1l*(CO62-PosPUDL1-3)^4/24,0)","v":{"v":-4.369066666666693,"d":"-4.4"}},{"$f":"-IF(CP62>(PosPUDL1+3),PUDL1l*(CP62-PosPUDL1-3)^4/24,0)","v":{"v":-4.822632106666694,"d":"-4.8"}},{"$f":"-IF(CQ62>(PosPUDL1+3),PUDL1l*(CQ62-PosPUDL1-3)^4/24,0)","v":{"v":-5.31062784000003,"d":"-5.3"}},{"$f":"-IF(CR62>(PosPUDL1+3),PUDL1l*(CR62-PosPUDL1-3)^4/24,0)","v":{"v":-5.834753706666699,"d":"-5.8"}},{"$f":"-IF(CS62>(PosPUDL1+3),PUDL1l*(CS62-PosPUDL1-3)^4/24,0)","v":{"v":-6.396750506666703,"d":"-6.4"}},{"$f":"-IF(CT62>(PosPUDL1+3),PUDL1l*(CT62-PosPUDL1-3)^4/24,0)","v":{"v":-6.998400000000039,"d":"-7.0"}},{"$f":"-IF(CU62>(PosPUDL1+3),PUDL1l*(CU62-PosPUDL1-3)^4/24,0)","v":{"v":-7.641524906666709,"d":"-7.6"}},{"$f":"-IF(CV62>(PosPUDL1+3),PUDL1l*(CV62-PosPUDL1-3)^4/24,0)","v":{"v":-8.327988906666713,"d":"-8.3"}},{"$f":"-IF(CW62>(PosPUDL1+3),PUDL1l*(CW62-PosPUDL1-3)^4/24,0)","v":{"v":-9.05969664000005,"d":"-9.1"}},{"$f":"-IF(CX62>(PosPUDL1+3),PUDL1l*(CX62-PosPUDL1-3)^4/24,0)","v":{"v":-9.83859370666672,"d":"-9.8"}},{"$f":"-IF(CY62>(PosPUDL1+3),PUDL1l*(CY62-PosPUDL1-3)^4/24,0)","v":{"v":-10.666666666666723,"d":"-10.7"}}]
[null,"PUDL b",{"$f":"IF(PosPUDL2<C62,PUDL2l*(C62-PosPUDL2)^4/24,0)","v":{"v":0,"d":"0.0"}},{"v":0,"d":"0.0"},{"v":0,"d":"0.0"},{"v":0,"d":"0.0"},{"v":0,"d":"0.0"},{"v":0,"d":"0.0"},{"v":0,"d":"0.0"},{"v":0,"d":"0.0"},{"v":0,"d":"0.0"},{"v":0,"d":"0.0"},{"v":0,"d":"0.0"},{"v":0,"d":"0.0"},{"v":0,"d":"0.0"},{"v":0,"d":"0.0"},{"v":0,"d":"0.0"},{"v":0,"d":"0.0"},{"v":0,"d":"0.0"},{"v":0,"d":"0.0"},{"v":0,"d":"0.0"},{"v":0,"d":"0.0"},{"v":0,"d":"0.0"},{"v":0,"d":"0.0"},{"v":0,"d":"0.0"},{"v":0,"d":"0.0"},{"v":0,"d":"0.0"},{"v":0,"d":"0.0"},{"v":0,"d":"0.0"},{"v":0,"d":"0.0"},{"v":0,"d":"0.0"},{"v":0,"d":"0.0"},{"v":0,"d":"0.0"},{"v":0,"d":"0.0"},{"$f":"IF(PosPUDL2<AI62,PUDL2l*(AI62-PosPUDL2)^4/24,0)","v":{"v":0,"d":"0.0"}},{"v":0,"d":"0.0"},{"v":0,"d":"0.0"},{"v":0,"d":"0.0"},{"v":0,"d":"0.0"},{"v":0,"d":"0.0"},{"v":0,"d":"0.0"},{"v":0,"d":"0.0"},{"v":0,"d":"0.0"},{"v":0,"d":"0.0"},{"v":0,"d":"0.0"},{"v":0,"d":"0.0"},{"v":0,"d":"0.0"},{"v":0,"d":"0.0"},{"v":0,"d":"0.0"},{"v":0,"d":"0.0"},{"v":0,"d":"0.0"},{"v":0,"d":"0.0"},{"v":0,"d":"0.0"},{"v":0,"d":"0.0"},{"v":0,"d":"0.0"},{"v":0,"d":"0.0"},{"v":0,"d":"0.0"},{"v":0,"d":"0.0"},{"v":0,"d":"0.0"},{"v":0,"d":"0.0"},{"v":0,"d":"0.0"},{"v":0,"d":"0.0"},{"v":0,"d":"0.0"},{"v":0,"d":"0.0"},{"v":0,"d":"0.0"},{"v":0,"d":"0.0"},{"$f":"IF(PosPUDL2<BO62,PUDL2l*(BO62-PosPUDL2)^4/24,0)","v":{"v":0,"d":"0.0"}},{"v":0,"d":"0.0"},{"v":0,"d":"0.0"},{"v":0,"d":"0.0"},{"v":0,"d":"0.0"},{"v":0,"d":"0.0"},{"v":0,"d":"0.0"},{"v":0,"d":"0.0"},{"v":0,"d":"0.0"},{"v":0,"d":"0.0"},{"v":0,"d":"0.0"},{"v":0,"d":"0.0"},{"v":0,"d":"0.0"},{"v":0,"d":"0.0"},{"v":0,"d":"0.0"},{"v":0,"d":"0.0"},{"v":0,"d":"0.0"},{"v":0,"d":"0.0"},{"v":0,"d":"0.0"},{"v":0,"d":"0.0"},{"v":0,"d":"0.0"},{"v":0,"d":"0.0"},{"v":0,"d":"0.0"},{"v":0,"d":"0.0"},{"v":0,"d":"0.0"},{"v":0,"d":"0.0"},{"v":0,"d":"0.0"},{"v":0,"d":"0.0"},{"v":0,"d":"0.0"},{"v":0,"d":"0.0"},{"v":0,"d":"0.0"},{"v":0,"d":"0.0"},{"v":0,"d":"0.0"},{"v":0,"d":"0.0"},{"v":0,"d":"0.0"},{"v":0,"d":"0.0"},{"v":0,"d":"0.0"}]
[null,"PUDL b contra",{"$f":"-IF(C62>(PosPUDL2+LePUDL2),PUDL2l*(C62-PosPUDL2-LePUDL2)^4/24,0)","v":{"v":0,"d":"0.0"}},{"v":0,"d":"0.0"},{"v":0,"d":"0.0"},{"v":0,"d":"0.0"},{"v":0,"d":"0.0"},{"v":0,"d":"0.0"},{"v":0,"d":"0.0"},{"v":0,"d":"0.0"},{"v":0,"d":"0.0"},{"v":0,"d":"0.0"},{"v":0,"d":"0.0"},{"v":0,"d":"0.0"},{"v":0,"d":"0.0"},{"v":0,"d":"0.0"},{"v":0,"d":"0.0"},{"v":0,"d":"0.0"},{"v":0,"d":"0.0"},{"v":0,"d":"0.0"},{"v":0,"d":"0.0"},{"v":0,"d":"0.0"},{"v":0,"d":"0.0"},{"v":0,"d":"0.0"},{"v":0,"d":"0.0"},{"v":0,"d":"0.0"},{"v":0,"d":"0.0"},{"v":0,"d":"0.0"},{"v":0,"d":"0.0"},{"v":0,"d":"0.0"},{"v":0,"d":"0.0"},{"v":0,"d":"0.0"},{"v":0,"d":"0.0"},{"v":0,"d":"0.0"},{"$f":"-IF(AI62>(PosPUDL2+LePUDL2),PUDL2l*(AI62-PosPUDL2-LePUDL2)^4/24,0)","v":{"v":0,"d":"0.0"}},{"v":0,"d":"0.0"},{"v":0,"d":"0.0"},{"v":0,"d":"0.0"},{"v":0,"d":"0.0"},{"v":0,"d":"0.0"},{"v":0,"d":"0.0"},{"v":0,"d":"0.0"},{"v":0,"d":"0.0"},{"v":0,"d":"0.0"},{"v":0,"d":"0.0"},{"v":0,"d":"0.0"},{"v":0,"d":"0.0"},{"v":0,"d":"0.0"},{"v":0,"d":"0.0"},{"v":0,"d":"0.0"},{"v":0,"d":"0.0"},{"v":0,"d":"0.0"},{"v":0,"d":"0.0"},{"v":0,"d":"0.0"},{"v":0,"d":"0.0"},{"v":0,"d":"0.0"},{"v":0,"d":"0.0"},{"v":0,"d":"0.0"},{"v":0,"d":"0.0"},{"v":0,"d":"0.0"},{"v":0,"d":"0.0"},{"v":0,"d":"0.0"},{"v":0,"d":"0.0"},{"v":0,"d":"0.0"},{"v":0,"d":"0.0"},{"v":0,"d":"0.0"},{"$f":"-IF(BO62>(PosPUDL2+LePUDL2),PUDL2l*(BO62-PosPUDL2-LePUDL2)^4/24,0)","v":{"v":0,"d":"0.0"}},{"v":0,"d":"0.0"},{"v":0,"d":"0.0"},{"v":0,"d":"0.0"},{"v":0,"d":"0.0"},{"v":0,"d":"0.0"},{"v":0,"d":"0.0"},{"v":0,"d":"0.0"},{"v":0,"d":"0.0"},{"v":0,"d":"0.0"},{"v":0,"d":"0.0"},{"v":0,"d":"0.0"},{"v":0,"d":"0.0"},{"v":0,"d":"0.0"},{"v":0,"d":"0.0"},{"v":0,"d":"0.0"},{"v":0,"d":"0.0"},{"v":0,"d":"0.0"},{"v":0,"d":"0.0"},{"v":0,"d":"0.0"},{"v":0,"d":"0.0"},{"v":0,"d":"0.0"},{"v":0,"d":"0.0"},{"v":0,"d":"0.0"},{"v":0,"d":"0.0"},{"v":0,"d":"0.0"},{"v":0,"d":"0.0"},{"v":0,"d":"0.0"},{"v":0,"d":"0.0"},{"v":0,"d":"0.0"},{"v":0,"d":"0.0"},{"v":0,"d":"0.0"},{"v":0,"d":"0.0"},{"v":0,"d":"0.0"},{"v":0,"d":"0.0"},{"v":0,"d":"0.0"},{"v":0,"d":"0.0"}]
[null,"PLa",{"$f":"IF(C62>PosPLa1,PLa1l*(C62-PosPLa1)^3/6,0)","v":{"v":0,"d":"0.0"}},{"v":0,"d":"0.0"},{"v":0,"d":"0.0"},{"v":0,"d":"0.0"},{"v":0,"d":"0.0"},{"v":0,"d":"0.0"},{"v":0,"d":"0.0"},{"v":0,"d":"0.0"},{"v":0,"d":"0.0"},{"v":0,"d":"0.0"},{"v":0,"d":"0.0"},{"v":0,"d":"0.0"},{"v":0,"d":"0.0"},{"v":0,"d":"0.0"},{"v":0,"d":"0.0"},{"v":0,"d":"0.0"},{"v":0,"d":"0.0"},{"v":0,"d":"0.0"},{"v":0,"d":"0.0"},{"v":0,"d":"0.0"},{"v":0,"d":"0.0"},{"v":0,"d":"0.0"},{"v":0,"d":"0.0"},{"v":0,"d":"0.0"},{"v":0,"d":"0.0"},{"v":0,"d":"0.0"},{"v":0,"d":"0.0"},{"v":0,"d":"0.0"},{"v":0,"d":"0.0"},{"v":0,"d":"0.0"},{"v":0,"d":"0.0"},{"v":0,"d":"0.0"},{"$f":"IF(AI62>PosPLa1,PLa1l*(AI62-PosPLa1)^3/6,0)","v":{"v":0,"d":"0.0"}},{"v":0,"d":"0.0"},{"v":0,"d":"0.0"},{"v":0,"d":"0.0"},{"v":0,"d":"0.0"},{"v":0,"d":"0.0"},{"v":2.133333333333552E-5,"d":"0.0"},{"v":5.7600000000002072E-4,"d":"0.0"},{"v":0.002666666666666727,"d":"0.0"},{"v":0.007317333333333457,"d":"0.0"},{"v":0.015552000000000213,"d":"0.0"},{"v":0.028394666666667002,"d":"0.0"},{"v":0.04686933333333382,"d":"0.0"},{"v":0.07200000000000067,"d":"0.1"},{"v":0.10481066666666757,"d":"0.1"},{"v":0.14632533333333447,"d":"0.1"},{"v":0.19756800000000144,"d":"0.2"},{"v":0.2595626666666685,"d":"0.3"},{"v":0.3333333333333351,"d":"0.3"},{"v":0.4199040000000022,"d":"0.4"},{"v":0.5202986666666692,"d":"0.5"},{"v":0.6355413333333364,"d":"0.6"},{"v":0.7666560000000037,"d":"0.8"},{"v":0.9146666666666708,"d":"0.9"},{"v":1.080597333333338,"d":"1.1"},{"v":1.2654720000000057,"d":"1.3"},{"v":1.4703146666666729,"d":"1.5"},{"v":1.6961493333333404,"d":"1.7"},{"v":1.9440000000000082,"d":"1.9"},{"v":2.2148906666666757,"d":"2.2"},{"v":2.5098453333333435,"d":"2.5"},{"v":2.829888000000011,"d":"2.8"},{"$f":"IF(BO62>PosPLa1,PLa1l*(BO62-PosPLa1)^3/6,0)","v":{"v":3.1760426666666794,"d":"3.2"}},{"v":3.549333333333347,"d":"3.5"},{"v":3.950784000000015,"d":"4.0"},{"v":4.381418666666683,"d":"4.4"},{"v":4.842261333333352,"d":"4.8"},{"v":5.334336000000019,"d":"5.3"},{"v":5.8586666666666884,"d":"5.9"},{"v":6.416277333333357,"d":"6.4"},{"v":7.008192000000025,"d":"7.0"},{"v":7.635434666666694,"d":"7.6"},{"v":8.299029333333364,"d":"8.3"},{"v":9.000000000000032,"d":"9.0"},{"v":9.739370666666701,"d":"9.7"},{"v":10.51816533333337,"d":"10.5"},{"v":11.33740800000004,"d":"11.3"},{"v":12.19812266666671,"d":"12.2"},{"v":13.101333333333379,"d":"13.1"},{"v":14.048064000000046,"d":"14.0"},{"v":15.039338666666717,"d":"15.0"},{"v":16.076181333333388,"d":"16.1"},{"v":17.15961600000006,"d":"17.2"},{"v":18.290666666666727,"d":"18.3"},{"v":19.4703573333334,"d":"19.5"},{"v":20.69971200000007,"d":"20.7"},{"v":21.97975466666674,"d":"22.0"},{"v":23.311509333333415,"d":"23.3"},{"v":24.696000000000083,"d":"24.7"},{"v":26.13425066666675,"d":"26.1"},{"v":27.627285333333422,"d":"27.6"},{"v":29.176128000000094,"d":"29.2"},{"v":30.781802666666767,"d":"30.8"},{"v":32.445333333333444,"d":"32.4"},{"v":34.167744000000106,"d":"34.2"},{"v":35.950058666666784,"d":"36.0"},{"v":37.79330133333345,"d":"37.8"},{"v":39.69849600000013,"d":"39.7"},{"v":41.6666666666668,"d":"41.7"}]
[null,"PLb",{"$f":"IF(C62>PosPLb1,PLb1l*(C62-PosPLb1)^3/6,0)","v":{"v":0,"d":"0.0"}},{"v":0,"d":"0.0"},{"v":0,"d":"0.0"},{"v":0,"d":"0.0"},{"v":0,"d":"0.0"},{"v":0,"d":"0.0"},{"v":0,"d":"0.0"},{"v":0,"d":"0.0"},{"v":0,"d":"0.0"},{"v":0,"d":"0.0"},{"v":0,"d":"0.0"},{"v":0,"d":"0.0"},{"v":0,"d":"0.0"},{"v":0,"d":"0.0"},{"v":0,"d":"0.0"},{"v":0,"d":"0.0"},{"v":0,"d":"0.0"},{"v":0,"d":"0.0"},{"v":0,"d":"0.0"},{"v":0,"d":"0.0"},{"v":0,"d":"0.0"},{"v":0,"d":"0.0"},{"v":0,"d":"0.0"},{"v":0,"d":"0.0"},{"v":0,"d":"0.0"},{"v":0,"d":"0.0"},{"v":0,"d":"0.0"},{"v":0,"d":"0.0"},{"v":0,"d":"0.0"},{"v":0,"d":"0.0"},{"v":0,"d":"0.0"},{"v":0,"d":"0.0"},{"$f":"IF(AI62>PosPLb1,PLb1l*(AI62-PosPLb1)^3/6,0)","v":{"v":0,"d":"0.0"}},{"v":0,"d":"0.0"},{"v":0,"d":"0.0"},{"v":0,"d":"0.0"},{"v":0,"d":"0.0"},{"v":0,"d":"0.0"},{"v":0,"d":"0.0"},{"v":0,"d":"0.0"},{"v":0,"d":"0.0"},{"v":0,"d":"0.0"},{"v":0,"d":"0.0"},{"v":0,"d":"0.0"},{"v":0,"d":"0.0"},{"v":0,"d":"0.0"},{"v":0,"d":"0.0"},{"v":0,"d":"0.0"},{"v":0,"d":"0.0"},{"v":0,"d":"0.0"},{"v":0,"d":"0.0"},{"v":0,"d":"0.0"},{"v":0,"d":"0.0"},{"v":0,"d":"0.0"},{"v":0,"d":"0.0"},{"v":0,"d":"0.0"},{"v":0,"d":"0.0"},{"v":0,"d":"0.0"},{"v":0,"d":"0.0"},{"v":0,"d":"0.0"},{"v":0,"d":"0.0"},{"v":0,"d":"0.0"},{"v":0,"d":"0.0"},{"v":0,"d":"0.0"},{"$f":"IF(BO62>PosPLb1,PLb1l*(BO62-PosPLb1)^3/6,0)","v":{"v":0,"d":"0.0"}},{"v":0,"d":"0.0"},{"v":0,"d":"0.0"},{"v":0,"d":"0.0"},{"v":0,"d":"0.0"},{"v":0,"d":"0.0"},{"v":0,"d":"0.0"},{"v":0,"d":"0.0"},{"v":0,"d":"0.0"},{"v":0,"d":"0.0"},{"v":0,"d":"0.0"},{"v":0,"d":"0.0"},{"v":0,"d":"0.0"},{"v":0,"d":"0.0"},{"v":0,"d":"0.0"},{"v":0,"d":"0.0"},{"v":0,"d":"0.0"},{"v":0,"d":"0.0"},{"v":0,"d":"0.0"},{"v":0,"d":"0.0"},{"v":0,"d":"0.0"},{"v":0,"d":"0.0"},{"v":0,"d":"0.0"},{"v":0,"d":"0.0"},{"v":0,"d":"0.0"},{"v":0,"d":"0.0"},{"v":0,"d":"0.0"},{"v":0,"d":"0.0"},{"v":0,"d":"0.0"},{"v":0,"d":"0.0"},{"v":0,"d":"0.0"},{"v":0,"d":"0.0"},{"v":0,"d":"0.0"},{"v":0,"d":"0.0"},{"v":0,"d":"0.0"},{"v":0,"d":"0.0"},{"v":0,"d":"0.0"}]
[null,"Ax+B",{"$f":"$D$73*C62+$D$74","v":{"v":0,"d":"0.0"}},{"$f":"$D$73*D62+$D$74","v":{"v":4.929583333333341,"d":"4.9"}},{"v":9.859166666666683,"d":"9.9"},{"v":14.788750000000023,"d":"14.8"},{"v":19.718333333333366,"d":"19.7"},{"v":24.647916666666706,"d":"24.6"},{"v":29.57750000000005,"d":"29.6"},{"v":34.50708333333339,"d":"34.5"},{"v":39.43666666666673,"d":"39.4"},{"v":44.366250000000065,"d":"44.4"},{"v":49.295833333333405,"d":"49.3"},{"v":54.225416666666746,"d":"54.2"},{"v":59.155000000000086,"d":"59.2"},{"v":64.08458333333343,"d":"64.1"},{"v":69.01416666666677,"d":"69.0"},{"v":73.94375000000011,"d":"73.9"},{"v":78.87333333333346,"d":"78.9"},{"v":83.8029166666668,"d":"83.8"},{"v":88.73250000000014,"d":"88.7"},{"v":93.6620833333335,"d":"93.7"},{"v":98.59166666666684,"d":"98.6"},{"v":103.52125000000018,"d":"103.5"},{"v":108.45083333333353,"d":"108.5"},{"v":113.38041666666687,"d":"113.4"},{"v":118.31000000000023,"d":"118.3"},{"v":123.23958333333356,"d":"123.2"},{"v":128.1691666666669,"d":"128.2"},{"v":133.09875000000025,"d":"133.1"},{"v":138.0283333333336,"d":"138.0"},{"v":142.95791666666693,"d":"143.0"},{"v":147.88750000000027,"d":"147.9"},{"v":152.81708333333364,"d":"152.8"},{"v":157.74666666666698,"d":"157.7"},{"v":162.67625000000032,"d":"162.7"},{"v":167.60583333333366,"d":"167.6"},{"v":172.535416666667,"d":"172.5"},{"v":177.46500000000034,"d":"177.5"},{"v":182.3945833333337,"d":"182.4"},{"v":187.32416666666705,"d":"187.3"},{"v":192.2537500000004,"d":"192.3"},{"v":197.18333333333374,"d":"197.2"},{"v":202.11291666666708,"d":"202.1"},{"v":207.04250000000042,"d":"207.0"},{"v":211.97208333333379,"d":"212.0"},{"v":216.90166666666713,"d":"216.9"},{"v":221.83125000000047,"d":"221.8"},{"v":226.7608333333338,"d":"226.8"},{"v":231.69041666666715,"d":"231.7"},{"v":236.6200000000005,"d":"236.6"},{"v":241.54958333333386,"d":"241.5"},{"v":246.47916666666717,"d":"246.5"},{"v":251.4087500000005,"d":"251.4"},{"v":256.3383333333339,"d":"256.3"},{"v":261.2679166666672,"d":"261.3"},{"v":266.19750000000056,"d":"266.2"},{"v":271.12708333333387,"d":"271.1"},{"v":276.05666666666724,"d":"276.1"},{"v":280.9862500000006,"d":"281.0"},{"v":285.9158333333339,"d":"285.9"},{"v":290.8454166666673,"d":"290.8"},{"v":295.7750000000006,"d":"295.8"},{"v":300.70458333333397,"d":"300.7"},{"v":305.6341666666673,"d":"305.6"},{"v":310.56375000000065,"d":"310.6"},{"v":315.493333333334,"d":"315.5"},{"$f":"$D$73*BP62+$D$74","v":{"v":320.42291666666733,"d":"320.4"}},{"v":325.3525000000007,"d":"325.4"},{"v":330.282083333334,"d":"330.3"},{"v":335.2116666666674,"d":"335.2"},{"v":340.14125000000075,"d":"340.1"},{"v":345.07083333333406,"d":"345.1"},{"v":350.00041666666743,"d":"350.0"},{"v":354.93000000000075,"d":"354.9"},{"v":359.8595833333341,"d":"359.9"},{"v":364.7891666666675,"d":"364.8"},{"v":369.7187500000008,"d":"369.7"},{"v":374.64833333333416,"d":"374.6"},{"v":379.5779166666675,"d":"379.6"},{"v":384.50750000000085,"d":"384.5"},{"v":389.43708333333416,"d":"389.4"},{"v":394.3666666666675,"d":"394.4"},{"v":399.2962500000009,"d":"399.3"},{"v":404.2258333333342,"d":"404.2"},{"v":409.1554166666676,"d":"409.2"},{"v":414.0850000000009,"d":"414.1"},{"v":419.01458333333426,"d":"419.0"},{"v":423.9441666666676,"d":"423.9"},{"v":428.87375000000094,"d":"428.9"},{"v":433.8033333333343,"d":"433.8"},{"v":438.7329166666676,"d":"438.7"},{"v":443.662500000001,"d":"443.7"},{"v":448.5920833333343,"d":"448.6"},{"v":453.52166666666767,"d":"453.5"},{"v":458.45125000000104,"d":"458.5"},{"v":463.38083333333435,"d":"463.4"},{"v":468.3104166666677,"d":"468.3"},{"v":473.24000000000103,"d":"473.2"},{"v":478.1695833333344,"d":"478.2"},{"v":483.09916666666777,"d":"483.1"},{"v":488.0287500000011,"d":"488.0"},{"v":492.95833333333445,"d":"493.0"},null,{"$f":"SUM(CY63:CY70)","v":{"v":-492.9583333333341,"d":"-493.0"}}]
[]
[null,null,"Constant A",{"$f":"-DA71/8","v":{"v":61.619791666666764,"d":"61.6"}}]
[null,null,"Constant B",{"v":0,"d":"0.0"}]
[]
[]
[null,null,"DIAGRAMS"]
[]
[null,"Step",{"v":0,"d":"0.0"},{"$f":"8/100","v":{"v":0.08,"d":"0.1"}},{"$f":"D79+8/100","v":{"v":0.16,"d":"0.2"}},{"$f":"E79+8/100","v":{"v":0.24,"d":"0.2"}},{"$f":"F79+8/100","v":{"v":0.32,"d":"0.3"}},{"$f":"G79+8/100","v":0.4},{"$f":"H79+8/100","v":{"v":0.48000000000000004,"d":"0.5"}},{"$f":"I79+8/100","v":{"v":0.56,"d":"0.6"}},{"$f":"J79+8/100","v":{"v":0.64,"d":"0.6"}},{"$f":"K79+8/100","v":{"v":0.72,"d":"0.7"}},{"$f":"L79+8/100","v":{"v":0.7999999999999999,"d":"0.8"}},{"$f":"M79+8/100","v":{"v":0.8799999999999999,"d":"0.9"}},{"$f":"N79+8/100","v":{"v":0.9599999999999999,"d":"1.0"}},{"$f":"O79+8/100","v":{"v":1.0399999999999998,"d":"1.0"}},{"$f":"P79+8/100","v":{"v":1.1199999999999999,"d":"1.1"}},{"$f":"Q79+8/100","v":1.2},{"$f":"R79+8/100","v":{"v":1.28,"d":"1.3"}},{"$f":"S79+8/100","v":{"v":1.36,"d":"1.4"}},{"$f":"T79+8/100","v":{"v":1.4400000000000002,"d":"1.4"}},{"$f":"U79+8/100","v":{"v":1.5200000000000002,"d":"1.5"}},{"$f":"V79+8/100","v":{"v":1.6000000000000003,"d":"1.6"}},{"$f":"W79+8/100","v":{"v":1.6800000000000004,"d":"1.7"}},{"$f":"X79+8/100","v":{"v":1.7600000000000005,"d":"1.8"}},{"$f":"Y79+8/100","v":{"v":1.8400000000000005,"d":"1.8"}},{"$f":"Z79+8/100","v":{"v":1.9200000000000006,"d":"1.9"}},{"$f":"AA79+8/100","v":{"v":2.0000000000000004,"d":"2.0"}},{"$f":"AB79+8/100","v":{"v":2.0800000000000005,"d":"2.1"}},{"$f":"AC79+8/100","v":{"v":2.1600000000000006,"d":"2.2"}},{"$f":"AD79+8/100","v":{"v":2.2400000000000007,"d":"2.2"}},{"$f":"AE79+8/100","v":{"v":2.3200000000000007,"d":"2.3"}},{"$f":"AF79+8/100","v":{"v":2.400000000000001,"d":"2.4"}},{"$f":"AG79+8/100","v":{"v":2.480000000000001,"d":"2.5"}},{"$f":"AH79+8/100","v":{"v":2.560000000000001,"d":"2.6"}},{"$f":"AI79+8/100","v":{"v":2.640000000000001,"d":"2.6"}},{"$f":"AJ79+8/100","v":{"v":2.720000000000001,"d":"2.7"}},{"$f":"AK79+8/100","v":{"v":2.800000000000001,"d":"2.8"}},{"$f":"AL79+8/100","v":{"v":2.8800000000000012,"d":"2.9"}},{"$f":"AM79+8/100","v":{"v":2.9600000000000013,"d":"3.0"}},{"$f":"AN79+8/100","v":{"v":3.0400000000000014,"d":"3.0"}},{"$f":"AO79+8/100","v":{"v":3.1200000000000014,"d":"3.1"}},{"$f":"AP79+8/100","v":{"v":3.2000000000000015,"d":"3.2"}},{"$f":"AQ79+8/100","v":{"v":3.2800000000000016,"d":"3.3"}},{"$f":"AR79+8/100","v":{"v":3.3600000000000017,"d":"3.4"}},{"$f":"AS79+8/100","v":{"v":3.4400000000000017,"d":"3.4"}},{"$f":"AT79+8/100","v":{"v":3.520000000000002,"d":"3.5"}},{"$f":"AU79+8/100","v":{"v":3.600000000000002,"d":"3.6"}},{"$f":"AV79+8/100","v":{"v":3.680000000000002,"d":"3.7"}},{"$f":"AW79+8/100","v":{"v":3.760000000000002,"d":"3.8"}},{"$f":"AX79+8/100","v":{"v":3.840000000000002,"d":"3.8"}},{"$f":"AY79+8/100","v":{"v":3.920000000000002,"d":"3.9"}},{"$f":"AZ79+8/100","v":{"v":4.000000000000002,"d":"4.0"}},{"$f":"BA79+8/100","v":{"v":4.080000000000002,"d":"4.1"}},{"$f":"BB79+8/100","v":{"v":4.160000000000002,"d":"4.2"}},{"$f":"BC79+8/100","v":{"v":4.240000000000002,"d":"4.2"}},{"$f":"BD79+8/100","v":{"v":4.320000000000002,"d":"4.3"}},{"$f":"BE79+8/100","v":{"v":4.400000000000002,"d":"4.4"}},{"$f":"BF79+8/100","v":{"v":4.480000000000002,"d":"4.5"}},{"$f":"BG79+8/100","v":{"v":4.560000000000002,"d":"4.6"}},{"$f":"BH79+8/100","v":{"v":4.640000000000002,"d":"4.6"}},{"$f":"BI79+8/100","v":{"v":4.720000000000002,"d":"4.7"}},{"$f":"BJ79+8/100","v":{"v":4.8000000000000025,"d":"4.8"}},{"$f":"BK79+8/100","v":{"v":4.880000000000003,"d":"4.9"}},{"$f":"BL79+8/100","v":{"v":4.960000000000003,"d":"5.0"}},{"$f":"BM79+8/100","v":{"v":5.040000000000003,"d":"5.0"}},{"$f":"BN79+8/100","v":{"v":5.120000000000003,"d":"5.1"}},{"$f":"BO79+8/100","v":{"v":5.200000000000003,"d":"5.2"}},{"$f":"BP79+8/100","v":{"v":5.280000000000003,"d":"5.3"}},{"$f":"BQ79+8/100","v":{"v":5.360000000000003,"d":"5.4"}},{"$f":"BR79+8/100","v":{"v":5.440000000000003,"d":"5.4"}},{"$f":"BS79+8/100","v":{"v":5.520000000000003,"d":"5.5"}},{"$f":"BT79+8/100","v":{"v":5.600000000000003,"d":"5.6"}},{"$f":"BU79+8/100","v":{"v":5.680000000000003,"d":"5.7"}},{"$f":"BV79+8/100","v":{"v":5.760000000000003,"d":"5.8"}},{"$f":"BW79+8/100","v":{"v":5.840000000000003,"d":"5.8"}},{"$f":"BX79+8/100","v":{"v":5.9200000000000035,"d":"5.9"}},{"$f":"BY79+8/100","v":{"v":6.0000000000000036,"d":"6.0"}},{"$f":"BZ79+8/100","v":{"v":6.080000000000004,"d":"6.1"}},{"$f":"CA79+8/100","v":{"v":6.160000000000004,"d":"6.2"}},{"$f":"CB79+8/100","v":{"v":6.240000000000004,"d":"6.2"}},{"$f":"CC79+8/100","v":{"v":6.320000000000004,"d":"6.3"}},{"$f":"CD79+8/100","v":{"v":6.400000000000004,"d":"6.4"}},{"$f":"CE79+8/100","v":{"v":6.480000000000004,"d":"6.5"}},{"$f":"CF79+8/100","v":{"v":6.560000000000004,"d":"6.6"}},{"$f":"CG79+8/100","v":{"v":6.640000000000004,"d":"6.6"}},{"$f":"CH79+8/100","v":{"v":6.720000000000004,"d":"6.7"}},{"$f":"CI79+8/100","v":{"v":6.800000000000004,"d":"6.8"}},{"$f":"CJ79+8/100","v":{"v":6.880000000000004,"d":"6.9"}},{"$f":"CK79+8/100","v":{"v":6.960000000000004,"d":"7.0"}},{"$f":"CL79+8/100","v":{"v":7.0400000000000045,"d":"7.0"}},{"$f":"CM79+8/100","v":{"v":7.1200000000000045,"d":"7.1"}},{"$f":"CN79+8/100","v":{"v":7.200000000000005,"d":"7.2"}},{"$f":"CO79+8/100","v":{"v":7.280000000000005,"d":"7.3"}},{"$f":"CP79+8/100","v":{"v":7.360000000000005,"d":"7.4"}},{"$f":"CQ79+8/100","v":{"v":7.440000000000005,"d":"7.4"}},{"$f":"CR79+8/100","v":{"v":7.520000000000005,"d":"7.5"}},{"$f":"CS79+8/100","v":{"v":7.600000000000005,"d":"7.6"}},{"$f":"CT79+8/100","v":{"v":7.680000000000005,"d":"7.7"}},{"$f":"CU79+8/100","v":{"v":7.760000000000005,"d":"7.8"}},{"$f":"CV79+8/100","v":{"v":7.840000000000005,"d":"7.8"}},{"$f":"CW79+8/100","v":{"v":7.920000000000005,"d":"7.9"}},{"$f":"CX79+8/100","v":{"v":8.000000000000005,"d":"8.0"}}]
[null,"Moment",{"$f":"C34+C35","v":{"v":0,"d":"0.00"}},{"$f":"D34+D35","v":{"v":-2.440568,"d":"-2.44"}},{"v":-4.845872,"d":"-4.85"},{"v":-7.215911999999999,"d":"-7.22"},{"v":-9.550688,"d":"-9.55"},{"v":-11.850200000000001,"d":"-11.85"},{"v":-14.114448000000001,"d":"-14.11"},{"v":-16.343432,"d":"-16.34"},{"v":-18.537152,"d":"-18.54"},{"v":-20.695608,"d":"-20.70"},{"v":-22.818799999999996,"d":"-22.82"},{"v":-24.906727999999994,"d":"-24.91"},{"v":-26.959391999999994,"d":"-26.96"},{"v":-28.97439199999999,"d":"-28.97"},{"v":-30.937328,"d":"-30.94"},{"v":-32.8458,"d":"-32.85"},{"v":-34.699808,"d":"-34.70"},{"v":-36.499352,"d":"-36.50"},{"v":-38.244432,"d":"-38.24"},{"v":-39.93504800000001,"d":"-39.94"},{"v":-41.571200000000005,"d":"-41.57"},{"v":-43.152888000000004,"d":"-43.15"},{"v":-44.68011200000001,"d":"-44.68"},{"v":-46.152872,"d":"-46.15"},{"v":-47.571168,"d":"-47.57"},{"v":-48.935,"d":"-48.94"},{"v":-50.24436800000001,"d":"-50.24"},{"v":-51.499272,"d":"-51.50"},{"v":-52.699712000000005,"d":"-52.70"},{"v":-53.84568800000001,"d":"-53.85"},{"v":-54.937200000000004,"d":"-54.94"},{"v":-55.974248,"d":"-55.97"},{"v":-56.956832000000006,"d":"-56.96"},{"v":-57.88495200000001,"d":"-57.88"},{"v":-58.75860800000001,"d":"-58.76"},{"v":-59.57780000000002,"d":"-59.58"},{"v":-60.342528,"d":"-60.34"},{"v":-61.05279200000001,"d":"-61.05"},{"v":-61.54859199999999,"d":"-61.55"},{"v":-61.82992800000001,"d":"-61.83"},{"v":-62.05680000000001,"d":"-62.06"},{"v":-62.22920800000001,"d":"-62.23"},{"v":-62.347151999999994,"d":"-62.35"},{"v":-62.410632,"d":"-62.41"},{"v":-62.419647999999995,"d":"-62.42"},{"v":-62.37419999999999,"d":"-62.37"},{"v":-62.274288,"d":"-62.27"},{"v":-62.11991200000001,"d":"-62.12"},{"v":-61.91107199999999,"d":"-61.91"},{"v":-61.647768,"d":"-61.65"},{"v":-61.329999999999984,"d":"-61.33"},{"v":-60.96736799999999,"d":"-60.97"},{"v":-60.569471999999976,"d":"-60.57"},{"v":-60.136312,"d":"-60.14"},{"v":-59.667888,"d":"-59.67"},{"v":-59.1642,"d":"-59.16"},{"v":-58.625247999999985,"d":"-58.63"},{"v":-58.05103199999998,"d":"-58.05"},{"v":-57.44155199999997,"d":"-57.44"},{"v":-56.796807999999984,"d":"-56.80"},{"v":-56.116799999999984,"d":"-56.12"},{"v":-55.40152799999997,"d":"-55.40"},{"v":-54.65099199999997,"d":"-54.65"},{"v":-53.86519199999998,"d":"-53.87"},{"v":-53.04412799999996,"d":"-53.04"},{"$f":"BP34+BP35","v":{"v":-52.18779999999997,"d":"-52.19"}},{"v":-51.296207999999964,"d":"-51.30"},{"v":-50.36935199999995,"d":"-50.37"},{"v":-49.40723199999995,"d":"-49.41"},{"v":-48.40984799999996,"d":"-48.41"},{"v":-47.377199999999974,"d":"-47.38"},{"v":-46.30928799999997,"d":"-46.31"},{"v":-45.20611199999995,"d":"-45.21"},{"v":-44.06767199999995,"d":"-44.07"},{"v":-42.89396799999996,"d":"-42.89"},{"v":-41.684999999999945,"d":"-41.68"},{"v":-40.440767999999956,"d":"-40.44"},{"v":-39.161271999999926,"d":"-39.16"},{"v":-37.84651199999993,"d":"-37.85"},{"v":-36.49648799999993,"d":"-36.50"},{"v":-35.11119999999994,"d":"-35.11"},{"v":-33.69064799999994,"d":"-33.69"},{"v":-32.23483199999994,"d":"-32.23"},{"v":-30.74375199999992,"d":"-30.74"},{"v":-29.217407999999928,"d":"-29.22"},{"v":-27.655799999999914,"d":"-27.66"},{"v":-26.058927999999916,"d":"-26.06"},{"v":-24.42679199999994,"d":"-24.43"},{"v":-22.759391999999917,"d":"-22.76"},{"v":-21.0567279999999,"d":"-21.06"},{"v":-19.3187999999999,"d":"-19.32"},{"v":-17.545607999999877,"d":"-17.55"},{"v":-15.73715199999989,"d":"-15.74"},{"v":-13.89343199999987,"d":"-13.89"},{"v":-12.01444799999987,"d":"-12.01"},{"v":-10.100199999999877,"d":"-10.10"},{"v":-8.150687999999873,"d":"-8.15"},{"v":-6.165911999999851,"d":"-6.17"},{"v":-4.145871999999871,"d":"-4.15"},{"v":-2.090567999999873,"d":"-2.09"},{"v":1.3500311979441904E-13,"d":"0.00"}]
[null,"Moment (factored)",{"$f":"C34*steel!$K$17+calculations!C35*steel!$K$16","v":{"v":0,"d":"0.00"}},{"$f":"D34*steel!$K$17+calculations!D35*steel!$K$16","v":{"v":-3.5965152,"d":"-3.60"}},{"$f":"E34*steel!$K$17+calculations!E35*steel!$K$16","v":{"v":-7.1411008,"d":"-7.14"}},{"$f":"F34*steel!$K$17+calculations!F35*steel!$K$16","v":{"v":-10.6337568,"d":"-10.63"}},{"$f":"G34*steel!$K$17+calculations!G35*steel!$K$16","v":{"v":-14.0744832,"d":"-14.07"}},{"$f":"H34*steel!$K$17+calculations!H35*steel!$K$16","v":{"v":-17.46328,"d":"-17.46"}},{"$f":"I34*steel!$K$17+calculations!I35*steel!$K$16","v":{"v":-20.8001472,"d":"-20.80"}},{"$f":"J34*steel!$K$17+calculations!J35*steel!$K$16","v":{"v":-24.0850848,"d":"-24.09"}},{"$f":"K34*steel!$K$17+calculations!K35*steel!$K$16","v":{"v":-27.3180928,"d":"-27.32"}},{"$f":"L34*steel!$K$17+calculations!L35*steel!$K$16","v":{"v":-30.4991712,"d":"-30.50"}},{"$f":"M34*steel!$K$17+calculations!M35*steel!$K$16","v":{"v":-33.628319999999995,"d":"-33.63"}},{"$f":"N34*steel!$K$17+calculations!N35*steel!$K$16","v":{"v":-36.70553919999999,"d":"-36.71"}},{"$f":"O34*steel!$K$17+calculations!O35*steel!$K$16","v":{"v":-39.73082879999999,"d":"-39.73"}},{"$f":"P34*steel!$K$17+calculations!P35*steel!$K$16","v":{"v":-42.70066879999999,"d":"-42.70"}},{"$f":"Q34*steel!$K$17+calculations!Q35*steel!$K$16","v":{"v":-45.593939199999994,"d":"-45.59"}},{"$f":"R34*steel!$K$17+calculations!R35*steel!$K$16","v":{"v":-48.40711999999999,"d":"-48.41"}},{"$f":"S34*steel!$K$17+calculations!S35*steel!$K$16","v":{"v":-51.140211199999996,"d":"-51.14"}},{"$f":"T34*steel!$K$17+calculations!T35*steel!$K$16","v":{"v":-53.79321279999999,"d":"-53.79"}},{"$f":"U34*steel!$K$17+calculations!U35*steel!$K$16","v":{"v":-56.36612480000001,"d":"-56.37"}},{"$f":"V34*steel!$K$17+calculations!V35*steel!$K$16","v":{"v":-58.8589472,"d":"-58.86"}},{"$f":"W34*steel!$K$17+calculations!W35*steel!$K$16","v":{"v":-61.27168000000001,"d":"-61.27"}},{"$f":"X34*steel!$K$17+calculations!X35*steel!$K$16","v":{"v":-63.6043232,"d":"-63.60"}},{"$f":"Y34*steel!$K$17+calculations!Y35*steel!$K$16","v":{"v":-65.85687680000001,"d":"-65.86"}},{"$f":"Z34*steel!$K$17+calculations!Z35*steel!$K$16","v":{"v":-68.0293408,"d":"-68.03"}},{"$f":"AA34*steel!$K$17+calculations!AA35*steel!$K$16","v":{"v":-70.12171520000001,"d":"-70.12"}},{"$f":"AB34*steel!$K$17+calculations!AB35*steel!$K$16","v":{"v":-72.134,"d":"-72.13"}},{"$f":"AC34*steel!$K$17+calculations!AC35*steel!$K$16","v":{"v":-74.06619520000001,"d":"-74.07"}},{"$f":"AD34*steel!$K$17+calculations!AD35*steel!$K$16","v":{"v":-75.9183008,"d":"-75.92"}},{"$f":"AE34*steel!$K$17+calculations!AE35*steel!$K$16","v":{"v":-77.6903168,"d":"-77.69"}},{"$f":"AF34*steel!$K$17+calculations!AF35*steel!$K$16","v":{"v":-79.3822432,"d":"-79.38"}},{"$f":"AG34*steel!$K$17+calculations!AG35*steel!$K$16","v":{"v":-80.99408,"d":"-80.99"}},{"$f":"AH34*steel!$K$17+calculations!AH35*steel!$K$16","v":{"v":-82.52582720000001,"d":"-82.53"}},{"$f":"AI34*steel!$K$17+calculations!AI35*steel!$K$16","v":{"v":-83.97748480000001,"d":"-83.98"}},{"$f":"AJ34*steel!$K$17+calculations!AJ35*steel!$K$16","v":{"v":-85.34905280000001,"d":"-85.35"}},{"$f":"AK34*steel!$K$17+calculations!AK35*steel!$K$16","v":{"v":-86.64053120000003,"d":"-86.64"}},{"$f":"AL34*steel!$K$17+calculations!AL35*steel!$K$16","v":{"v":-87.85192000000002,"d":"-87.85"}},{"$f":"AM34*steel!$K$17+calculations!AM35*steel!$K$16","v":{"v":-88.98321920000001,"d":"-88.98"}},{"$f":"AN34*steel!$K$17+calculations!AN35*steel!$K$16","v":{"v":-90.0344288,"d":"-90.03"}},{"$f":"AO34*steel!$K$17+calculations!AO35*steel!$K$16","v":{"v":-90.76554879999999,"d":"-90.77"}},{"$f":"AP34*steel!$K$17+calculations!AP35*steel!$K$16","v":{"v":-91.1765792,"d":"-91.18"}},{"$f":"AQ34*steel!$K$17+calculations!AQ35*steel!$K$16","v":{"v":-91.50752000000003,"d":"-91.51"}},{"$f":"AR34*steel!$K$17+calculations!AR35*steel!$K$16","v":{"v":-91.7583712,"d":"-91.76"}},{"$f":"AS34*steel!$K$17+calculations!AS35*steel!$K$16","v":{"v":-91.92913279999999,"d":"-91.93"}},{"$f":"AT34*steel!$K$17+calculations!AT35*steel!$K$16","v":{"v":-92.0198048,"d":"-92.02"}},{"$f":"AU34*steel!$K$17+calculations!AU35*steel!$K$16","v":{"v":-92.0303872,"d":"-92.03"}},{"$f":"AV34*steel!$K$17+calculations!AV35*steel!$K$16","v":{"v":-91.96087999999997,"d":"-91.96"}},{"$f":"AW34*steel!$K$17+calculations!AW35*steel!$K$16","v":{"v":-91.81128319999999,"d":"-91.81"}},{"$f":"AX34*steel!$K$17+calculations!AX35*steel!$K$16","v":{"v":-91.5815968,"d":"-91.58"}},{"$f":"AY34*steel!$K$17+calculations!AY35*steel!$K$16","v":{"v":-91.27182079999999,"d":"-91.27"}},{"$f":"AZ34*steel!$K$17+calculations!AZ35*steel!$K$16","v":{"v":-90.8819552,"d":"-90.88"}},{"$f":"BA34*steel!$K$17+calculations!BA35*steel!$K$16","v":{"v":-90.41199999999998,"d":"-90.41"}},{"$f":"BB34*steel!$K$17+calculations!BB35*steel!$K$16","v":{"v":-89.87603519999999,"d":"-89.88"}},{"$f":"BC34*steel!$K$17+calculations!BC35*steel!$K$16","v":{"v":-89.28814079999998,"d":"-89.29"}},{"$f":"BD34*steel!$K$17+calculations!BD35*steel!$K$16","v":{"v":-88.64831679999999,"d":"-88.65"}},{"$f":"BE34*steel!$K$17+calculations!BE35*steel!$K$16","v":{"v":-87.9565632,"d":"-87.96"}},{"$f":"BF34*steel!$K$17+calculations!BF35*steel!$K$16","v":{"v":-87.21288,"d":"-87.21"}},{"$f":"BG34*steel!$K$17+calculations!BG35*steel!$K$16","v":{"v":-86.41726719999998,"d":"-86.42"}},{"$f":"BH34*steel!$K$17+calculations!BH35*steel!$K$16","v":{"v":-85.56972479999996,"d":"-85.57"}},{"$f":"BI34*steel!$K$17+calculations!BI35*steel!$K$16","v":{"v":-84.67025279999996,"d":"-84.67"}},{"$f":"BJ34*steel!$K$17+calculations!BJ35*steel!$K$16","v":{"v":-83.71885119999996,"d":"-83.72"}},{"$f":"BK34*steel!$K$17+calculations!BK35*steel!$K$16","v":{"v":-82.71551999999997,"d":"-82.72"}},{"$f":"BL34*steel!$K$17+calculations!BL35*steel!$K$16","v":{"v":-81.66025919999996,"d":"-81.66"}},{"$f":"BM34*steel!$K$17+calculations!BM35*steel!$K$16","v":{"v":-80.55306879999995,"d":"-80.55"}},{"$f":"BN34*steel!$K$17+calculations!BN35*steel!$K$16","v":{"v":-79.39394879999996,"d":"-79.39"}},{"$f":"BO34*steel!$K$17+calculations!BO35*steel!$K$16","v":{"v":-78.18289919999994,"d":"-78.18"}},{"$f":"BP34*steel!$K$17+calculations!BP35*steel!$K$16","v":{"v":-76.91991999999995,"d":"-76.92"}},{"$f":"BQ34*steel!$K$17+calculations!BQ35*steel!$K$16","v":{"v":-75.60501119999995,"d":"-75.61"}},{"$f":"BR34*steel!$K$17+calculations!BR35*steel!$K$16","v":{"v":-74.23817279999993,"d":"-74.24"}},{"$f":"BS34*steel!$K$17+calculations!BS35*steel!$K$16","v":{"v":-72.81940479999993,"d":"-72.82"}},{"$f":"BT34*steel!$K$17+calculations!BT35*steel!$K$16","v":{"v":-71.34870719999994,"d":"-71.35"}},{"$f":"BU34*steel!$K$17+calculations!BU35*steel!$K$16","v":{"v":-69.82607999999996,"d":"-69.83"}},{"$f":"BV34*steel!$K$17+calculations!BV35*steel!$K$16","v":{"v":-68.25152319999995,"d":"-68.25"}},{"$f":"BW34*steel!$K$17+calculations!BW35*steel!$K$16","v":{"v":-66.62503679999992,"d":"-66.63"}},{"$f":"BX34*steel!$K$17+calculations!BX35*steel!$K$16","v":{"v":-64.94662079999992,"d":"-64.95"}},{"$f":"BY34*steel!$K$17+calculations!BY35*steel!$K$16","v":{"v":-63.216275199999934,"d":"-63.22"}},{"$f":"BZ34*steel!$K$17+calculations!BZ35*steel!$K$16","v":{"v":-61.433999999999926,"d":"-61.43"}},{"$f":"CA34*steel!$K$17+calculations!CA35*steel!$K$16","v":{"v":-59.59979519999993,"d":"-59.60"}},{"$f":"CB34*steel!$K$17+calculations!CB35*steel!$K$16","v":{"v":-57.71366079999989,"d":"-57.71"}},{"$f":"CC34*steel!$K$17+calculations!CC35*steel!$K$16","v":{"v":-55.775596799999896,"d":"-55.78"}},{"$f":"CD34*steel!$K$17+calculations!CD35*steel!$K$16","v":{"v":-53.7856031999999,"d":"-53.79"}},{"$f":"CE34*steel!$K$17+calculations!CE35*steel!$K$16","v":{"v":-51.743679999999905,"d":"-51.74"}},{"$f":"CF34*steel!$K$17+calculations!CF35*steel!$K$16","v":{"v":-49.64982719999991,"d":"-49.65"}},{"$f":"CG34*steel!$K$17+calculations!CG35*steel!$K$16","v":{"v":-47.50404479999992,"d":"-47.50"}},{"$f":"CH34*steel!$K$17+calculations!CH35*steel!$K$16","v":{"v":-45.30633279999988,"d":"-45.31"}},{"$f":"CI34*steel!$K$17+calculations!CI35*steel!$K$16","v":{"v":-43.0566911999999,"d":"-43.06"}},{"$f":"CJ34*steel!$K$17+calculations!CJ35*steel!$K$16","v":{"v":-40.75511999999988,"d":"-40.76"}},{"$f":"CK34*steel!$K$17+calculations!CK35*steel!$K$16","v":{"v":-38.40161919999988,"d":"-38.40"}},{"$f":"CL34*steel!$K$17+calculations!CL35*steel!$K$16","v":{"v":-35.99618879999991,"d":"-36.00"}},{"$f":"CM34*steel!$K$17+calculations!CM35*steel!$K$16","v":{"v":-33.53882879999988,"d":"-33.54"}},{"$f":"CN34*steel!$K$17+calculations!CN35*steel!$K$16","v":{"v":-31.02953919999985,"d":"-31.03"}},{"$f":"CO34*steel!$K$17+calculations!CO35*steel!$K$16","v":{"v":-28.46831999999985,"d":"-28.47"}},{"$f":"CP34*steel!$K$17+calculations!CP35*steel!$K$16","v":{"v":-25.855171199999816,"d":"-25.86"}},{"$f":"CQ34*steel!$K$17+calculations!CQ35*steel!$K$16","v":{"v":-23.19009279999984,"d":"-23.19"}},{"$f":"CR34*steel!$K$17+calculations!CR35*steel!$K$16","v":{"v":-20.473084799999807,"d":"-20.47"}},{"$f":"CS34*steel!$K$17+calculations!CS35*steel!$K$16","v":{"v":-17.70414719999981,"d":"-17.70"}},{"$f":"CT34*steel!$K$17+calculations!CT35*steel!$K$16","v":{"v":-14.883279999999818,"d":"-14.88"}},{"$f":"CU34*steel!$K$17+calculations!CU35*steel!$K$16","v":{"v":-12.010483199999811,"d":"-12.01"}},{"$f":"CV34*steel!$K$17+calculations!CV35*steel!$K$16","v":{"v":-9.08575679999978,"d":"-9.09"}},{"$f":"CW34*steel!$K$17+calculations!CW35*steel!$K$16","v":{"v":-6.109100799999808,"d":"-6.11"}},{"$f":"CX34*steel!$K$17+calculations!CX35*steel!$K$16","v":{"v":-3.0805151999998115,"d":"-3.08"}},{"$f":"CY34*steel!$K$17+calculations!CY35*steel!$K$16","v":{"v":1.9966250874858814E-13,"d":"0.00"}}]
[null,"Shear",{"$f":"C36+C37","v":{"v":30.7275,"d":"30.73"}},{"$f":"D36+D37","v":{"v":30.2867,"d":"30.29"}},{"v":29.8459,"d":"29.85"},{"v":29.405099999999997,"d":"29.41"},{"v":28.964299999999998,"d":"28.96"},{"v":28.5235,"d":"28.52"},{"v":28.0827,"d":"28.08"},{"v":27.6419,"d":"27.64"},{"v":27.201099999999997,"d":"27.20"},{"v":26.7603,"d":"26.76"},{"v":26.319499999999998,"d":"26.32"},{"v":25.878700000000002,"d":"25.88"},{"v":25.4379,"d":"25.44"},{"v":24.8771,"d":"24.88"},{"v":24.1963,"d":"24.20"},{"v":23.5155,"d":"23.52"},{"v":22.834699999999998,"d":"22.83"},{"v":22.1539,"d":"22.15"},{"v":21.473099999999995,"d":"21.47"},{"v":20.792299999999997,"d":"20.79"},{"v":20.111499999999996,"d":"20.11"},{"v":19.430699999999995,"d":"19.43"},{"v":18.749899999999993,"d":"18.75"},{"v":18.069099999999995,"d":"18.07"},{"v":17.388299999999994,"d":"17.39"},{"v":16.707499999999996,"d":"16.71"},{"v":16.026699999999995,"d":"16.03"},{"v":15.345899999999995,"d":"15.35"},{"v":14.665099999999995,"d":"14.67"},{"v":13.984299999999992,"d":"13.98"},{"v":13.303499999999993,"d":"13.30"},{"v":12.622699999999991,"d":"12.62"},{"v":11.94189999999999,"d":"11.94"},{"v":11.261099999999992,"d":"11.26"},{"v":10.58029999999999,"d":"10.58"},{"v":9.89949999999999,"d":"9.90"},{"v":9.21869999999999,"d":"9.22"},{"v":8.53789999999999,"d":"8.54"},{"v":3.857099999999988,"d":"3.86"},{"v":3.1762999999999884,"d":"3.18"},{"v":2.495499999999987,"d":"2.50"},{"v":1.8146999999999855,"d":"1.81"},{"v":1.133899999999986,"d":"1.13"},{"v":0.4530999999999845,"d":"0.45"},{"v":-0.2277000000000151,"d":"-0.23"},{"v":-0.9085000000000165,"d":"-0.91"},{"v":-1.5893000000000161,"d":"-1.59"},{"v":-2.2701000000000175,"d":"-2.27"},{"v":-2.950900000000017,"d":"-2.95"},{"v":-3.6317000000000186,"d":"-3.63"},{"v":-4.312500000000016,"d":"-4.31"},{"v":-4.75330000000001,"d":"-4.75"},{"v":-5.194100000000011,"d":"-5.19"},{"v":-5.634900000000011,"d":"-5.63"},{"v":-6.075700000000012,"d":"-6.08"},{"v":-6.516500000000011,"d":"-6.52"},{"v":-6.9573000000000125,"d":"-6.96"},{"v":-7.398100000000014,"d":"-7.40"},{"v":-7.838900000000013,"d":"-7.84"},{"v":-8.279700000000012,"d":"-8.28"},{"v":-8.720500000000012,"d":"-8.72"},{"v":-9.161300000000015,"d":"-9.16"},{"v":-9.602100000000014,"d":"-9.60"},{"v":-10.042900000000014,"d":"-10.04"},{"v":-10.483700000000017,"d":"-10.48"},{"$f":"BP36+BP37","v":{"v":-10.924500000000016,"d":"-10.92"}},{"v":-11.365300000000016,"d":"-11.37"},{"v":-11.806100000000015,"d":"-11.81"},{"v":-12.246900000000018,"d":"-12.25"},{"v":-12.687700000000017,"d":"-12.69"},{"v":-13.128500000000017,"d":"-13.13"},{"v":-13.569300000000016,"d":"-13.57"},{"v":-14.010100000000019,"d":"-14.01"},{"v":-14.450900000000019,"d":"-14.45"},{"v":-14.891700000000018,"d":"-14.89"},{"v":-15.332500000000021,"d":"-15.33"},{"v":-15.77330000000002,"d":"-15.77"},{"v":-16.21410000000002,"d":"-16.21"},{"v":-16.65490000000002,"d":"-16.65"},{"v":-17.095700000000022,"d":"-17.10"},{"v":-17.53650000000002,"d":"-17.54"},{"v":-17.97730000000002,"d":"-17.98"},{"v":-18.41810000000002,"d":"-18.42"},{"v":-18.858900000000023,"d":"-18.86"},{"v":-19.299700000000023,"d":"-19.30"},{"v":-19.740500000000022,"d":"-19.74"},{"v":-20.18130000000002,"d":"-20.18"},{"v":-20.622100000000025,"d":"-20.62"},{"v":-21.062900000000024,"d":"-21.06"},{"v":-21.503700000000023,"d":"-21.50"},{"v":-21.944500000000026,"d":"-21.94"},{"v":-22.385300000000026,"d":"-22.39"},{"v":-22.826100000000025,"d":"-22.83"},{"v":-23.266900000000025,"d":"-23.27"},{"v":-23.707700000000028,"d":"-23.71"},{"v":-24.148500000000027,"d":"-24.15"},{"v":-24.589300000000026,"d":"-24.59"},{"v":-25.030100000000026,"d":"-25.03"},{"v":-25.47090000000003,"d":"-25.47"},{"v":-25.911700000000028,"d":"-25.91"},{"v":-26.352500000000028,"d":"-26.35"}]
[null,"Shear (factored)",{"$f":"C36*steel!$K$17+calculations!C37*steel!$K$16","v":{"v":45.281,"d":"45.28"}},{"$f":"D36*steel!$K$17+calculations!D37*steel!$K$16","v":{"v":44.631879999999995,"d":"44.63"}},{"$f":"E36*steel!$K$17+calculations!E37*steel!$K$16","v":{"v":43.98276,"d":"43.98"}},{"$f":"F36*steel!$K$17+calculations!F37*steel!$K$16","v":{"v":43.333639999999995,"d":"43.33"}},{"$f":"G36*steel!$K$17+calculations!G37*steel!$K$16","v":{"v":42.68451999999999,"d":"42.68"}},{"$f":"H36*steel!$K$17+calculations!H37*steel!$K$16","v":{"v":42.035399999999996,"d":"42.04"}},{"$f":"I36*steel!$K$17+calculations!I37*steel!$K$16","v":{"v":41.38628,"d":"41.39"}},{"$f":"J36*steel!$K$17+calculations!J37*steel!$K$16","v":{"v":40.73716,"d":"40.74"}},{"$f":"K36*steel!$K$17+calculations!K37*steel!$K$16","v":{"v":40.08804,"d":"40.09"}},{"$f":"L36*steel!$K$17+calculations!L37*steel!$K$16","v":{"v":39.438919999999996,"d":"39.44"}},{"$f":"M36*steel!$K$17+calculations!M37*steel!$K$16","v":{"v":38.7898,"d":"38.79"}},{"$f":"N36*steel!$K$17+calculations!N37*steel!$K$16","v":{"v":38.140679999999996,"d":"38.14"}},{"$f":"O36*steel!$K$17+calculations!O37*steel!$K$16","v":{"v":37.49156,"d":"37.49"}},{"$f":"P36*steel!$K$17+calculations!P37*steel!$K$16","v":{"v":36.66644,"d":"36.67"}},{"$f":"Q36*steel!$K$17+calculations!Q37*steel!$K$16","v":{"v":35.66532,"d":"35.67"}},{"$f":"R36*steel!$K$17+calculations!R37*steel!$K$16","v":{"v":34.664199999999994,"d":"34.66"}},{"$f":"S36*steel!$K$17+calculations!S37*steel!$K$16","v":{"v":33.66308,"d":"33.66"}},{"$f":"T36*steel!$K$17+calculations!T37*steel!$K$16","v":{"v":32.66195999999999,"d":"32.66"}},{"$f":"U36*steel!$K$17+calculations!U37*steel!$K$16","v":{"v":31.660839999999993,"d":"31.66"}},{"$f":"V36*steel!$K$17+calculations!V37*steel!$K$16","v":{"v":30.659719999999993,"d":"30.66"}},{"$f":"W36*steel!$K$17+calculations!W37*steel!$K$16","v":{"v":29.658599999999993,"d":"29.66"}},{"$f":"X36*steel!$K$17+calculations!X37*steel!$K$16","v":{"v":28.657479999999993,"d":"28.66"}},{"$f":"Y36*steel!$K$17+calculations!Y37*steel!$K$16","v":{"v":27.656359999999992,"d":"27.66"}},{"$f":"Z36*steel!$K$17+calculations!Z37*steel!$K$16","v":{"v":26.655239999999992,"d":"26.66"}},{"$f":"AA36*steel!$K$17+calculations!AA37*steel!$K$16","v":{"v":25.65411999999999,"d":"25.65"}},{"$f":"AB36*steel!$K$17+calculations!AB37*steel!$K$16","v":{"v":24.65299999999999,"d":"24.65"}},{"$f":"AC36*steel!$K$17+calculations!AC37*steel!$K$16","v":{"v":23.65187999999999,"d":"23.65"}},{"$f":"AD36*steel!$K$17+calculations!AD37*steel!$K$16","v":{"v":22.65075999999999,"d":"22.65"}},{"$f":"AE36*steel!$K$17+calculations!AE37*steel!$K$16","v":{"v":21.64963999999999,"d":"21.65"}},{"$f":"AF36*steel!$K$17+calculations!AF37*steel!$K$16","v":{"v":20.64851999999999,"d":"20.65"}},{"$f":"AG36*steel!$K$17+calculations!AG37*steel!$K$16","v":{"v":19.64739999999999,"d":"19.65"}},{"$f":"AH36*steel!$K$17+calculations!AH37*steel!$K$16","v":{"v":18.64627999999999,"d":"18.65"}},{"$f":"AI36*steel!$K$17+calculations!AI37*steel!$K$16","v":{"v":17.645159999999986,"d":"17.65"}},{"$f":"AJ36*steel!$K$17+calculations!AJ37*steel!$K$16","v":{"v":16.644039999999986,"d":"16.64"}},{"$f":"AK36*steel!$K$17+calculations!AK37*steel!$K$16","v":{"v":15.642919999999984,"d":"15.64"}},{"$f":"AL36*steel!$K$17+calculations!AL37*steel!$K$16","v":{"v":14.641799999999986,"d":"14.64"}},{"$f":"AM36*steel!$K$17+calculations!AM37*steel!$K$16","v":{"v":13.640679999999984,"d":"13.64"}},{"$f":"AN36*steel!$K$17+calculations!AN37*steel!$K$16","v":{"v":12.639559999999983,"d":"12.64"}},{"$f":"AO36*steel!$K$17+calculations!AO37*steel!$K$16","v":{"v":5.638439999999982,"d":"5.64"}},{"$f":"AP36*steel!$K$17+calculations!AP37*steel!$K$16","v":{"v":4.637319999999983,"d":"4.64"}},{"$f":"AQ36*steel!$K$17+calculations!AQ37*steel!$K$16","v":{"v":3.636199999999981,"d":"3.64"}},{"$f":"AR36*steel!$K$17+calculations!AR37*steel!$K$16","v":{"v":2.635079999999979,"d":"2.64"}},{"$f":"AS36*steel!$K$17+calculations!AS37*steel!$K$16","v":{"v":1.6339599999999792,"d":"1.63"}},{"$f":"AT36*steel!$K$17+calculations!AT37*steel!$K$16","v":{"v":0.6328399999999773,"d":"0.63"}},{"$f":"AU36*steel!$K$17+calculations!AU37*steel!$K$16","v":{"v":-0.36828000000002226,"d":"-0.37"}},{"$f":"AV36*steel!$K$17+calculations!AV37*steel!$K$16","v":{"v":-1.3694000000000242,"d":"-1.37"}},{"$f":"AW36*steel!$K$17+calculations!AW37*steel!$K$16","v":{"v":-2.370520000000024,"d":"-2.37"}},{"$f":"AX36*steel!$K$17+calculations!AX37*steel!$K$16","v":{"v":-3.371640000000026,"d":"-3.37"}},{"$f":"AY36*steel!$K$17+calculations!AY37*steel!$K$16","v":{"v":-4.372760000000025,"d":"-4.37"}},{"$f":"AZ36*steel!$K$17+calculations!AZ37*steel!$K$16","v":{"v":-5.373880000000027,"d":"-5.37"}},{"$f":"BA36*steel!$K$17+calculations!BA37*steel!$K$16","v":{"v":-6.375000000000023,"d":"-6.38"}},{"$f":"BB36*steel!$K$17+calculations!BB37*steel!$K$16","v":{"v":-7.024120000000014,"d":"-7.02"}},{"$f":"BC36*steel!$K$17+calculations!BC37*steel!$K$16","v":{"v":-7.673240000000016,"d":"-7.67"}},{"$f":"BD36*steel!$K$17+calculations!BD37*steel!$K$16","v":{"v":-8.322360000000016,"d":"-8.32"}},{"$f":"BE36*steel!$K$17+calculations!BE37*steel!$K$16","v":{"v":-8.971480000000017,"d":"-8.97"}},{"$f":"BF36*steel!$K$17+calculations!BF37*steel!$K$16","v":{"v":-9.620600000000017,"d":"-9.62"}},{"$f":"BG36*steel!$K$17+calculations!BG37*steel!$K$16","v":{"v":-10.269720000000017,"d":"-10.27"}},{"$f":"BH36*steel!$K$17+calculations!BH37*steel!$K$16","v":{"v":-10.91884000000002,"d":"-10.92"}},{"$f":"BI36*steel!$K$17+calculations!BI37*steel!$K$16","v":{"v":-11.567960000000019,"d":"-11.57"}},{"$f":"BJ36*steel!$K$17+calculations!BJ37*steel!$K$16","v":{"v":-12.217080000000019,"d":"-12.22"}},{"$f":"BK36*steel!$K$17+calculations!BK37*steel!$K$16","v":{"v":-12.866200000000017,"d":"-12.87"}},{"$f":"BL36*steel!$K$17+calculations!BL37*steel!$K$16","v":{"v":-13.515320000000022,"d":"-13.52"}},{"$f":"BM36*steel!$K$17+calculations!BM37*steel!$K$16","v":{"v":-14.164440000000022,"d":"-14.16"}},{"$f":"BN36*steel!$K$17+calculations!BN37*steel!$K$16","v":{"v":-14.81356000000002,"d":"-14.81"}},{"$f":"BO36*steel!$K$17+calculations!BO37*steel!$K$16","v":{"v":-15.462680000000024,"d":"-15.46"}},{"$f":"BP36*steel!$K$17+calculations!BP37*steel!$K$16","v":{"v":-16.111800000000024,"d":"-16.11"}},{"$f":"BQ36*steel!$K$17+calculations!BQ37*steel!$K$16","v":{"v":-16.760920000000024,"d":"-16.76"}},{"$f":"BR36*steel!$K$17+calculations!BR37*steel!$K$16","v":{"v":-17.410040000000023,"d":"-17.41"}},{"$f":"BS36*steel!$K$17+calculations!BS37*steel!$K$16","v":{"v":-18.059160000000027,"d":"-18.06"}},{"$f":"BT36*steel!$K$17+calculations!BT37*steel!$K$16","v":{"v":-18.708280000000023,"d":"-18.71"}},{"$f":"BU36*steel!$K$17+calculations!BU37*steel!$K$16","v":{"v":-19.357400000000027,"d":"-19.36"}},{"$f":"BV36*steel!$K$17+calculations!BV37*steel!$K$16","v":{"v":-20.006520000000023,"d":"-20.01"}},{"$f":"BW36*steel!$K$17+calculations!BW37*steel!$K$16","v":{"v":-20.655640000000027,"d":"-20.66"}},{"$f":"BX36*steel!$K$17+calculations!BX37*steel!$K$16","v":{"v":-21.304760000000027,"d":"-21.30"}},{"$f":"BY36*steel!$K$17+calculations!BY37*steel!$K$16","v":{"v":-21.953880000000026,"d":"-21.95"}},{"$f":"BZ36*steel!$K$17+calculations!BZ37*steel!$K$16","v":{"v":-22.60300000000003,"d":"-22.60"}},{"$f":"CA36*steel!$K$17+calculations!CA37*steel!$K$16","v":{"v":-23.25212000000003,"d":"-23.25"}},{"$f":"CB36*steel!$K$17+calculations!CB37*steel!$K$16","v":{"v":-23.90124000000003,"d":"-23.90"}},{"$f":"CC36*steel!$K$17+calculations!CC37*steel!$K$16","v":{"v":-24.550360000000026,"d":"-24.55"}},{"$f":"CD36*steel!$K$17+calculations!CD37*steel!$K$16","v":{"v":-25.19948000000003,"d":"-25.20"}},{"$f":"CE36*steel!$K$17+calculations!CE37*steel!$K$16","v":{"v":-25.848600000000033,"d":"-25.85"}},{"$f":"CF36*steel!$K$17+calculations!CF37*steel!$K$16","v":{"v":-26.49772000000003,"d":"-26.50"}},{"$f":"CG36*steel!$K$17+calculations!CG37*steel!$K$16","v":{"v":-27.14684000000003,"d":"-27.15"}},{"$f":"CH36*steel!$K$17+calculations!CH37*steel!$K$16","v":{"v":-27.795960000000033,"d":"-27.80"}},{"$f":"CI36*steel!$K$17+calculations!CI37*steel!$K$16","v":{"v":-28.445080000000033,"d":"-28.45"}},{"$f":"CJ36*steel!$K$17+calculations!CJ37*steel!$K$16","v":{"v":-29.094200000000033,"d":"-29.09"}},{"$f":"CK36*steel!$K$17+calculations!CK37*steel!$K$16","v":{"v":-29.743320000000033,"d":"-29.74"}},{"$f":"CL36*steel!$K$17+calculations!CL37*steel!$K$16","v":{"v":-30.392440000000036,"d":"-30.39"}},{"$f":"CM36*steel!$K$17+calculations!CM37*steel!$K$16","v":{"v":-31.041560000000036,"d":"-31.04"}},{"$f":"CN36*steel!$K$17+calculations!CN37*steel!$K$16","v":{"v":-31.690680000000032,"d":"-31.69"}},{"$f":"CO36*steel!$K$17+calculations!CO37*steel!$K$16","v":{"v":-32.33980000000004,"d":"-32.34"}},{"$f":"CP36*steel!$K$17+calculations!CP37*steel!$K$16","v":{"v":-32.988920000000036,"d":"-32.99"}},{"$f":"CQ36*steel!$K$17+calculations!CQ37*steel!$K$16","v":{"v":-33.63804000000003,"d":"-33.64"}},{"$f":"CR36*steel!$K$17+calculations!CR37*steel!$K$16","v":{"v":-34.287160000000036,"d":"-34.29"}},{"$f":"CS36*steel!$K$17+calculations!CS37*steel!$K$16","v":{"v":-34.93628000000004,"d":"-34.94"}},{"$f":"CT36*steel!$K$17+calculations!CT37*steel!$K$16","v":{"v":-35.585400000000035,"d":"-35.59"}},{"$f":"CU36*steel!$K$17+calculations!CU37*steel!$K$16","v":{"v":-36.23452000000004,"d":"-36.23"}},{"$f":"CV36*steel!$K$17+calculations!CV37*steel!$K$16","v":{"v":-36.88364000000004,"d":"-36.88"}},{"$f":"CW36*steel!$K$17+calculations!CW37*steel!$K$16","v":{"v":-37.53276000000004,"d":"-37.53"}},{"$f":"CX36*steel!$K$17+calculations!CX37*steel!$K$16","v":{"v":-38.18188000000004,"d":"-38.18"}},{"$f":"CY36*steel!$K$17+calculations!CY37*steel!$K$16","v":{"v":-38.83100000000004,"d":"-38.83"}}]
[null,"Deflection LL",{"$f":"(-SUM(C63:C71))/(E*Ix/100000)","v":{"v":0,"d":"0.00"}},{"v":-0.17051103315458713,"d":"-0.17"},{"v":-0.34082333898402867,"d":"-0.34"},{"v":-0.5107407880989456,"d":"-0.51"},{"v":-0.6800700852217043,"d":"-0.68"},{"v":-0.8486207691864166,"d":"-0.85"},{"v":-1.0162052129389396,"d":"-1.02"},{"v":-1.1826386235368758,"d":"-1.18"},{"v":-1.3477390421495727,"d":"-1.35"},{"v":-1.5113273440581236,"d":"-1.51"},{"v":-1.6732272386553677,"d":"-1.67"},{"v":-1.8332652694458886,"d":"-1.83"},{"v":-1.9912708140460158,"d":"-1.99"},{"v":-2.1470760878740736,"d":"-2.15"},{"v":-2.300516424609356,"d":"-2.30"},{"v":-2.451431124949551,"d":"-2.45"},{"v":-2.5996637370697155,"d":"-2.60"},{"v":-2.745062060312523,"d":"-2.75"},{"v":-2.887478145188265,"d":"-2.89"},{"v":-3.026768293374854,"d":"-3.03"},{"v":-3.1627930577178174,"d":"-3.16"},{"v":-3.2954172422303007,"d":"-3.30"},{"v":-3.42450990209307,"d":"-3.42"},{"v":-3.549944343654507,"d":"-3.55"},{"v":-3.6715981244306137,"d":"-3.67"},{"v":-3.7893530531050064,"d":"-3.79"},{"v":-3.9030951895289245,"d":"-3.90"},{"v":-4.012714844721221,"d":"-4.01"},{"v":-4.11810658086837,"d":"-4.12"},{"v":-4.219169211324462,"d":"-4.22"},{"v":-4.315805800611207,"d":"-4.32"},{"v":-4.407923664417931,"d":"-4.41"},{"$f":"(-SUM(AI63:AI71))/(E*Ix/100000)","v":{"v":-4.495434369601578,"d":"-4.50"}},{"v":-4.578253734186713,"d":"-4.58"},{"v":-4.6563018273655175,"d":"-4.66"},{"v":-4.729502969497791,"d":"-4.73"},{"v":-4.797785732110948,"d":"-4.80"},{"v":-4.861082937900028,"d":"-4.86"},{"v":-4.919332398777616,"d":"-4.92"},{"v":-4.972493152972392,"d":"-4.97"},{"v":-5.02054546502913,"d":"-5.02"},{"v":-5.063474588710153,"d":"-5.06"},{"v":-5.101270028945407,"d":"-5.10"},{"v":-5.133925541832451,"d":"-5.13"},{"v":-5.161439134636464,"d":"-5.16"},{"v":-5.183813065790244,"d":"-5.18"},{"v":-5.201053844894205,"d":"-5.20"},{"v":-5.213172232716382,"d":"-5.21"},{"v":-5.220183241192425,"d":"-5.22"},{"v":-5.222106133425602,"d":"-5.22"},{"v":-5.2189644236868045,"d":"-5.22"},{"v":-5.210785818370537,"d":"-5.21"},{"v":-5.197601566510999,"d":"-5.20"},{"v":-5.179445810298116,"d":"-5.18"},{"v":-5.156355526033571,"d":"-5.16"},{"v":-5.128370524130786,"d":"-5.13"},{"v":-5.095533449114931,"d":"-5.10"},{"v":-5.057889779622917,"d":"-5.06"},{"v":-5.015487828403403,"d":"-5.02"},{"v":-4.9683787423167995,"d":"-4.97"},{"v":-4.916616502335251,"d":"-4.92"},{"v":-4.8602579235426555,"d":"-4.86"},{"v":-4.799362655134651,"d":"-4.80"},{"v":-4.733993180418626,"d":"-4.73"},{"$f":"(-SUM(BO63:BO71))/(E*Ix/100000)","v":{"v":-4.664214816813716,"d":"-4.66"}},{"v":-4.59009571585079,"d":"-4.59"},{"v":-4.511706863172478,"d":"-4.51"},{"v":-4.4291220785331396,"d":"-4.43"},{"v":-4.342418015798896,"d":"-4.34"},{"v":-4.251674162947602,"d":"-4.25"},{"v":-4.156972842068861,"d":"-4.16"},{"v":-4.058399209364025,"d":"-4.06"},{"v":-3.956041255146184,"d":"-3.96"},{"v":-3.849989803840181,"d":"-3.85"},{"v":-3.7403385139826004,"d":"-3.74"},{"v":-3.6271838782217767,"d":"-3.63"},{"v":-3.5106252233177795,"d":"-3.51"},{"v":-3.3907647101424327,"d":"-3.39"},{"v":-3.2677073336793074,"d":"-3.27"},{"v":-3.141560923023714,"d":"-3.14"},{"v":-3.012436141382707,"d":"-3.01"},{"v":-2.8804464860750914,"d":"-2.88"},{"v":-2.745708288531411,"d":"-2.75"},{"v":-2.6083407142939663,"d":"-2.61"},{"v":-2.468465763016791,"d":"-2.47"},{"v":-2.326208268465678,"d":"-2.33"},{"v":-2.181695898518151,"d":"-2.18"},{"v":-2.035059155163482,"d":"-2.04"},{"v":-1.8864313745027004,"d":"-1.89"},{"v":-1.7359487267485554,"d":"-1.74"},{"v":-1.5837502162255783,"d":"-1.58"},{"v":-1.4299776813700196,"d":"-1.43"},{"v":-1.2747757947298772,"d":"-1.27"},{"v":-1.1182920629649047,"d":"-1.12"},{"v":-0.9606768268465798,"d":"-0.96"},{"v":-0.8020832612581619,"d":"-0.80"},{"v":-0.6426673751946202,"d":"-0.64"},{"v":-0.4825880117626841,"d":"-0.48"},{"v":-0.3220068481808403,"d":"-0.32"},{"v":-0.16108839577929596,"d":"-0.16"},{"v":0,"d":"0.00"}]
[null,"Deflection LL + DL",{"$f":"(-SUM(C48:C56)-SUM(C63:C71))/(E*Ix/100000)","v":{"v":0,"d":"0.00"}},{"v":-0.46012353077552975,"d":"-0.46"},{"v":-0.9197073339007105,"d":"-0.92"},{"v":-1.3782188390382304,"d":"-1.38"},{"v":-1.8351332838286367,"d":"-1.84"},{"v":-2.2899337138903335,"d":"-2.29"},{"v":-2.7421109828195855,"d":"-2.74"},{"v":-3.191163752190514,"d":"-3.19"},{"v":-3.6365984915551,"d":"-3.64"},{"v":-4.077929478443182,"d":"-4.08"},{"v":-4.514678798362458,"d":"-4.51"},{"v":-4.946376344798484,"d":"-4.95"},{"v":-5.3725598192146755,"d":"-5.37"},{"v":-5.792774742123054,"d":"-5.79"},{"v":-6.2065752944611745,"d":"-6.21"},{"v":-6.613526863864393,"d":"-6.61"},{"v":-7.013206886042795,"d":"-7.01"},{"v":-7.405204855851941,"d":"-7.41"},{"v":-7.789122327292868,"d":"-7.79"},{"v":-8.164572913512094,"d":"-8.16"},{"v":-8.531182286801606,"d":"-8.53"},{"v":-8.888588178598875,"d":"-8.89"},{"v":-9.236440379486842,"d":"-9.24"},{"v":-9.574400739193928,"d":"-9.57"},{"v":-9.902143166594033,"d":"-9.90"},{"v":-10.219353629706527,"d":"-10.22"},{"v":-10.525730155696264,"d":"-10.53"},{"v":-10.82098283087357,"d":"-10.82"},{"v":-11.104833800694248,"d":"-11.10"},{"v":-11.377017269759577,"d":"-11.38"},{"v":-11.637279501816316,"d":"-11.64"},{"v":-11.885378819756697,"d":"-11.89"},{"$f":"(-SUM(AI48:AI56)-SUM(AI63:AI71))/(E*Ix/100000)","v":{"v":-12.121085605618429,"d":"-12.12"}},{"v":-12.344182300584698,"d":"-12.34"},{"v":-12.554463404984167,"d":"-12.55"},{"v":-12.751735478290978,"d":"-12.75"},{"v":-12.935817139124742,"d":"-12.94"},{"v":-13.10653906525056,"d":"-13.11"},{"v":-13.26374546967886,"d":"-13.26"},{"v":-13.407326574862509,"d":"-13.41"},{"v":-13.537218612696794,"d":"-13.54"},{"v":-13.653371350322349,"d":"-13.65"},{"v":-13.755746614025282,"d":"-13.76"},{"v":-13.844318289237187,"d":"-13.84"},{"v":-13.919072320535117,"d":"-13.92"},{"v":-13.980006711641614,"d":"-13.98"},{"v":-14.027131525424698,"d":"-14.03"},{"v":-14.060468883897858,"d":"-14.06"},{"v":-14.08005296822006,"d":"-14.08"},{"v":-14.08593001869576,"d":"-14.09"},{"v":-14.078158334774871,"d":"-14.08"},{"v":-14.056808097920808,"d":"-14.06"},{"v":-14.021959423158656,"d":"-14.02"},{"v":-13.973700410623337,"d":"-13.97"},{"v":-13.912126968427637,"d":"-13.91"},{"v":-13.837342812662204,"d":"-13.84"},{"v":-13.749459467395525,"d":"-13.75"},{"v":-13.648596264673966,"d":"-13.65"},{"v":-13.534880344521742,"d":"-13.53"},{"v":-13.408446654940935,"d":"-13.41"},{"v":-13.269437951911467,"d":"-13.27"},{"v":-13.118004799391148,"d":"-13.12"},{"v":-12.95430556931561,"d":"-12.95"},{"v":-12.778506441598372,"d":"-12.78"},{"$f":"(-SUM(BO48:BO56)-SUM(BO63:BO71))/(E*Ix/100000)","v":{"v":-12.590781404130807,"d":"-12.59"}},{"v":-12.391312252782141,"d":"-12.39"},{"v":-12.180288591399448,"d":"-12.18"},{"v":-11.957907831807681,"d":"-11.96"},{"v":-11.724375193809639,"d":"-11.72"},{"v":-11.479903705185992,"d":"-11.48"},{"v":-11.224714201695244,"d":"-11.22"},{"v":-10.959035327073783,"d":"-10.96"},{"v":-10.683103533035839,"d":"-10.68"},{"v":-10.397163079273518,"d":"-10.40"},{"v":-10.101466033456761,"d":"-10.10"},{"v":-9.796272271233384,"d":"-9.80"},{"v":-9.48184947622906,"d":"-9.48"},{"v":-9.158473140047315,"d":"-9.16"},{"v":-8.826426562269534,"d":"-8.83"},{"v":-8.486000850454973,"d":"-8.49"},{"v":-8.13749492014073,"d":"-8.14"},{"v":-7.781215494841763,"d":"-7.78"},{"v":-7.417477106050891,"d":"-7.42"},{"v":-7.04660209323881,"d":"-7.05"},{"v":-6.6689206038540325,"d":"-6.67"},{"v":-6.284770593322988,"d":"-6.28"},{"v":-5.894497825049915,"d":"-5.89"},{"v":-5.498455870416914,"d":"-5.50"},{"v":-5.097006108783989,"d":"-5.10"},{"v":-4.690517727488928,"d":"-4.69"},{"v":-4.279367721847463,"d":"-4.28"},{"v":-3.8639408951531253,"d":"-3.86"},{"v":-3.4446298586773154,"d":"-3.44"},{"v":-3.021835031669307,"d":"-3.02"},{"v":-2.5959646413562,"d":"-2.60"},{"v":-2.167434722943005,"d":"-2.17"},{"v":-1.7366691196125656,"d":"-1.74"},{"v":-1.3040994825255448,"d":"-1.30"},{"v":-0.8701652708205468,"d":"-0.87"},{"v":-0.4353137516139486,"d":"-0.44"},{"v":0,"d":"0.00"}]
[null,"Deflection diagram",{"$f":"IF(steel!$AH$64=0,calculations!C84,calculations!C85)","v":{"v":0,"d":"0.00"}},{"$f":"IF(steel!$AH$64=0,calculations!D84,calculations!D85)","v":{"v":-0.46012353077552975,"d":"-0.46"}},{"$f":"IF(steel!$AH$64=0,calculations!E84,calculations!E85)","v":{"v":-0.9197073339007105,"d":"-0.92"}},{"$f":"IF(steel!$AH$64=0,calculations!F84,calculations!F85)","v":{"v":-1.3782188390382304,"d":"-1.38"}},{"$f":"IF(steel!$AH$64=0,calculations!G84,calculations!G85)","v":{"v":-1.8351332838286367,"d":"-1.84"}},{"$f":"IF(steel!$AH$64=0,calculations!H84,calculations!H85)","v":{"v":-2.2899337138903335,"d":"-2.29"}},{"$f":"IF(steel!$AH$64=0,calculations!I84,calculations!I85)","v":{"v":-2.7421109828195855,"d":"-2.74"}},{"$f":"IF(steel!$AH$64=0,calculations!J84,calculations!J85)","v":{"v":-3.191163752190514,"d":"-3.19"}},{"$f":"IF(steel!$AH$64=0,calculations!K84,calculations!K85)","v":{"v":-3.6365984915551,"d":"-3.64"}},{"$f":"IF(steel!$AH$64=0,calculations!L84,calculations!L85)","v":{"v":-4.077929478443182,"d":"-4.08"}},{"$f":"IF(steel!$AH$64=0,calculations!M84,calculations!M85)","v":{"v":-4.514678798362458,"d":"-4.51"}},{"$f":"IF(steel!$AH$64=0,calculations!N84,calculations!N85)","v":{"v":-4.946376344798484,"d":"-4.95"}},{"$f":"IF(steel!$AH$64=0,calculations!O84,calculations!O85)","v":{"v":-5.3725598192146755,"d":"-5.37"}},{"$f":"IF(steel!$AH$64=0,calculations!P84,calculations!P85)","v":{"v":-5.792774742123054,"d":"-5.79"}},{"$f":"IF(steel!$AH$64=0,calculations!Q84,calculations!Q85)","v":{"v":-6.2065752944611745,"d":"-6.21"}},{"$f":"IF(steel!$AH$64=0,calculations!R84,calculations!R85)","v":{"v":-6.613526863864393,"d":"-6.61"}},{"$f":"IF(steel!$AH$64=0,calculations!S84,calculations!S85)","v":{"v":-7.013206886042795,"d":"-7.01"}},{"$f":"IF(steel!$AH$64=0,calculations!T84,calculations!T85)","v":{"v":-7.405204855851941,"d":"-7.41"}},{"$f":"IF(steel!$AH$64=0,calculations!U84,calculations!U85)","v":{"v":-7.789122327292868,"d":"-7.79"}},{"$f":"IF(steel!$AH$64=0,calculations!V84,calculations!V85)","v":{"v":-8.164572913512094,"d":"-8.16"}},{"$f":"IF(steel!$AH$64=0,calculations!W84,calculations!W85)","v":{"v":-8.531182286801606,"d":"-8.53"}},{"$f":"IF(steel!$AH$64=0,calculations!X84,calculations!X85)","v":{"v":-8.888588178598875,"d":"-8.89"}},{"$f":"IF(steel!$AH$64=0,calculations!Y84,calculations!Y85)","v":{"v":-9.236440379486842,"d":"-9.24"}},{"$f":"IF(steel!$AH$64=0,calculations!Z84,calculations!Z85)","v":{"v":-9.574400739193928,"d":"-9.57"}},{"$f":"IF(steel!$AH$64=0,calculations!AA84,calculations!AA85)","v":{"v":-9.902143166594033,"d":"-9.90"}},{"$f":"IF(steel!$AH$64=0,calculations!AB84,calculations!AB85)","v":{"v":-10.219353629706527,"d":"-10.22"}},{"$f":"IF(steel!$AH$64=0,calculations!AC84,calculations!AC85)","v":{"v":-10.525730155696264,"d":"-10.53"}},{"$f":"IF(steel!$AH$64=0,calculations!AD84,calculations!AD85)","v":{"v":-10.82098283087357,"d":"-10.82"}},{"$f":"IF(steel!$AH$64=0,calculations!AE84,calculations!AE85)","v":{"v":-11.104833800694248,"d":"-11.10"}},{"$f":"IF(steel!$AH$64=0,calculations!AF84,calculations!AF85)","v":{"v":-11.377017269759577,"d":"-11.38"}},{"$f":"IF(steel!$AH$64=0,calculations!AG84,calculations!AG85)","v":{"v":-11.637279501816316,"d":"-11.64"}},{"$f":"IF(steel!$AH$64=0,calculations!AH84,calculations!AH85)","v":{"v":-11.885378819756697,"d":"-11.89"}},{"$f":"IF(steel!$AH$64=0,calculations!AI84,calculations!AI85)","v":{"v":-12.121085605618429,"d":"-12.12"}},{"$f":"IF(steel!$AH$64=0,calculations!AJ84,calculations!AJ85)","v":{"v":-12.344182300584698,"d":"-12.34"}},{"$f":"IF(steel!$AH$64=0,calculations!AK84,calculations!AK85)","v":{"v":-12.554463404984167,"d":"-12.55"}},{"$f":"IF(steel!$AH$64=0,calculations!AL84,calculations!AL85)","v":{"v":-12.751735478290978,"d":"-12.75"}},{"$f":"IF(steel!$AH$64=0,calculations!AM84,calculations!AM85)","v":{"v":-12.935817139124742,"d":"-12.94"}},{"$f":"IF(steel!$AH$64=0,calculations!AN84,calculations!AN85)","v":{"v":-13.10653906525056,"d":"-13.11"}},{"$f":"IF(steel!$AH$64=0,calculations!AO84,calculations!AO85)","v":{"v":-13.26374546967886,"d":"-13.26"}},{"$f":"IF(steel!$AH$64=0,calculations!AP84,calculations!AP85)","v":{"v":-13.407326574862509,"d":"-13.41"}},{"$f":"IF(steel!$AH$64=0,calculations!AQ84,calculations!AQ85)","v":{"v":-13.537218612696794,"d":"-13.54"}},{"$f":"IF(steel!$AH$64=0,calculations!AR84,calculations!AR85)","v":{"v":-13.653371350322349,"d":"-13.65"}},{"$f":"IF(steel!$AH$64=0,calculations!AS84,calculations!AS85)","v":{"v":-13.755746614025282,"d":"-13.76"}},{"$f":"IF(steel!$AH$64=0,calculations!AT84,calculations!AT85)","v":{"v":-13.844318289237187,"d":"-13.84"}},{"$f":"IF(steel!$AH$64=0,calculations!AU84,calculations!AU85)","v":{"v":-13.919072320535117,"d":"-13.92"}},{"$f":"IF(steel!$AH$64=0,calculations!AV84,calculations!AV85)","v":{"v":-13.980006711641614,"d":"-13.98"}},{"$f":"IF(steel!$AH$64=0,calculations!AW84,calculations!AW85)","v":{"v":-14.027131525424698,"d":"-14.03"}},{"$f":"IF(steel!$AH$64=0,calculations!AX84,calculations!AX85)","v":{"v":-14.060468883897858,"d":"-14.06"}},{"$f":"IF(steel!$AH$64=0,calculations!AY84,calculations!AY85)","v":{"v":-14.08005296822006,"d":"-14.08"}},{"$f":"IF(steel!$AH$64=0,calculations!AZ84,calculations!AZ85)","v":{"v":-14.08593001869576,"d":"-14.09"}},{"$f":"IF(steel!$AH$64=0,calculations!BA84,calculations!BA85)","v":{"v":-14.078158334774871,"d":"-14.08"}},{"$f":"IF(steel!$AH$64=0,calculations!BB84,calculations!BB85)","v":{"v":-14.056808097920808,"d":"-14.06"}},{"$f":"IF(steel!$AH$64=0,calculations!BC84,calculations!BC85)","v":{"v":-14.021959423158656,"d":"-14.02"}},{"$f":"IF(steel!$AH$64=0,calculations!BD84,calculations!BD85)","v":{"v":-13.973700410623337,"d":"-13.97"}},{"$f":"IF(steel!$AH$64=0,calculations!BE84,calculations!BE85)","v":{"v":-13.912126968427637,"d":"-13.91"}},{"$f":"IF(steel!$AH$64=0,calculations!BF84,calculations!BF85)","v":{"v":-13.837342812662204,"d":"-13.84"}},{"$f":"IF(steel!$AH$64=0,calculations!BG84,calculations!BG85)","v":{"v":-13.749459467395525,"d":"-13.75"}},{"$f":"IF(steel!$AH$64=0,calculations!BH84,calculations!BH85)","v":{"v":-13.648596264673966,"d":"-13.65"}},{"$f":"IF(steel!$AH$64=0,calculations!BI84,calculations!BI85)","v":{"v":-13.534880344521742,"d":"-13.53"}},{"$f":"IF(steel!$AH$64=0,calculations!BJ84,calculations!BJ85)","v":{"v":-13.408446654940935,"d":"-13.41"}},{"$f":"IF(steel!$AH$64=0,calculations!BK84,calculations!BK85)","v":{"v":-13.269437951911467,"d":"-13.27"}},{"$f":"IF(steel!$AH$64=0,calculations!BL84,calculations!BL85)","v":{"v":-13.118004799391148,"d":"-13.12"}},{"$f":"IF(steel!$AH$64=0,calculations!BM84,calculations!BM85)","v":{"v":-12.95430556931561,"d":"-12.95"}},{"$f":"IF(steel!$AH$64=0,calculations!BN84,calculations!BN85)","v":{"v":-12.778506441598372,"d":"-12.78"}},{"$f":"IF(steel!$AH$64=0,calculations!BO84,calculations!BO85)","v":{"v":-12.590781404130807,"d":"-12.59"}},{"$f":"IF(steel!$AH$64=0,calculations!BP84,calculations!BP85)","v":{"v":-12.391312252782141,"d":"-12.39"}},{"$f":"IF(steel!$AH$64=0,calculations!BQ84,calculations!BQ85)","v":{"v":-12.180288591399448,"d":"-12.18"}},{"$f":"IF(steel!$AH$64=0,calculations!BR84,calculations!BR85)","v":{"v":-11.957907831807681,"d":"-11.96"}},{"$f":"IF(steel!$AH$64=0,calculations!BS84,calculations!BS85)","v":{"v":-11.724375193809639,"d":"-11.72"}},{"$f":"IF(steel!$AH$64=0,calculations!BT84,calculations!BT85)","v":{"v":-11.479903705185992,"d":"-11.48"}},{"$f":"IF(steel!$AH$64=0,calculations!BU84,calculations!BU85)","v":{"v":-11.224714201695244,"d":"-11.22"}},{"$f":"IF(steel!$AH$64=0,calculations!BV84,calculations!BV85)","v":{"v":-10.959035327073783,"d":"-10.96"}},{"$f":"IF(steel!$AH$64=0,calculations!BW84,calculations!BW85)","v":{"v":-10.683103533035839,"d":"-10.68"}},{"$f":"IF(steel!$AH$64=0,calculations!BX84,calculations!BX85)","v":{"v":-10.397163079273518,"d":"-10.40"}},{"$f":"IF(steel!$AH$64=0,calculations!BY84,calculations!BY85)","v":{"v":-10.101466033456761,"d":"-10.10"}},{"$f":"IF(steel!$AH$64=0,calculations!BZ84,calculations!BZ85)","v":{"v":-9.796272271233384,"d":"-9.80"}},{"$f":"IF(steel!$AH$64=0,calculations!CA84,calculations!CA85)","v":{"v":-9.48184947622906,"d":"-9.48"}},{"$f":"IF(steel!$AH$64=0,calculations!CB84,calculations!CB85)","v":{"v":-9.158473140047315,"d":"-9.16"}},{"$f":"IF(steel!$AH$64=0,calculations!CC84,calculations!CC85)","v":{"v":-8.826426562269534,"d":"-8.83"}},{"$f":"IF(steel!$AH$64=0,calculations!CD84,calculations!CD85)","v":{"v":-8.486000850454973,"d":"-8.49"}},{"$f":"IF(steel!$AH$64=0,calculations!CE84,calculations!CE85)","v":{"v":-8.13749492014073,"d":"-8.14"}},{"$f":"IF(steel!$AH$64=0,calculations!CF84,calculations!CF85)","v":{"v":-7.781215494841763,"d":"-7.78"}},{"$f":"IF(steel!$AH$64=0,calculations!CG84,calculations!CG85)","v":{"v":-7.417477106050891,"d":"-7.42"}},{"$f":"IF(steel!$AH$64=0,calculations!CH84,calculations!CH85)","v":{"v":-7.04660209323881,"d":"-7.05"}},{"$f":"IF(steel!$AH$64=0,calculations!CI84,calculations!CI85)","v":{"v":-6.6689206038540325,"d":"-6.67"}},{"$f":"IF(steel!$AH$64=0,calculations!CJ84,calculations!CJ85)","v":{"v":-6.284770593322988,"d":"-6.28"}},{"$f":"IF(steel!$AH$64=0,calculations!CK84,calculations!CK85)","v":{"v":-5.894497825049915,"d":"-5.89"}},{"$f":"IF(steel!$AH$64=0,calculations!CL84,calculations!CL85)","v":{"v":-5.498455870416914,"d":"-5.50"}},{"$f":"IF(steel!$AH$64=0,calculations!CM84,calculations!CM85)","v":{"v":-5.097006108783989,"d":"-5.10"}},{"$f":"IF(steel!$AH$64=0,calculations!CN84,calculations!CN85)","v":{"v":-4.690517727488928,"d":"-4.69"}},{"$f":"IF(steel!$AH$64=0,calculations!CO84,calculations!CO85)","v":{"v":-4.279367721847463,"d":"-4.28"}},{"$f":"IF(steel!$AH$64=0,calculations!CP84,calculations!CP85)","v":{"v":-3.8639408951531253,"d":"-3.86"}},{"$f":"IF(steel!$AH$64=0,calculations!CQ84,calculations!CQ85)","v":{"v":-3.4446298586773154,"d":"-3.44"}},{"$f":"IF(steel!$AH$64=0,calculations!CR84,calculations!CR85)","v":{"v":-3.021835031669307,"d":"-3.02"}},{"$f":"IF(steel!$AH$64=0,calculations!CS84,calculations!CS85)","v":{"v":-2.5959646413562,"d":"-2.60"}},{"$f":"IF(steel!$AH$64=0,calculations!CT84,calculations!CT85)","v":{"v":-2.167434722943005,"d":"-2.17"}},{"$f":"IF(steel!$AH$64=0,calculations!CU84,calculations!CU85)","v":{"v":-1.7366691196125656,"d":"-1.74"}},{"$f":"IF(steel!$AH$64=0,calculations!CV84,calculations!CV85)","v":{"v":-1.3040994825255448,"d":"-1.30"}},{"$f":"IF(steel!$AH$64=0,calculations!CW84,calculations!CW85)","v":{"v":-0.8701652708205468,"d":"-0.87"}},{"$f":"IF(steel!$AH$64=0,calculations!CX84,calculations!CX85)","v":{"v":-0.4353137516139486,"d":"-0.44"}},{"$f":"IF(steel!$AH$64=0,calculations!CY84,calculations!CY85)","v":{"v":0,"d":"0.00"}}]
[]
[]
[null,null,"SECTIONS"]
[]
[null,"Lp","Section","Mass","Depth","Width","t","T","r","d","b/T","d/t","Ixx","Iyy","rx","ry","Zx","Zy","Sx","Sy","u","x","H","J","A"]
["UB",1,"1016x305x584",{"v":584,"d":"584.00"},{"v":1056,"d":"1056.00"},{"v":314,"d":"314.00"},{"v":36,"d":"36.00"},{"v":64,"d":"64.00"},{"v":30,"d":"30.00"},{"v":868.1,"d":"868.10"},2.45,24.11,{"v":1246000,"d":"1246000.00"},{"v":33400,"d":"33400.00"},{"v":40.9,"d":"40.90"},{"v":6.7,"d":"6.70"},{"v":23600,"d":"23600.00"},{"v":2130,"d":"2130.00"},{"v":28000,"d":"28000.00"},{"v":3480,"d":"3480.00"},{"v":0.869,"d":"0.87"},{"v":18,"d":"18.00"},{"v":81.2,"d":"81.20"},{"v":7150,"d":"7150.00"},{"v":744,"d":"744.00"}]
[null,2,"1016x305x494",{"v":494,"d":"494.00"},{"v":1036,"d":"1036.00"},{"v":309,"d":"309.00"},{"v":31,"d":"31.00"},{"v":54,"d":"54.00"},{"v":30,"d":"30.00"},{"v":868.1,"d":"868.10"},2.86,{"v":28,"d":"28.00"},{"v":1028000,"d":"1028000.00"},{"v":26800,"d":"26800.00"},{"v":40.4,"d":"40.40"},6.53,{"v":19800,"d":"19800.00"},{"v":1740,"d":"1740.00"},{"v":23400,"d":"23400.00"},{"v":2820,"d":"2820.00"},{"v":0.867,"d":"0.87"},{"v":20.9,"d":"20.90"},{"v":64,"d":"64.00"},{"v":4400,"d":"4400.00"},{"v":629,"d":"629.00"}]
[null,3,"1016x305x438",{"v":438,"d":"438.00"},{"v":1026,"d":"1026.00"},{"v":305,"d":"305.00"},{"v":26.9,"d":"26.90"},{"v":49,"d":"49.00"},{"v":30,"d":"30.00"},{"v":868.1,"d":"868.10"},3.11,32.27,{"v":910000,"d":"910000.00"},{"v":23400,"d":"23400.00"},{"v":40.4,"d":"40.40"},6.49,{"v":17700,"d":"17700.00"},{"v":1540,"d":"1540.00"},{"v":20800,"d":"20800.00"},{"v":2470,"d":"2470.00"},{"v":0.869,"d":"0.87"},{"v":23.1,"d":"23.10"},{"v":56,"d":"56.00"},{"v":3190,"d":"3190.00"},{"v":556,"d":"556.00"}]
[null,4,"1016x305x415",{"v":415,"d":"415.00"},{"v":1020,"d":"1020.00"},{"v":304,"d":"304.00"},{"v":26,"d":"26.00"},{"v":46,"d":"46.00"},{"v":30,"d":"30.00"},{"v":868.1,"d":"868.10"},{"v":3.3,"d":"3.30"},33.39,{"v":853000,"d":"853000.00"},{"v":21700,"d":"21700.00"},{"v":40.2,"d":"40.20"},6.41,{"v":16700,"d":"16700.00"},{"v":1430,"d":"1430.00"},{"v":19600,"d":"19600.00"},{"v":2300,"d":"2300.00"},{"v":0.868,"d":"0.87"},{"v":24.3,"d":"24.30"},{"v":51.1,"d":"51.10"},{"v":2700,"d":"2700.00"},{"v":529,"d":"529.00"}]
[null,5,"1016x305x393",{"v":392.7,"d":"392.70"},{"v":1015.9,"d":"1015.90"},{"v":303,"d":"303.00"},{"v":24.4,"d":"24.40"},{"v":43.9,"d":"43.90"},{"v":30,"d":"30.00"},{"v":868.1,"d":"868.10"},3.45,35.58,{"v":808000,"d":"808000.00"},{"v":20500,"d":"20500.00"},{"v":40.2,"d":"40.20"},{"v":6.4,"d":"6.40"},{"v":15900,"d":"15900.00"},{"v":1350,"d":"1350.00"},{"v":18500,"d":"18500.00"},{"v":2170,"d":"2170.00"},{"v":0.867,"d":"0.87"},{"v":25.5,"d":"25.50"},{"v":48.4,"d":"48.40"},{"v":2330,"d":"2330.00"},{"v":500,"d":"500.00"}]
[null,6,"1016x305x350",{"v":350,"d":"350.00"},{"v":1008,"d":"1008.00"},{"v":302,"d":"302.00"},{"v":21.1,"d":"21.10"},{"v":40,"d":"40.00"},{"v":30,"d":"30.00"},{"v":868.1,"d":"868.10"},3.78,41.14,{"v":723000,"d":"723000.00"},{"v":18500,"d":"18500.00"},{"v":40.3,"d":"40.30"},6.44,{"v":14300,"d":"14300.00"},{"v":1220,"d":"1220.00"},{"v":16600,"d":"16600.00"},{"v":1940,"d":"1940.00"},{"v":0.872,"d":"0.87"},{"v":27.8,"d":"27.80"},{"v":43.3,"d":"43.30"},{"v":1720,"d":"1720.00"},{"v":445,"d":"445.00"}]
[null,7,"1016x305x314",{"v":314.3,"d":"314.30"},{"v":999.9,"d":"999.90"},{"v":300,"d":"300.00"},{"v":19.1,"d":"19.10"},{"v":35.9,"d":"35.90"},{"v":30,"d":"30.00"},{"v":868.1,"d":"868.10"},4.18,45.45,{"v":644000,"d":"644000.00"},{"v":16200,"d":"16200.00"},{"v":40.1,"d":"40.10"},6.37,{"v":12900,"d":"12900.00"},{"v":1080,"d":"1080.00"},{"v":14800,"d":"14800.00"},{"v":1710,"d":"1710.00"},0.87,{"v":30.7,"d":"30.70"},{"v":37.7,"d":"37.70"},{"v":1260,"d":"1260.00"},{"v":400,"d":"400.00"}]
[null,8,"1016x305x272",{"v":272.3,"d":"272.30"},{"v":990.1,"d":"990.10"},{"v":300,"d":"300.00"},{"v":16.5,"d":"16.50"},{"v":31,"d":"31.00"},{"v":30,"d":"30.00"},{"v":868.1,"d":"868.10"},4.84,52.61,{"v":554000,"d":"554000.00"},{"v":14000,"d":"14000.00"},{"v":40,"d":"40.00"},6.35,{"v":11200,"d":"11200.00"},{"v":934,"d":"934.00"},{"v":12800,"d":"12800.00"},{"v":1470,"d":"1470.00"},{"v":0.871,"d":"0.87"},{"v":35,"d":"35.00"},{"v":32.2,"d":"32.20"},{"v":835,"d":"835.00"},{"v":347,"d":"347.00"}]
[null,9,"1016x305x249",{"v":248.7,"d":"248.70"},{"v":980.1,"d":"980.10"},{"v":300,"d":"300.00"},{"v":16.5,"d":"16.50"},{"v":26,"d":"26.00"},{"v":30,"d":"30.00"},{"v":868.1,"d":"868.10"},5.77,52.61,{"v":481000,"d":"481000.00"},{"v":11800,"d":"11800.00"},{"v":39,"d":"39.00"},6.09,{"v":9820,"d":"9820.00"},{"v":784,"d":"784.00"},{"v":11300,"d":"11300.00"},{"v":1240,"d":"1240.00"},0.86,{"v":39.8,"d":"39.80"},{"v":26.8,"d":"26.80"},{"v":582,"d":"582.00"},{"v":317,"d":"317.00"}]
[null,10,"1016x305x222",{"v":222,"d":"222.00"},{"v":970.3,"d":"970.30"},{"v":300,"d":"300.00"},{"v":16,"d":"16.00"},{"v":21.1,"d":"21.10"},{"v":30,"d":"30.00"},{"v":868.1,"d":"868.10"},7.11,54.26,{"v":408000,"d":"408000.00"},{"v":9550,"d":"9550.00"},{"v":38,"d":"38.00"},5.81,{"v":8410,"d":"8410.00"},{"v":636,"d":"636.00"},{"v":9810,"d":"9810.00"},{"v":1020,"d":"1020.00"},0.85,{"v":45.7,"d":"45.70"},{"v":21.5,"d":"21.50"},{"v":390,"d":"390.00"},{"v":283,"d":"283.00"}]
[null,11,"914x419x388",{"v":388,"d":"388.00"},{"v":921,"d":"921.00"},{"v":420.5,"d":"420.50"},{"v":21.4,"d":"21.40"},{"v":36.6,"d":"36.60"},{"v":24.1,"d":"24.10"},{"v":799.6,"d":"799.60"},5.74,37.36,{"v":720000,"d":"720000.00"},{"v":45400,"d":"45400.00"},{"v":38.2,"d":"38.20"},9.59,{"v":15600,"d":"15600.00"},{"v":2160,"d":"2160.00"},{"v":17700,"d":"17700.00"},{"v":3340,"d":"3340.00"},{"v":0.885,"d":"0.89"},{"v":26.7,"d":"26.70"},{"v":88.9,"d":"88.90"},{"v":1730,"d":"1730.00"},{"v":494,"d":"494.00"}]
[null,12,"914x419x343",{"v":343.3,"d":"343.30"},{"v":911.8,"d":"911.80"},{"v":418.5,"d":"418.50"},{"v":19.4,"d":"19.40"},{"v":32,"d":"32.00"},{"v":24.1,"d":"24.10"},{"v":799.6,"d":"799.60"},6.54,41.22,{"v":626000,"d":"626000.00"},{"v":39200,"d":"39200.00"},{"v":37.8,"d":"37.80"},9.46,{"v":13700,"d":"13700.00"},{"v":1870,"d":"1870.00"},{"v":15500,"d":"15500.00"},{"v":2890,"d":"2890.00"},{"v":0.884,"d":"0.88"},{"v":30.1,"d":"30.10"},{"v":75.8,"d":"75.80"},{"v":1190,"d":"1190.00"},{"v":437,"d":"437.00"}]
[null,13,"914x305x576",{"v":576,"d":"576.00"},{"v":993,"d":"993.00"},{"v":322,"d":"322.00"},{"v":36.1,"d":"36.10"},{"v":65,"d":"65.00"},{"v":19,"d":"19.00"},{"v":824.8,"d":"824.80"},2.48,22.85,{"v":1102000,"d":"1102000.00"},{"v":36500,"d":"36500.00"},{"v":38.8,"d":"38.80"},7.06,{"v":22200,"d":"22200.00"},{"v":2270,"d":"2270.00"},{"v":26300,"d":"26300.00"},{"v":3660,"d":"3660.00"},{"v":0.874,"d":"0.87"},{"v":16.8,"d":"16.80"},{"v":77.9,"d":"77.90"},{"v":7130,"d":"7130.00"},{"v":733,"d":"733.00"}]
[null,14,"914x305x521",{"v":521,"d":"521.00"},{"v":981,"d":"981.00"},{"v":319,"d":"319.00"},{"v":33,"d":"33.00"},{"v":58.9,"d":"58.90"},{"v":19,"d":"19.00"},{"v":824.8,"d":"824.80"},2.71,24.99,{"v":982000,"d":"982000.00"},{"v":32100,"d":"32100.00"},{"v":38.5,"d":"38.50"},6.96,{"v":20000,"d":"20000.00"},{"v":2020,"d":"2020.00"},{"v":23600,"d":"23600.00"},{"v":3240,"d":"3240.00"},{"v":0.873,"d":"0.87"},{"v":18.3,"d":"18.30"},{"v":67.7,"d":"67.70"},{"v":5340,"d":"5340.00"},{"v":664,"d":"664.00"}]
[null,15,"914x305x474",{"v":474,"d":"474.00"},{"v":971,"d":"971.00"},{"v":316,"d":"316.00"},{"v":30,"d":"30.00"},{"v":54.1,"d":"54.10"},{"v":19,"d":"19.00"},{"v":824.8,"d":"824.80"},2.92,27.49,{"v":886000,"d":"886000.00"},{"v":28700,"d":"28700.00"},{"v":38.3,"d":"38.30"},6.89,{"v":18200,"d":"18200.00"},{"v":1810,"d":"1810.00"},{"v":21400,"d":"21400.00"},{"v":2900,"d":"2900.00"},{"v":0.873,"d":"0.87"},{"v":19.8,"d":"19.80"},{"v":59.8,"d":"59.80"},{"v":4100,"d":"4100.00"},{"v":604,"d":"604.00"}]
[null,16,"914x305x425",{"v":425,"d":"425.00"},{"v":961,"d":"961.00"},{"v":313,"d":"313.00"},{"v":26.9,"d":"26.90"},{"v":49,"d":"49.00"},{"v":19,"d":"19.00"},{"v":824.8,"d":"824.80"},3.19,30.66,{"v":788000,"d":"788000.00"},{"v":25200,"d":"25200.00"},{"v":38.1,"d":"38.10"},6.82,{"v":16400,"d":"16400.00"},{"v":1610,"d":"1610.00"},{"v":19100,"d":"19100.00"},{"v":2560,"d":"2560.00"},{"v":0.874,"d":"0.87"},{"v":21.8,"d":"21.80"},{"v":52.1,"d":"52.10"},{"v":3030,"d":"3030.00"},{"v":542,"d":"542.00"}]
[null,17,"914x305x381",{"v":381,"d":"381.00"},{"v":951,"d":"951.00"},{"v":310,"d":"310.00"},{"v":24.4,"d":"24.40"},{"v":43.9,"d":"43.90"},{"v":19,"d":"19.00"},{"v":824.8,"d":"824.80"},3.53,{"v":33.8,"d":"33.80"},{"v":697000,"d":"697000.00"},{"v":21900,"d":"21900.00"},{"v":37.9,"d":"37.90"},6.72,{"v":14600,"d":"14600.00"},{"v":1410,"d":"1410.00"},{"v":17000,"d":"17000.00"},{"v":2240,"d":"2240.00"},{"v":0.873,"d":"0.87"},{"v":24.1,"d":"24.10"},{"v":44.8,"d":"44.80"},{"v":2200,"d":"2200.00"},{"v":486,"d":"486.00"}]
[null,18,"914x305x345",{"v":345,"d":"345.00"},{"v":943,"d":"943.00"},{"v":308,"d":"308.00"},{"v":22.1,"d":"22.10"},{"v":39.9,"d":"39.90"},{"v":19,"d":"19.00"},{"v":824.8,"d":"824.80"},3.86,37.32,{"v":626000,"d":"626000.00"},{"v":19500,"d":"19500.00"},{"v":37.7,"d":"37.70"},6.66,{"v":13300,"d":"13300.00"},{"v":1270,"d":"1270.00"},{"v":15400,"d":"15400.00"},{"v":2000,"d":"2000.00"},{"v":0.873,"d":"0.87"},{"v":26.3,"d":"26.30"},{"v":39.6,"d":"39.60"},{"v":1650,"d":"1650.00"},{"v":440,"d":"440.00"}]
[null,19,"914x305x313",{"v":313,"d":"313.00"},{"v":932,"d":"932.00"},{"v":309,"d":"309.00"},{"v":21.1,"d":"21.10"},{"v":34.5,"d":"34.50"},{"v":19,"d":"19.00"},{"v":824.8,"d":"824.80"},4.48,39.09,{"v":548000,"d":"548000.00"},{"v":17000,"d":"17000.00"},{"v":37.1,"d":"37.10"},6.54,{"v":11800,"d":"11800.00"},{"v":1100,"d":"1100.00"},{"v":13600,"d":"13600.00"},{"v":1750,"d":"1750.00"},{"v":0.867,"d":"0.87"},{"v":29.7,"d":"29.70"},{"v":34.2,"d":"34.20"},{"v":1160,"d":"1160.00"},{"v":398,"d":"398.00"}]
[null,20,"914x305x289",{"v":289.1,"d":"289.10"},{"v":926.6,"d":"926.60"},{"v":307.7,"d":"307.70"},{"v":19.5,"d":"19.50"},{"v":32,"d":"32.00"},{"v":19.1,"d":"19.10"},{"v":824.4,"d":"824.40"},4.81,42.28,{"v":504000,"d":"504000.00"},{"v":15600,"d":"15600.00"},{"v":37,"d":"37.00"},6.51,{"v":10900,"d":"10900.00"},{"v":1010,"d":"1010.00"},{"v":12600,"d":"12600.00"},{"v":1600,"d":"1600.00"},{"v":0.868,"d":"0.87"},{"v":31.9,"d":"31.90"},{"v":31.2,"d":"31.20"},{"v":926,"d":"926.00"},{"v":368,"d":"368.00"}]
[null,21,"914x305x271",{"v":271,"d":"271.00"},{"v":923,"d":"923.00"},{"v":307,"d":"307.00"},{"v":18.4,"d":"18.40"},{"v":30,"d":"30.00"},{"v":19,"d":"19.00"},{"v":824.8,"d":"824.80"},5.12,44.83,{"v":472000,"d":"472000.00"},{"v":14500,"d":"14500.00"},{"v":36.9,"d":"36.90"},6.48,{"v":10200,"d":"10200.00"},{"v":946,"d":"946.00"},{"v":11800,"d":"11800.00"},{"v":1490,"d":"1490.00"},{"v":0.867,"d":"0.87"},{"v":33.8,"d":"33.80"},{"v":28.8,"d":"28.80"},{"v":769,"d":"769.00"},{"v":346,"d":"346.00"}]
[null,22,"914x305x253",{"v":253.4,"d":"253.40"},{"v":918.4,"d":"918.40"},{"v":305.5,"d":"305.50"},{"v":17.3,"d":"17.30"},{"v":27.9,"d":"27.90"},{"v":19.1,"d":"19.10"},{"v":824.4,"d":"824.40"},5.47,47.65,{"v":436000,"d":"436000.00"},{"v":13300,"d":"13300.00"},{"v":36.8,"d":"36.80"},6.42,{"v":9500,"d":"9500.00"},{"v":871,"d":"871.00"},{"v":10900,"d":"10900.00"},{"v":1370,"d":"1370.00"},{"v":0.864,"d":"0.86"},{"v":36.2,"d":"36.20"},{"v":26.4,"d":"26.40"},{"v":626,"d":"626.00"},{"v":323,"d":"323.00"}]
[null,23,"914x305x238",{"v":238,"d":"238.00"},{"v":915,"d":"915.00"},{"v":305,"d":"305.00"},{"v":16.5,"d":"16.50"},{"v":25.9,"d":"25.90"},{"v":19,"d":"19.00"},{"v":824.8,"d":"824.80"},5.89,49.99,{"v":406000,"d":"406000.00"},{"v":12300,"d":"12300.00"},{"v":36.6,"d":"36.60"},6.36,{"v":8880,"d":"8880.00"},{"v":806,"d":"806.00"},{"v":10200,"d":"10200.00"},{"v":1270,"d":"1270.00"},{"v":0.865,"d":"0.87"},{"v":38.6,"d":"38.60"},{"v":24.2,"d":"24.20"},{"v":514,"d":"514.00"},{"v":304,"d":"304.00"}]
[null,24,"914x305x224",{"v":224.2,"d":"224.20"},{"v":910.4,"d":"910.40"},{"v":304.1,"d":"304.10"},{"v":15.9,"d":"15.90"},{"v":23.9,"d":"23.90"},{"v":19.1,"d":"19.10"},{"v":824.4,"d":"824.40"},6.36,51.85,{"v":376000,"d":"376000.00"},{"v":11200,"d":"11200.00"},{"v":36.3,"d":"36.30"},6.27,{"v":8270,"d":"8270.00"},{"v":739,"d":"739.00"},{"v":9530,"d":"9530.00"},{"v":1160,"d":"1160.00"},0.86,{"v":41.4,"d":"41.40"},{"v":22.1,"d":"22.10"},{"v":422,"d":"422.00"},{"v":286,"d":"286.00"}]
[null,25,"914x305x201",{"v":200.9,"d":"200.90"},{"v":903,"d":"903.00"},{"v":303.3,"d":"303.30"},{"v":15.1,"d":"15.10"},{"v":20.2,"d":"20.20"},{"v":19.1,"d":"19.10"},{"v":824.4,"d":"824.40"},7.51,{"v":54.6,"d":"54.60"},{"v":325000,"d":"325000.00"},{"v":9420,"d":"9420.00"},{"v":35.7,"d":"35.70"},6.07,{"v":7200,"d":"7200.00"},{"v":621,"d":"621.00"},{"v":8350,"d":"8350.00"},{"v":982,"d":"982.00"},{"v":0.853,"d":"0.85"},{"v":46.9,"d":"46.90"},{"v":18.4,"d":"18.40"},{"v":291,"d":"291.00"},{"v":256,"d":"256.00"}]
[null,26,"838x292x226",{"v":226.5,"d":"226.50"},{"v":850.9,"d":"850.90"},{"v":293.8,"d":"293.80"},{"v":16.1,"d":"16.10"},{"v":26.8,"d":"26.80"},{"v":17.8,"d":"17.80"},{"v":761.7,"d":"761.70"},5.48,47.31,{"v":340000,"d":"340000.00"},{"v":11400,"d":"11400.00"},{"v":34.3,"d":"34.30"},6.27,{"v":7980,"d":"7980.00"},{"v":773,"d":"773.00"},{"v":9160,"d":"9160.00"},{"v":1210,"d":"1210.00"},0.87,{"v":34.9,"d":"34.90"},{"v":19.3,"d":"19.30"},{"v":514,"d":"514.00"},{"v":289,"d":"289.00"}]
[null,27,"838x292x194",{"v":193.8,"d":"193.80"},{"v":840.7,"d":"840.70"},{"v":292.4,"d":"292.40"},{"v":14.7,"d":"14.70"},{"v":21.7,"d":"21.70"},{"v":17.8,"d":"17.80"},{"v":761.7,"d":"761.70"},6.74,51.82,{"v":279000,"d":"279000.00"},{"v":9070,"d":"9070.00"},{"v":33.6,"d":"33.60"},6.06,{"v":6640,"d":"6640.00"},{"v":620,"d":"620.00"},{"v":7640,"d":"7640.00"},{"v":974,"d":"974.00"},{"v":0.862,"d":"0.86"},{"v":41.6,"d":"41.60"},{"v":15.2,"d":"15.20"},{"v":306,"d":"306.00"},{"v":247,"d":"247.00"}]
[null,28,"838x292x176",{"v":175.9,"d":"175.90"},{"v":834.9,"d":"834.90"},{"v":291.7,"d":"291.70"},{"v":14,"d":"14.00"},{"v":18.8,"d":"18.80"},{"v":17.8,"d":"17.80"},{"v":761.7,"d":"761.70"},7.76,54.41,{"v":246000,"d":"246000.00"},{"v":7800,"d":"7800.00"},{"v":33.1,"d":"33.10"},{"v":5.9,"d":"5.90"},{"v":5890,"d":"5890.00"},{"v":535,"d":"535.00"},{"v":6810,"d":"6810.00"},{"v":842,"d":"842.00"},{"v":0.856,"d":"0.86"},{"v":46.5,"d":"46.50"},{"v":13,"d":"13.00"},{"v":221,"d":"221.00"},{"v":224,"d":"224.00"}]
[null,29,"762x267x197",{"v":196.8,"d":"196.80"},{"v":769.8,"d":"769.80"},{"v":268,"d":"268.00"},{"v":15.6,"d":"15.60"},{"v":25.4,"d":"25.40"},{"v":16.5,"d":"16.50"},{"v":686,"d":"686.00"},5.28,43.97,{"v":240000,"d":"240000.00"},{"v":8170,"d":"8170.00"},{"v":30.9,"d":"30.90"},5.71,{"v":6230,"d":"6230.00"},{"v":610,"d":"610.00"},{"v":7170,"d":"7170.00"},{"v":958,"d":"958.00"},{"v":0.869,"d":"0.87"},{"v":33.2,"d":"33.20"},{"v":11.3,"d":"11.30"},{"v":404,"d":"404.00"},{"v":251,"d":"251.00"}]
[null,30,"762x267x173",{"v":173,"d":"173.00"},{"v":762.2,"d":"762.20"},{"v":266.7,"d":"266.70"},{"v":14.3,"d":"14.30"},{"v":21.6,"d":"21.60"},{"v":16.5,"d":"16.50"},{"v":686,"d":"686.00"},6.17,47.97,{"v":205000,"d":"205000.00"},{"v":6850,"d":"6850.00"},{"v":30.5,"d":"30.50"},5.58,{"v":5390,"d":"5390.00"},{"v":514,"d":"514.00"},{"v":6200,"d":"6200.00"},{"v":807,"d":"807.00"},{"v":0.865,"d":"0.87"},{"v":38,"d":"38.00"},9.39,{"v":267,"d":"267.00"},{"v":220,"d":"220.00"}]
[null,31,"762x267x147",{"v":146.9,"d":"146.90"},{"v":754,"d":"754.00"},{"v":265.2,"d":"265.20"},{"v":12.8,"d":"12.80"},{"v":17.5,"d":"17.50"},{"v":16.5,"d":"16.50"},{"v":686,"d":"686.00"},7.58,53.59,{"v":169000,"d":"169000.00"},{"v":5460,"d":"5460.00"},{"v":30,"d":"30.00"},{"v":5.4,"d":"5.40"},{"v":4470,"d":"4470.00"},{"v":411,"d":"411.00"},{"v":5160,"d":"5160.00"},{"v":647,"d":"647.00"},{"v":0.859,"d":"0.86"},{"v":45.2,"d":"45.20"},{"v":7.4,"d":"7.40"},{"v":159,"d":"159.00"},{"v":187,"d":"187.00"}]
[null,32,"762x267x134",{"v":133.9,"d":"133.90"},{"v":750,"d":"750.00"},{"v":264.4,"d":"264.40"},{"v":12,"d":"12.00"},{"v":15.5,"d":"15.50"},{"v":16.5,"d":"16.50"},{"v":686,"d":"686.00"},8.53,57.17,{"v":151000,"d":"151000.00"},{"v":4790,"d":"4790.00"},{"v":29.7,"d":"29.70"},{"v":5.3,"d":"5.30"},{"v":4020,"d":"4020.00"},{"v":362,"d":"362.00"},{"v":4640,"d":"4640.00"},{"v":570,"d":"570.00"},{"v":0.853,"d":"0.85"},{"v":49.8,"d":"49.80"},6.46,{"v":119,"d":"119.00"},{"v":171,"d":"171.00"}]
[null,33,"686x254x170",{"v":170.2,"d":"170.20"},{"v":692.9,"d":"692.90"},{"v":255.8,"d":"255.80"},{"v":14.5,"d":"14.50"},{"v":23.7,"d":"23.70"},{"v":15.2,"d":"15.20"},{"v":615.1,"d":"615.10"},{"v":5.4,"d":"5.40"},42.42,{"v":170000,"d":"170000.00"},{"v":6630,"d":"6630.00"},{"v":28,"d":"28.00"},5.53,{"v":4920,"d":"4920.00"},{"v":518,"d":"518.00"},{"v":5630,"d":"5630.00"},{"v":811,"d":"811.00"},{"v":0.872,"d":"0.87"},{"v":31.8,"d":"31.80"},7.42,{"v":308,"d":"308.00"},{"v":217,"d":"217.00"}]
[null,34,"686x254x152",{"v":152.4,"d":"152.40"},{"v":687.5,"d":"687.50"},{"v":254.5,"d":"254.50"},{"v":13.2,"d":"13.20"},{"v":21,"d":"21.00"},{"v":15.2,"d":"15.20"},{"v":615.1,"d":"615.10"},6.06,{"v":46.6,"d":"46.60"},{"v":150000,"d":"150000.00"},{"v":5780,"d":"5780.00"},{"v":27.8,"d":"27.80"},5.46,{"v":4370,"d":"4370.00"},{"v":455,"d":"455.00"},{"v":5000,"d":"5000.00"},{"v":710,"d":"710.00"},{"v":0.871,"d":"0.87"},{"v":35.4,"d":"35.40"},6.42,{"v":220,"d":"220.00"},{"v":194,"d":"194.00"}]
[null,35,"686x254x140",{"v":140.1,"d":"140.10"},{"v":683.5,"d":"683.50"},{"v":253.7,"d":"253.70"},{"v":12.4,"d":"12.40"},{"v":19,"d":"19.00"},{"v":15.2,"d":"15.20"},{"v":615.1,"d":"615.10"},6.68,{"v":49.6,"d":"49.60"},{"v":136000,"d":"136000.00"},{"v":5180,"d":"5180.00"},{"v":27.6,"d":"27.60"},5.39,{"v":3990,"d":"3990.00"},{"v":409,"d":"409.00"},{"v":4560,"d":"4560.00"},{"v":638,"d":"638.00"},0.87,{"v":38.6,"d":"38.60"},5.72,{"v":169,"d":"169.00"},{"v":178,"d":"178.00"}]
[null,36,"686x254x125",{"v":125.2,"d":"125.20"},{"v":677.9,"d":"677.90"},{"v":253,"d":"253.00"},{"v":11.7,"d":"11.70"},{"v":16.2,"d":"16.20"},{"v":15.2,"d":"15.20"},{"v":615.1,"d":"615.10"},7.81,52.57,{"v":118000,"d":"118000.00"},{"v":4380,"d":"4380.00"},{"v":27.2,"d":"27.20"},5.24,{"v":3480,"d":"3480.00"},{"v":346,"d":"346.00"},{"v":3990,"d":"3990.00"},{"v":542,"d":"542.00"},{"v":0.862,"d":"0.86"},{"v":43.8,"d":"43.80"},{"v":4.8,"d":"4.80"},{"v":116,"d":"116.00"},{"v":159,"d":"159.00"}]
[null,37,"610x305x238",{"v":238.1,"d":"238.10"},{"v":635.8,"d":"635.80"},{"v":311.4,"d":"311.40"},{"v":18.4,"d":"18.40"},{"v":31.4,"d":"31.40"},{"v":16.5,"d":"16.50"},{"v":540,"d":"540.00"},4.96,29.35,{"v":209000,"d":"209000.00"},{"v":15800,"d":"15800.00"},{"v":26.3,"d":"26.30"},7.23,{"v":6590,"d":"6590.00"},{"v":1020,"d":"1020.00"},{"v":7490,"d":"7490.00"},{"v":1570,"d":"1570.00"},{"v":0.886,"d":"0.89"},{"v":21.3,"d":"21.30"},{"v":14.5,"d":"14.50"},{"v":785,"d":"785.00"},{"v":303,"d":"303.00"}]
[null,38,"610x305x179",{"v":179,"d":"179.00"},{"v":620.2,"d":"620.20"},{"v":307.1,"d":"307.10"},{"v":14.1,"d":"14.10"},{"v":23.6,"d":"23.60"},{"v":16.5,"d":"16.50"},{"v":540,"d":"540.00"},6.51,{"v":38.3,"d":"38.30"},{"v":153000,"d":"153000.00"},{"v":11400,"d":"11400.00"},{"v":25.9,"d":"25.90"},7.07,{"v":4930,"d":"4930.00"},{"v":743,"d":"743.00"},{"v":5550,"d":"5550.00"},{"v":1140,"d":"1140.00"},{"v":0.885,"d":"0.89"},{"v":27.7,"d":"27.70"},{"v":10.2,"d":"10.20"},{"v":340,"d":"340.00"},{"v":228,"d":"228.00"}]
[null,39,"610x305x149",{"v":149.2,"d":"149.20"},{"v":612.4,"d":"612.40"},{"v":304.8,"d":"304.80"},{"v":11.8,"d":"11.80"},{"v":19.7,"d":"19.70"},{"v":16.5,"d":"16.50"},{"v":540,"d":"540.00"},7.74,45.76,{"v":126000,"d":"126000.00"},{"v":9310,"d":"9310.00"},{"v":25.7,"d":"25.70"},{"v":7,"d":"7.00"},{"v":4110,"d":"4110.00"},{"v":611,"d":"611.00"},{"v":4590,"d":"4590.00"},{"v":937,"d":"937.00"},{"v":0.886,"d":"0.89"},{"v":32.7,"d":"32.70"},8.17,{"v":200,"d":"200.00"},{"v":190,"d":"190.00"}]
[null,40,"610x229x140",{"v":139.9,"d":"139.90"},{"v":617.2,"d":"617.20"},{"v":230.2,"d":"230.20"},{"v":13.1,"d":"13.10"},{"v":22.1,"d":"22.10"},{"v":12.7,"d":"12.70"},{"v":547.6,"d":"547.60"},5.21,{"v":41.8,"d":"41.80"},{"v":112000,"d":"112000.00"},{"v":4510,"d":"4510.00"},{"v":25,"d":"25.00"},5.03,{"v":3620,"d":"3620.00"},{"v":391,"d":"391.00"},{"v":4140,"d":"4140.00"},{"v":611,"d":"611.00"},{"v":0.875,"d":"0.88"},{"v":30.5,"d":"30.50"},3.99,{"v":216,"d":"216.00"},{"v":178,"d":"178.00"}]
[null,41,"610x229x125",{"v":125.1,"d":"125.10"},{"v":612.2,"d":"612.20"},{"v":229,"d":"229.00"},{"v":11.9,"d":"11.90"},{"v":19.6,"d":"19.60"},{"v":12.7,"d":"12.70"},{"v":547.6,"d":"547.60"},5.84,46.02,{"v":98600,"d":"98600.00"},{"v":3930,"d":"3930.00"},{"v":24.9,"d":"24.90"},4.97,{"v":3220,"d":"3220.00"},{"v":343,"d":"343.00"},{"v":3680,"d":"3680.00"},{"v":535,"d":"535.00"},{"v":0.875,"d":"0.88"},{"v":34.1,"d":"34.10"},3.45,{"v":154,"d":"154.00"},{"v":159,"d":"159.00"}]
[null,42,"610x229x113",{"v":113,"d":"113.00"},{"v":607.6,"d":"607.60"},{"v":228.2,"d":"228.20"},{"v":11.1,"d":"11.10"},{"v":17.3,"d":"17.30"},{"v":12.7,"d":"12.70"},{"v":547.6,"d":"547.60"},{"v":6.6,"d":"6.60"},49.33,{"v":87300,"d":"87300.00"},{"v":3430,"d":"3430.00"},{"v":24.6,"d":"24.60"},4.88,{"v":2870,"d":"2870.00"},{"v":301,"d":"301.00"},{"v":3280,"d":"3280.00"},{"v":469,"d":"469.00"},0.87,{"v":38,"d":"38.00"},2.99,{"v":111,"d":"111.00"},{"v":144,"d":"144.00"}]
[null,43,"610x229x101",{"v":101.2,"d":"101.20"},{"v":602.6,"d":"602.60"},{"v":227.6,"d":"227.60"},{"v":10.5,"d":"10.50"},{"v":14.8,"d":"14.80"},{"v":12.7,"d":"12.70"},{"v":547.6,"d":"547.60"},7.69,52.15,{"v":75800,"d":"75800.00"},{"v":2910,"d":"2910.00"},{"v":24.2,"d":"24.20"},4.75,{"v":2520,"d":"2520.00"},{"v":256,"d":"256.00"},{"v":2880,"d":"2880.00"},{"v":400,"d":"400.00"},{"v":0.863,"d":"0.86"},{"v":43.1,"d":"43.10"},2.52,{"v":77,"d":"77.00"},{"v":129,"d":"129.00"}]
[null,44,"610x178x100",{"v":100.3,"d":"100.30"},{"v":607.4,"d":"607.40"},{"v":179.2,"d":"179.20"},{"v":11.3,"d":"11.30"},{"v":17.2,"d":"17.20"},{"v":12.7,"d":"12.70"},{"v":547.6,"d":"547.60"},5.21,48.46,{"v":72500,"d":"72500.00"},{"v":1660,"d":"1660.00"},{"v":23.8,"d":"23.80"},{"v":3.6,"d":"3.60"},{"v":2390,"d":"2390.00"},{"v":185,"d":"185.00"},{"v":2790,"d":"2790.00"},{"v":296,"d":"296.00"},{"v":0.855,"d":"0.86"},{"v":38.7,"d":"38.70"},1.44,{"v":95,"d":"95.00"},{"v":128,"d":"128.00"}]
[null,45,"610x178x92",{"v":92.2,"d":"92.20"},{"v":603,"d":"603.00"},{"v":178.8,"d":"178.80"},{"v":10.9,"d":"10.90"},{"v":15,"d":"15.00"},{"v":12.7,"d":"12.70"},{"v":547.6,"d":"547.60"},5.96,50.24,{"v":64600,"d":"64600.00"},{"v":1440,"d":"1440.00"},{"v":23.4,"d":"23.40"},{"v":3.5,"d":"3.50"},{"v":2140,"d":"2140.00"},{"v":161,"d":"161.00"},{"v":2510,"d":"2510.00"},{"v":258,"d":"258.00"},0.85,{"v":42.6,"d":"42.60"},1.24,{"v":71,"d":"71.00"},{"v":117,"d":"117.00"}]
[null,46,"610x178x82",{"v":81.8,"d":"81.80"},{"v":598.6,"d":"598.60"},{"v":177.9,"d":"177.90"},{"v":10,"d":"10.00"},{"v":12.8,"d":"12.80"},{"v":12.7,"d":"12.70"},{"v":547.6,"d":"547.60"},6.95,54.76,{"v":55900,"d":"55900.00"},{"v":1210,"d":"1210.00"},{"v":23.2,"d":"23.20"},{"v":3.4,"d":"3.40"},{"v":1870,"d":"1870.00"},{"v":136,"d":"136.00"},{"v":2190,"d":"2190.00"},{"v":218,"d":"218.00"},{"v":0.843,"d":"0.84"},{"v":48.4,"d":"48.40"},1.04,{"v":48.8,"d":"48.80"},{"v":104,"d":"104.00"}]
[null,47,"533x312x273",{"v":273.3,"d":"273.30"},{"v":577.1,"d":"577.10"},{"v":320.2,"d":"320.20"},{"v":21.1,"d":"21.10"},{"v":37.6,"d":"37.60"},{"v":12.7,"d":"12.70"},{"v":476.5,"d":"476.50"},4.26,22.58,{"v":199000,"d":"199000.00"},{"v":20600,"d":"20600.00"},{"v":23.9,"d":"23.90"},7.69,{"v":6890,"d":"6890.00"},{"v":1290,"d":"1290.00"},{"v":7870,"d":"7870.00"},{"v":1990,"d":"1990.00"},{"v":0.891,"d":"0.89"},{"v":15.9,"d":"15.90"},{"v":15,"d":"15.00"},{"v":1290,"d":"1290.00"},{"v":348,"d":"348.00"}]
[null,48,"533x312x219",{"v":218.8,"d":"218.80"},{"v":560.3,"d":"560.30"},{"v":317.4,"d":"317.40"},{"v":18.3,"d":"18.30"},{"v":29.2,"d":"29.20"},{"v":12.7,"d":"12.70"},{"v":476.5,"d":"476.50"},5.43,{"v":26,"d":"26.00"},{"v":151000,"d":"151000.00"},{"v":15600,"d":"15600.00"},{"v":23.3,"d":"23.30"},7.48,{"v":5400,"d":"5400.00"},{"v":982,"d":"982.00"},{"v":6120,"d":"6120.00"},{"v":1510,"d":"1510.00"},{"v":0.884,"d":"0.88"},{"v":19.8,"d":"19.80"},{"v":11,"d":"11.00"},{"v":642,"d":"642.00"},{"v":279,"d":"279.00"}]
[null,49,"533x312x182",{"v":181.5,"d":"181.50"},{"v":550.7,"d":"550.70"},{"v":314.5,"d":"314.50"},{"v":15.2,"d":"15.20"},{"v":24.4,"d":"24.40"},{"v":12.7,"d":"12.70"},{"v":476.5,"d":"476.50"},6.44,{"v":31.3,"d":"31.30"},{"v":123000,"d":"123000.00"},{"v":12700,"d":"12700.00"},{"v":23.1,"d":"23.10"},{"v":7.4,"d":"7.40"},{"v":4480,"d":"4480.00"},{"v":806,"d":"806.00"},{"v":5040,"d":"5040.00"},{"v":1240,"d":"1240.00"},{"v":0.887,"d":"0.89"},{"v":23.4,"d":"23.40"},8.77,{"v":373,"d":"373.00"},{"v":231,"d":"231.00"}]
[null,50,"533x312x151",{"v":150.6,"d":"150.60"},{"v":542.5,"d":"542.50"},{"v":312,"d":"312.00"},{"v":12.7,"d":"12.70"},{"v":20.3,"d":"20.30"},{"v":12.7,"d":"12.70"},{"v":476.5,"d":"476.50"},7.68,{"v":37.5,"d":"37.50"},{"v":101000,"d":"101000.00"},{"v":10300,"d":"10300.00"},{"v":22.9,"d":"22.90"},7.32,{"v":3710,"d":"3710.00"},{"v":659,"d":"659.00"},{"v":4150,"d":"4150.00"},{"v":1010,"d":"1010.00"},{"v":0.886,"d":"0.89"},{"v":27.8,"d":"27.80"},7.01,{"v":216,"d":"216.00"},{"v":192,"d":"192.00"}]
[null,51,"533x210x138",{"v":138.3,"d":"138.30"},{"v":549.1,"d":"549.10"},{"v":213.9,"d":"213.90"},{"v":14.7,"d":"14.70"},{"v":23.6,"d":"23.60"},{"v":12.7,"d":"12.70"},{"v":476.5,"d":"476.50"},4.53,{"v":32.4,"d":"32.40"},{"v":86100,"d":"86100.00"},{"v":3860,"d":"3860.00"},{"v":22.1,"d":"22.10"},4.68,{"v":3140,"d":"3140.00"},{"v":361,"d":"361.00"},{"v":3610,"d":"3610.00"},{"v":568,"d":"568.00"},{"v":0.873,"d":"0.87"},{"v":25,"d":"25.00"},2.67,{"v":250,"d":"250.00"},{"v":176,"d":"176.00"}]
[null,52,"533x210x122",{"v":122,"d":"122.00"},{"v":544.5,"d":"544.50"},{"v":211.9,"d":"211.90"},{"v":12.7,"d":"12.70"},{"v":21.3,"d":"21.30"},{"v":12.7,"d":"12.70"},{"v":476.5,"d":"476.50"},4.97,{"v":37.5,"d":"37.50"},{"v":76000,"d":"76000.00"},{"v":3390,"d":"3390.00"},{"v":22.1,"d":"22.10"},4.67,{"v":2790,"d":"2790.00"},{"v":320,"d":"320.00"},{"v":3200,"d":"3200.00"},{"v":500,"d":"500.00"},{"v":0.878,"d":"0.88"},{"v":27.6,"d":"27.60"},2.32,{"v":178,"d":"178.00"},{"v":155,"d":"155.00"}]
[null,53,"533x210x109",{"v":109,"d":"109.00"},{"v":539.5,"d":"539.50"},{"v":210.8,"d":"210.80"},{"v":11.6,"d":"11.60"},{"v":18.8,"d":"18.80"},{"v":12.7,"d":"12.70"},{"v":476.5,"d":"476.50"},5.61,{"v":41.1,"d":"41.10"},{"v":66800,"d":"66800.00"},{"v":2940,"d":"2940.00"},{"v":21.9,"d":"21.90"},{"v":4.6,"d":"4.60"},{"v":2480,"d":"2480.00"},{"v":279,"d":"279.00"},{"v":2830,"d":"2830.00"},{"v":436,"d":"436.00"},{"v":0.875,"d":"0.88"},{"v":30.9,"d":"30.90"},1.99,{"v":126,"d":"126.00"},{"v":139,"d":"139.00"}]
[null,54,"533x210x101",{"v":101,"d":"101.00"},{"v":536.7,"d":"536.70"},{"v":210,"d":"210.00"},{"v":10.8,"d":"10.80"},{"v":17.4,"d":"17.40"},{"v":12.7,"d":"12.70"},{"v":476.5,"d":"476.50"},6.03,{"v":44.1,"d":"44.10"},{"v":61500,"d":"61500.00"},{"v":2690,"d":"2690.00"},{"v":21.9,"d":"21.90"},4.57,{"v":2290,"d":"2290.00"},{"v":256,"d":"256.00"},{"v":2610,"d":"2610.00"},{"v":399,"d":"399.00"},{"v":0.873,"d":"0.87"},{"v":33.2,"d":"33.20"},1.81,{"v":101,"d":"101.00"},{"v":129,"d":"129.00"}]
[null,55,"533x210x92",{"v":92.1,"d":"92.10"},{"v":533.1,"d":"533.10"},{"v":209.3,"d":"209.30"},{"v":10.1,"d":"10.10"},{"v":15.6,"d":"15.60"},{"v":12.7,"d":"12.70"},{"v":476.5,"d":"476.50"},6.71,{"v":47.2,"d":"47.20"},{"v":55200,"d":"55200.00"},{"v":2390,"d":"2390.00"},{"v":21.7,"d":"21.70"},4.51,{"v":2070,"d":"2070.00"},{"v":228,"d":"228.00"},{"v":2360,"d":"2360.00"},{"v":355,"d":"355.00"},{"v":0.873,"d":"0.87"},{"v":36.4,"d":"36.40"},{"v":1.6,"d":"1.60"},{"v":75.7,"d":"75.70"},{"v":117,"d":"117.00"}]
[null,56,"533x210x82",{"v":82.2,"d":"82.20"},{"v":528.3,"d":"528.30"},{"v":208.8,"d":"208.80"},{"v":9.6,"d":"9.60"},{"v":13.2,"d":"13.20"},{"v":12.7,"d":"12.70"},{"v":476.5,"d":"476.50"},7.91,{"v":49.6,"d":"49.60"},{"v":47500,"d":"47500.00"},{"v":2010,"d":"2010.00"},{"v":21.3,"d":"21.30"},4.38,{"v":1800,"d":"1800.00"},{"v":192,"d":"192.00"},{"v":2060,"d":"2060.00"},{"v":300,"d":"300.00"},{"v":0.864,"d":"0.86"},{"v":41.5,"d":"41.50"},1.33,{"v":51.5,"d":"51.50"},{"v":105,"d":"105.00"}]
[null,57,"533x165x85",{"v":84.8,"d":"84.80"},{"v":534.9,"d":"534.90"},{"v":166.5,"d":"166.50"},{"v":10.3,"d":"10.30"},{"v":16.5,"d":"16.50"},{"v":12.7,"d":"12.70"},{"v":476.5,"d":"476.50"},5.05,{"v":46.3,"d":"46.30"},{"v":48500,"d":"48500.00"},{"v":1270,"d":"1270.00"},{"v":21.2,"d":"21.20"},3.44,{"v":1820,"d":"1820.00"},{"v":153,"d":"153.00"},{"v":2100,"d":"2100.00"},{"v":243,"d":"243.00"},{"v":0.859,"d":"0.86"},{"v":35.5,"d":"35.50"},{"v":0.857,"d":"0.86"},{"v":73.8,"d":"73.80"},{"v":108,"d":"108.00"}]
[null,58,"533x165x75",{"v":74.7,"d":"74.70"},{"v":529.1,"d":"529.10"},{"v":165.9,"d":"165.90"},{"v":9.7,"d":"9.70"},{"v":13.6,"d":"13.60"},{"v":12.7,"d":"12.70"},{"v":476.5,"d":"476.50"},{"v":6.1,"d":"6.10"},{"v":49.1,"d":"49.10"},{"v":41100,"d":"41100.00"},{"v":1040,"d":"1040.00"},{"v":20.8,"d":"20.80"},{"v":3.3,"d":"3.30"},{"v":1550,"d":"1550.00"},{"v":125,"d":"125.00"},{"v":1810,"d":"1810.00"},{"v":200,"d":"200.00"},{"v":0.853,"d":"0.85"},{"v":41.1,"d":"41.10"},{"v":0.691,"d":"0.69"},{"v":47.9,"d":"47.90"},{"v":95.2,"d":"95.20"}]
[null,59,"533x165x66",{"v":65.7,"d":"65.70"},{"v":524.7,"d":"524.70"},{"v":165.1,"d":"165.10"},{"v":8.9,"d":"8.90"},{"v":11.4,"d":"11.40"},{"v":12.7,"d":"12.70"},{"v":476.5,"d":"476.50"},7.24,{"v":53.5,"d":"53.50"},{"v":35000,"d":"35000.00"},{"v":859,"d":"859.00"},{"v":20.5,"d":"20.50"},{"v":3.2,"d":"3.20"},{"v":1340,"d":"1340.00"},{"v":104,"d":"104.00"},{"v":1560,"d":"1560.00"},{"v":166,"d":"166.00"},{"v":0.847,"d":"0.85"},{"v":47,"d":"47.00"},{"v":0.566,"d":"0.57"},{"v":32,"d":"32.00"},{"v":83.7,"d":"83.70"}]
[null,60,"457x191x161",{"v":161.4,"d":"161.40"},{"v":492,"d":"492.00"},{"v":199.4,"d":"199.40"},{"v":18,"d":"18.00"},{"v":32,"d":"32.00"},{"v":10.2,"d":"10.20"},{"v":407.6,"d":"407.60"},3.12,{"v":22.6,"d":"22.60"},{"v":79800,"d":"79800.00"},{"v":4250,"d":"4250.00"},{"v":19.7,"d":"19.70"},4.55,{"v":3240,"d":"3240.00"},{"v":426,"d":"426.00"},{"v":3780,"d":"3780.00"},{"v":672,"d":"672.00"},{"v":0.881,"d":"0.88"},{"v":16.5,"d":"16.50"},2.25,{"v":515,"d":"515.00"},{"v":206,"d":"206.00"}]
[null,61,"457x191x133",{"v":133.3,"d":"133.30"},{"v":480.6,"d":"480.60"},{"v":196.7,"d":"196.70"},{"v":15.3,"d":"15.30"},{"v":26.3,"d":"26.30"},{"v":10.2,"d":"10.20"},{"v":407.6,"d":"407.60"},3.74,{"v":26.6,"d":"26.60"},{"v":63800,"d":"63800.00"},{"v":3350,"d":"3350.00"},{"v":19.4,"d":"19.40"},4.44,{"v":2660,"d":"2660.00"},{"v":341,"d":"341.00"},{"v":3070,"d":"3070.00"},{"v":535,"d":"535.00"},0.88,{"v":19.6,"d":"19.60"},1.73,{"v":292,"d":"292.00"},{"v":170,"d":"170.00"}]
[null,62,"457x191x106",{"v":105.8,"d":"105.80"},{"v":469.2,"d":"469.20"},{"v":194,"d":"194.00"},{"v":12.6,"d":"12.60"},{"v":20.6,"d":"20.60"},{"v":10.2,"d":"10.20"},{"v":407.6,"d":"407.60"},4.71,{"v":32.3,"d":"32.30"},{"v":48900,"d":"48900.00"},{"v":2510,"d":"2510.00"},{"v":19,"d":"19.00"},4.32,{"v":2080,"d":"2080.00"},{"v":259,"d":"259.00"},{"v":2390,"d":"2390.00"},{"v":405,"d":"405.00"},{"v":0.876,"d":"0.88"},{"v":24.5,"d":"24.50"},1.27,{"v":146,"d":"146.00"},{"v":135,"d":"135.00"}]
[null,63,"457x191x98",{"v":98.3,"d":"98.30"},{"v":467.2,"d":"467.20"},{"v":192.8,"d":"192.80"},{"v":11.4,"d":"11.40"},{"v":19.6,"d":"19.60"},{"v":10.2,"d":"10.20"},{"v":407.6,"d":"407.60"},4.92,{"v":35.8,"d":"35.80"},{"v":45700,"d":"45700.00"},{"v":2350,"d":"2350.00"},{"v":19.1,"d":"19.10"},4.33,{"v":1960,"d":"1960.00"},{"v":243,"d":"243.00"},{"v":2230,"d":"2230.00"},{"v":379,"d":"379.00"},{"v":0.881,"d":"0.88"},{"v":25.8,"d":"25.80"},1.18,{"v":121,"d":"121.00"},{"v":125,"d":"125.00"}]
[null,64,"457x191x89",{"v":89.3,"d":"89.30"},{"v":463.4,"d":"463.40"},{"v":191.9,"d":"191.90"},{"v":10.5,"d":"10.50"},{"v":17.7,"d":"17.70"},{"v":10.2,"d":"10.20"},{"v":407.6,"d":"407.60"},5.42,{"v":38.8,"d":"38.80"},{"v":41000,"d":"41000.00"},{"v":2090,"d":"2090.00"},{"v":19,"d":"19.00"},4.29,{"v":1770,"d":"1770.00"},{"v":218,"d":"218.00"},{"v":2010,"d":"2010.00"},{"v":338,"d":"338.00"},{"v":0.877,"d":"0.88"},{"v":28.3,"d":"28.30"},1.04,{"v":90.7,"d":"90.70"},{"v":114,"d":"114.00"}]
[null,65,"457x191x82",{"v":82,"d":"82.00"},{"v":460,"d":"460.00"},{"v":191.3,"d":"191.30"},{"v":9.9,"d":"9.90"},{"v":16,"d":"16.00"},{"v":10.2,"d":"10.20"},{"v":407.6,"d":"407.60"},5.98,{"v":41.2,"d":"41.20"},{"v":37100,"d":"37100.00"},{"v":1870,"d":"1870.00"},{"v":18.8,"d":"18.80"},4.23,{"v":1610,"d":"1610.00"},{"v":196,"d":"196.00"},{"v":1830,"d":"1830.00"},{"v":304,"d":"304.00"},{"v":0.879,"d":"0.88"},{"v":30.8,"d":"30.80"},{"v":0.922,"d":"0.92"},{"v":69.2,"d":"69.20"},{"v":104,"d":"104.00"}]
[null,66,"457x191x74",{"v":74.3,"d":"74.30"},{"v":457,"d":"457.00"},{"v":190.4,"d":"190.40"},{"v":9,"d":"9.00"},{"v":14.5,"d":"14.50"},{"v":10.2,"d":"10.20"},{"v":407.6,"d":"407.60"},6.57,{"v":45.3,"d":"45.30"},{"v":33300,"d":"33300.00"},{"v":1670,"d":"1670.00"},{"v":18.8,"d":"18.80"},{"v":4.2,"d":"4.20"},{"v":1460,"d":"1460.00"},{"v":176,"d":"176.00"},{"v":1650,"d":"1650.00"},{"v":272,"d":"272.00"},{"v":0.876,"d":"0.88"},{"v":33.8,"d":"33.80"},{"v":0.818,"d":"0.82"},{"v":51.8,"d":"51.80"},{"v":94.6,"d":"94.60"}]
[null,67,"457x191x67",{"v":67.1,"d":"67.10"},{"v":453.4,"d":"453.40"},{"v":189.9,"d":"189.90"},{"v":8.5,"d":"8.50"},{"v":12.7,"d":"12.70"},{"v":10.2,"d":"10.20"},{"v":407.6,"d":"407.60"},7.48,{"v":48,"d":"48.00"},{"v":29400,"d":"29400.00"},{"v":1450,"d":"1450.00"},{"v":18.5,"d":"18.50"},4.12,{"v":1300,"d":"1300.00"},{"v":153,"d":"153.00"},{"v":1470,"d":"1470.00"},{"v":237,"d":"237.00"},{"v":0.872,"d":"0.87"},{"v":37.9,"d":"37.90"},{"v":0.705,"d":"0.71"},{"v":37.1,"d":"37.10"},{"v":85.5,"d":"85.50"}]
[null,68,"457x152x82",{"v":82.1,"d":"82.10"},{"v":465.8,"d":"465.80"},{"v":155.3,"d":"155.30"},{"v":10.5,"d":"10.50"},{"v":18.9,"d":"18.90"},{"v":10.2,"d":"10.20"},{"v":407.6,"d":"407.60"},4.11,{"v":38.8,"d":"38.80"},{"v":36600,"d":"36600.00"},{"v":1180,"d":"1180.00"},{"v":18.7,"d":"18.70"},3.37,{"v":1570,"d":"1570.00"},{"v":153,"d":"153.00"},{"v":1810,"d":"1810.00"},{"v":240,"d":"240.00"},0.87,{"v":27.5,"d":"27.50"},{"v":0.591,"d":"0.59"},{"v":89.2,"d":"89.20"},{"v":105,"d":"105.00"}]
[null,69,"457x152x74",{"v":74.2,"d":"74.20"},{"v":462,"d":"462.00"},{"v":154.4,"d":"154.40"},{"v":9.6,"d":"9.60"},{"v":17,"d":"17.00"},{"v":10.2,"d":"10.20"},{"v":407.6,"d":"407.60"},4.54,{"v":42.5,"d":"42.50"},{"v":32700,"d":"32700.00"},{"v":1050,"d":"1050.00"},{"v":18.6,"d":"18.60"},3.33,{"v":1410,"d":"1410.00"},{"v":136,"d":"136.00"},{"v":1630,"d":"1630.00"},{"v":213,"d":"213.00"},{"v":0.874,"d":"0.87"},{"v":30.1,"d":"30.10"},{"v":0.518,"d":"0.52"},{"v":65.9,"d":"65.90"},{"v":94.5,"d":"94.50"}]
[null,70,"457x152x67",{"v":67.2,"d":"67.20"},{"v":458,"d":"458.00"},{"v":153.8,"d":"153.80"},{"v":9,"d":"9.00"},{"v":15,"d":"15.00"},{"v":10.2,"d":"10.20"},{"v":407.6,"d":"407.60"},5.13,{"v":45.3,"d":"45.30"},{"v":28900,"d":"28900.00"},{"v":913,"d":"913.00"},{"v":18.4,"d":"18.40"},3.27,{"v":1260,"d":"1260.00"},{"v":119,"d":"119.00"},{"v":1450,"d":"1450.00"},{"v":187,"d":"187.00"},{"v":0.867,"d":"0.87"},{"v":33.6,"d":"33.60"},{"v":0.448,"d":"0.45"},{"v":47.7,"d":"47.70"},{"v":85.6,"d":"85.60"}]
[null,71,"457x152x60",{"v":59.8,"d":"59.80"},{"v":454.6,"d":"454.60"},{"v":152.9,"d":"152.90"},{"v":8.1,"d":"8.10"},{"v":13.3,"d":"13.30"},{"v":10.2,"d":"10.20"},{"v":407.6,"d":"407.60"},5.75,{"v":50.3,"d":"50.30"},{"v":25500,"d":"25500.00"},{"v":795,"d":"795.00"},{"v":18.3,"d":"18.30"},3.23,{"v":1120,"d":"1120.00"},{"v":104,"d":"104.00"},{"v":1290,"d":"1290.00"},{"v":163,"d":"163.00"},{"v":0.869,"d":"0.87"},{"v":37.5,"d":"37.50"},{"v":0.387,"d":"0.39"},{"v":33.8,"d":"33.80"},{"v":76.2,"d":"76.20"}]
[null,72,"457x152x52",{"v":52.3,"d":"52.30"},{"v":449.8,"d":"449.80"},{"v":152.4,"d":"152.40"},{"v":7.6,"d":"7.60"},{"v":10.9,"d":"10.90"},{"v":10.2,"d":"10.20"},{"v":407.6,"d":"407.60"},6.99,{"v":53.6,"d":"53.60"},{"v":21400,"d":"21400.00"},{"v":645,"d":"645.00"},{"v":17.9,"d":"17.90"},3.11,{"v":950,"d":"950.00"},{"v":84.6,"d":"84.60"},{"v":1100,"d":"1100.00"},{"v":133,"d":"133.00"},{"v":0.861,"d":"0.86"},{"v":43.8,"d":"43.80"},{"v":0.311,"d":"0.31"},{"v":21.4,"d":"21.40"},{"v":66.6,"d":"66.60"}]
[null,73,"406x178x85",{"v":85.3,"d":"85.30"},{"v":417.2,"d":"417.20"},{"v":181.9,"d":"181.90"},{"v":10.9,"d":"10.90"},{"v":18.2,"d":"18.20"},{"v":10.2,"d":"10.20"},{"v":360.4,"d":"360.40"},{"v":5,"d":"5.00"},{"v":33.1,"d":"33.10"},{"v":31700,"d":"31700.00"},{"v":1830,"d":"1830.00"},{"v":17.1,"d":"17.10"},4.11,{"v":1520,"d":"1520.00"},{"v":201,"d":"201.00"},{"v":1730,"d":"1730.00"},{"v":313,"d":"313.00"},{"v":0.879,"d":"0.88"},{"v":24.4,"d":"24.40"},{"v":0.728,"d":"0.73"},{"v":93,"d":"93.00"},{"v":109,"d":"109.00"}]
[null,74,"406x178x74",{"v":74.2,"d":"74.20"},{"v":412.8,"d":"412.80"},{"v":179.5,"d":"179.50"},{"v":9.5,"d":"9.50"},{"v":16,"d":"16.00"},{"v":10.2,"d":"10.20"},{"v":360.4,"d":"360.40"},5.61,{"v":37.9,"d":"37.90"},{"v":27300,"d":"27300.00"},{"v":1550,"d":"1550.00"},{"v":17,"d":"17.00"},4.04,{"v":1320,"d":"1320.00"},{"v":172,"d":"172.00"},{"v":1500,"d":"1500.00"},{"v":267,"d":"267.00"},{"v":0.882,"d":"0.88"},{"v":27.5,"d":"27.50"},{"v":0.608,"d":"0.61"},{"v":62.8,"d":"62.80"},{"v":94.5,"d":"94.50"}]
[null,75,"406x178x67",{"v":67.1,"d":"67.10"},{"v":409.4,"d":"409.40"},{"v":178.8,"d":"178.80"},{"v":8.8,"d":"8.80"},{"v":14.3,"d":"14.30"},{"v":10.2,"d":"10.20"},{"v":360.4,"d":"360.40"},6.25,{"v":41,"d":"41.00"},{"v":24300,"d":"24300.00"},{"v":1360,"d":"1360.00"},{"v":16.9,"d":"16.90"},3.99,{"v":1190,"d":"1190.00"},{"v":153,"d":"153.00"},{"v":1350,"d":"1350.00"},{"v":237,"d":"237.00"},0.88,{"v":30.5,"d":"30.50"},{"v":0.533,"d":"0.53"},{"v":46.1,"d":"46.10"},{"v":85.5,"d":"85.50"}]
[null,76,"406x178x60",{"v":60.1,"d":"60.10"},{"v":406.4,"d":"406.40"},{"v":177.9,"d":"177.90"},{"v":7.9,"d":"7.90"},{"v":12.8,"d":"12.80"},{"v":10.2,"d":"10.20"},{"v":360.4,"d":"360.40"},6.95,{"v":45.6,"d":"45.60"},{"v":21600,"d":"21600.00"},{"v":1200,"d":"1200.00"},{"v":16.8,"d":"16.80"},3.97,{"v":1060,"d":"1060.00"},{"v":135,"d":"135.00"},{"v":1200,"d":"1200.00"},{"v":209,"d":"209.00"},0.88,{"v":33.8,"d":"33.80"},{"v":0.466,"d":"0.47"},{"v":33.3,"d":"33.30"},{"v":76.5,"d":"76.50"}]
[null,77,"406x178x54",{"v":54.1,"d":"54.10"},{"v":402.6,"d":"402.60"},{"v":177.7,"d":"177.70"},{"v":7.7,"d":"7.70"},{"v":10.9,"d":"10.90"},{"v":10.2,"d":"10.20"},{"v":360.4,"d":"360.40"},8.15,{"v":46.8,"d":"46.80"},{"v":18700,"d":"18700.00"},{"v":1020,"d":"1020.00"},{"v":16.5,"d":"16.50"},3.85,{"v":930,"d":"930.00"},{"v":115,"d":"115.00"},{"v":1050,"d":"1050.00"},{"v":178,"d":"178.00"},{"v":0.869,"d":"0.87"},{"v":38.3,"d":"38.30"},{"v":0.392,"d":"0.39"},{"v":23.1,"d":"23.10"},{"v":69,"d":"69.00"}]
[null,78,"406x140x53",{"v":53.3,"d":"53.30"},{"v":406.6,"d":"406.60"},{"v":143.3,"d":"143.30"},{"v":7.9,"d":"7.90"},{"v":12.9,"d":"12.90"},{"v":10.2,"d":"10.20"},{"v":360.4,"d":"360.40"},5.55,{"v":45.6,"d":"45.60"},{"v":18300,"d":"18300.00"},{"v":635,"d":"635.00"},{"v":16.4,"d":"16.40"},3.06,{"v":899,"d":"899.00"},{"v":88.6,"d":"88.60"},{"v":1030,"d":"1030.00"},{"v":139,"d":"139.00"},0.87,{"v":34.1,"d":"34.10"},{"v":0.246,"d":"0.25"},{"v":29,"d":"29.00"},{"v":67.9,"d":"67.90"}]
[null,79,"406x140x46",{"v":46,"d":"46.00"},{"v":403.2,"d":"403.20"},{"v":142.2,"d":"142.20"},{"v":6.8,"d":"6.80"},{"v":11.2,"d":"11.20"},{"v":10.2,"d":"10.20"},{"v":360.4,"d":"360.40"},6.35,{"v":53,"d":"53.00"},{"v":15700,"d":"15700.00"},{"v":538,"d":"538.00"},{"v":16.4,"d":"16.40"},3.03,{"v":778,"d":"778.00"},{"v":75.7,"d":"75.70"},{"v":888,"d":"888.00"},{"v":118,"d":"118.00"},{"v":0.871,"d":"0.87"},{"v":39,"d":"39.00"},{"v":0.207,"d":"0.21"},{"v":19,"d":"19.00"},{"v":58.6,"d":"58.60"}]
[null,80,"406x140x39",{"v":39,"d":"39.00"},{"v":398,"d":"398.00"},{"v":141.8,"d":"141.80"},{"v":6.4,"d":"6.40"},{"v":8.6,"d":"8.60"},{"v":10.2,"d":"10.20"},{"v":360.4,"d":"360.40"},8.24,{"v":56.3,"d":"56.30"},{"v":12500,"d":"12500.00"},{"v":410,"d":"410.00"},{"v":15.9,"d":"15.90"},2.87,{"v":629,"d":"629.00"},{"v":57.8,"d":"57.80"},{"v":724,"d":"724.00"},{"v":90.8,"d":"90.80"},{"v":0.858,"d":"0.86"},{"v":47.4,"d":"47.40"},{"v":0.155,"d":"0.16"},{"v":10.7,"d":"10.70"},{"v":49.7,"d":"49.70"}]
[null,81,"356x171x67",{"v":67.1,"d":"67.10"},{"v":363.4,"d":"363.40"},{"v":173.2,"d":"173.20"},{"v":9.1,"d":"9.10"},{"v":15.7,"d":"15.70"},{"v":10.2,"d":"10.20"},{"v":311.6,"d":"311.60"},5.52,{"v":34.2,"d":"34.20"},{"v":19500,"d":"19500.00"},{"v":1360,"d":"1360.00"},{"v":15.1,"d":"15.10"},3.99,{"v":1070,"d":"1070.00"},{"v":157,"d":"157.00"},{"v":1210,"d":"1210.00"},{"v":243,"d":"243.00"},{"v":0.886,"d":"0.89"},{"v":24.4,"d":"24.40"},{"v":0.412,"d":"0.41"},{"v":55.7,"d":"55.70"},{"v":85.5,"d":"85.50"}]
[null,82,"356x171x57",{"v":57,"d":"57.00"},{"v":358,"d":"358.00"},{"v":172.2,"d":"172.20"},{"v":8.1,"d":"8.10"},{"v":13,"d":"13.00"},{"v":10.2,"d":"10.20"},{"v":311.6,"d":"311.60"},6.62,{"v":38.5,"d":"38.50"},{"v":16000,"d":"16000.00"},{"v":1110,"d":"1110.00"},{"v":14.9,"d":"14.90"},3.91,{"v":896,"d":"896.00"},{"v":129,"d":"129.00"},{"v":1010,"d":"1010.00"},{"v":199,"d":"199.00"},{"v":0.882,"d":"0.88"},{"v":28.8,"d":"28.80"},0.33,{"v":33.4,"d":"33.40"},{"v":72.6,"d":"72.60"}]
[null,83,"356x171x51",{"v":51,"d":"51.00"},{"v":355,"d":"355.00"},{"v":171.5,"d":"171.50"},{"v":7.4,"d":"7.40"},{"v":11.5,"d":"11.50"},{"v":10.2,"d":"10.20"},{"v":311.6,"d":"311.60"},7.46,{"v":42.1,"d":"42.10"},{"v":14100,"d":"14100.00"},{"v":968,"d":"968.00"},{"v":14.8,"d":"14.80"},3.86,{"v":796,"d":"796.00"},{"v":113,"d":"113.00"},{"v":896,"d":"896.00"},{"v":174,"d":"174.00"},0.88,{"v":32.1,"d":"32.10"},{"v":0.286,"d":"0.29"},{"v":23.8,"d":"23.80"},{"v":64.9,"d":"64.90"}]
[null,84,"356x171x45",{"v":45,"d":"45.00"},{"v":351.4,"d":"351.40"},{"v":171.1,"d":"171.10"},{"v":7,"d":"7.00"},{"v":9.7,"d":"9.70"},{"v":10.2,"d":"10.20"},{"v":311.6,"d":"311.60"},8.82,{"v":44.5,"d":"44.50"},{"v":12100,"d":"12100.00"},{"v":811,"d":"811.00"},{"v":14.5,"d":"14.50"},3.76,{"v":687,"d":"687.00"},{"v":94.8,"d":"94.80"},{"v":775,"d":"775.00"},{"v":147,"d":"147.00"},{"v":0.874,"d":"0.87"},{"v":36.8,"d":"36.80"},{"v":0.237,"d":"0.24"},{"v":15.8,"d":"15.80"},{"v":57.3,"d":"57.30"}]
[null,85,"356x127x39",{"v":39.1,"d":"39.10"},{"v":353.4,"d":"353.40"},{"v":126,"d":"126.00"},{"v":6.6,"d":"6.60"},{"v":10.7,"d":"10.70"},{"v":10.2,"d":"10.20"},{"v":311.6,"d":"311.60"},5.89,{"v":47.2,"d":"47.20"},{"v":10200,"d":"10200.00"},{"v":358,"d":"358.00"},{"v":14.3,"d":"14.30"},2.68,{"v":576,"d":"576.00"},{"v":56.8,"d":"56.80"},{"v":659,"d":"659.00"},{"v":89,"d":"89.00"},{"v":0.871,"d":"0.87"},{"v":35.2,"d":"35.20"},{"v":0.105,"d":"0.11"},{"v":15.1,"d":"15.10"},{"v":49.8,"d":"49.80"}]
[null,86,"356x127x33",{"v":33.1,"d":"33.10"},{"v":349,"d":"349.00"},{"v":125.4,"d":"125.40"},{"v":6,"d":"6.00"},{"v":8.5,"d":"8.50"},{"v":10.2,"d":"10.20"},{"v":311.6,"d":"311.60"},7.38,{"v":51.9,"d":"51.90"},{"v":8250,"d":"8250.00"},{"v":280,"d":"280.00"},{"v":14,"d":"14.00"},2.58,{"v":473,"d":"473.00"},{"v":44.7,"d":"44.70"},{"v":543,"d":"543.00"},{"v":70.2,"d":"70.20"},{"v":0.863,"d":"0.86"},{"v":42.1,"d":"42.10"},{"v":0.081,"d":"0.08"},8.79,{"v":42.1,"d":"42.10"}]
[null,87,"305x165x54",{"v":54,"d":"54.00"},{"v":310.4,"d":"310.40"},{"v":166.9,"d":"166.90"},{"v":7.9,"d":"7.90"},{"v":13.7,"d":"13.70"},{"v":8.9,"d":"8.90"},{"v":265.2,"d":"265.20"},6.09,{"v":33.6,"d":"33.60"},{"v":11700,"d":"11700.00"},{"v":1060,"d":"1060.00"},{"v":13,"d":"13.00"},3.93,{"v":754,"d":"754.00"},{"v":127,"d":"127.00"},{"v":846,"d":"846.00"},{"v":196,"d":"196.00"},{"v":0.888,"d":"0.89"},{"v":23.6,"d":"23.60"},{"v":0.234,"d":"0.23"},{"v":34.8,"d":"34.80"},{"v":68.8,"d":"68.80"}]
[null,88,"305x165x46",{"v":46.1,"d":"46.10"},{"v":306.6,"d":"306.60"},{"v":165.7,"d":"165.70"},{"v":6.7,"d":"6.70"},{"v":11.8,"d":"11.80"},{"v":8.9,"d":"8.90"},{"v":265.2,"d":"265.20"},7.02,{"v":39.6,"d":"39.60"},{"v":9900,"d":"9900.00"},{"v":896,"d":"896.00"},{"v":13,"d":"13.00"},{"v":3.9,"d":"3.90"},{"v":646,"d":"646.00"},{"v":108,"d":"108.00"},{"v":720,"d":"720.00"},{"v":166,"d":"166.00"},0.89,{"v":27.1,"d":"27.10"},{"v":0.195,"d":"0.20"},{"v":22.2,"d":"22.20"},{"v":58.7,"d":"58.70"}]
[null,89,"305x165x40",{"v":40.3,"d":"40.30"},{"v":303.4,"d":"303.40"},{"v":165,"d":"165.00"},{"v":6,"d":"6.00"},{"v":10.2,"d":"10.20"},{"v":8.9,"d":"8.90"},{"v":265.2,"d":"265.20"},8.09,{"v":44.2,"d":"44.20"},{"v":8500,"d":"8500.00"},{"v":764,"d":"764.00"},{"v":12.9,"d":"12.90"},3.86,{"v":560,"d":"560.00"},{"v":92.6,"d":"92.60"},{"v":623,"d":"623.00"},{"v":142,"d":"142.00"},{"v":0.889,"d":"0.89"},{"v":31,"d":"31.00"},{"v":0.164,"d":"0.16"},{"v":14.7,"d":"14.70"},{"v":51.3,"d":"51.30"}]
[null,90,"305x127x48",{"v":48.1,"d":"48.10"},{"v":311,"d":"311.00"},{"v":125.3,"d":"125.30"},{"v":9,"d":"9.00"},{"v":14,"d":"14.00"},{"v":8.9,"d":"8.90"},{"v":265.2,"d":"265.20"},4.48,{"v":29.5,"d":"29.50"},{"v":9570,"d":"9570.00"},{"v":461,"d":"461.00"},{"v":12.5,"d":"12.50"},2.74,{"v":616,"d":"616.00"},{"v":73.6,"d":"73.60"},{"v":711,"d":"711.00"},{"v":116,"d":"116.00"},{"v":0.873,"d":"0.87"},{"v":23.3,"d":"23.30"},{"v":0.102,"d":"0.10"},{"v":31.8,"d":"31.80"},{"v":61.2,"d":"61.20"}]
[null,91,"305x127x42",{"v":41.9,"d":"41.90"},{"v":307.2,"d":"307.20"},{"v":124.3,"d":"124.30"},{"v":8,"d":"8.00"},{"v":12.1,"d":"12.10"},{"v":8.9,"d":"8.90"},{"v":265.2,"d":"265.20"},5.14,{"v":33.2,"d":"33.20"},{"v":8200,"d":"8200.00"},{"v":389,"d":"389.00"},{"v":12.4,"d":"12.40"},{"v":2.7,"d":"2.70"},{"v":534,"d":"534.00"},{"v":62.6,"d":"62.60"},{"v":614,"d":"614.00"},{"v":98.4,"d":"98.40"},{"v":0.872,"d":"0.87"},{"v":26.5,"d":"26.50"},{"v":0.0846,"d":"0.08"},{"v":21.1,"d":"21.10"},{"v":53.4,"d":"53.40"}]
[null,92,"305x127x37",{"v":37,"d":"37.00"},{"v":304.4,"d":"304.40"},{"v":123.4,"d":"123.40"},{"v":7.1,"d":"7.10"},{"v":10.7,"d":"10.70"},{"v":8.9,"d":"8.90"},{"v":265.2,"d":"265.20"},5.77,{"v":37.4,"d":"37.40"},{"v":7170,"d":"7170.00"},{"v":336,"d":"336.00"},{"v":12.3,"d":"12.30"},2.67,{"v":471,"d":"471.00"},{"v":54.5,"d":"54.50"},{"v":539,"d":"539.00"},{"v":85.4,"d":"85.40"},{"v":0.871,"d":"0.87"},{"v":29.7,"d":"29.70"},{"v":0.0725,"d":"0.07"},{"v":14.8,"d":"14.80"},{"v":47.2,"d":"47.20"}]
[null,93,"305x102x33",{"v":32.8,"d":"32.80"},{"v":312.7,"d":"312.70"},{"v":102.4,"d":"102.40"},{"v":6.6,"d":"6.60"},{"v":10.8,"d":"10.80"},{"v":7.6,"d":"7.60"},{"v":275.9,"d":"275.90"},4.74,{"v":41.8,"d":"41.80"},{"v":6500,"d":"6500.00"},{"v":194,"d":"194.00"},{"v":12.5,"d":"12.50"},2.15,{"v":416,"d":"416.00"},{"v":37.9,"d":"37.90"},{"v":481,"d":"481.00"},{"v":60,"d":"60.00"},{"v":0.867,"d":"0.87"},{"v":31.6,"d":"31.60"},{"v":0.0442,"d":"0.04"},{"v":12.2,"d":"12.20"},{"v":41.8,"d":"41.80"}]
[null,94,"305x102x28",{"v":28.2,"d":"28.20"},{"v":308.7,"d":"308.70"},{"v":101.8,"d":"101.80"},{"v":6,"d":"6.00"},{"v":8.8,"d":"8.80"},{"v":7.6,"d":"7.60"},{"v":275.9,"d":"275.90"},5.78,{"v":46,"d":"46.00"},{"v":5370,"d":"5370.00"},{"v":155,"d":"155.00"},{"v":12.2,"d":"12.20"},2.08,{"v":348,"d":"348.00"},{"v":30.5,"d":"30.50"},{"v":403,"d":"403.00"},{"v":48.4,"d":"48.40"},{"v":0.859,"d":"0.86"},{"v":37.4,"d":"37.40"},{"v":0.0349,"d":"0.03"},{"v":7.4,"d":"7.40"},{"v":35.9,"d":"35.90"}]
[null,95,"305x102x25",{"v":24.8,"d":"24.80"},{"v":305.1,"d":"305.10"},{"v":101.6,"d":"101.60"},{"v":5.8,"d":"5.80"},{"v":7,"d":"7.00"},{"v":7.6,"d":"7.60"},{"v":275.9,"d":"275.90"},7.26,{"v":47.6,"d":"47.60"},{"v":4460,"d":"4460.00"},{"v":123,"d":"123.00"},{"v":11.9,"d":"11.90"},1.97,{"v":292,"d":"292.00"},{"v":24.2,"d":"24.20"},{"v":342,"d":"342.00"},{"v":38.8,"d":"38.80"},{"v":0.849,"d":"0.85"},{"v":43.1,"d":"43.10"},{"v":0.027,"d":"0.03"},4.77,{"v":31.6,"d":"31.60"}]
[null,96,"254x146x43",{"v":43,"d":"43.00"},{"v":259.6,"d":"259.60"},{"v":147.3,"d":"147.30"},{"v":7.2,"d":"7.20"},{"v":12.7,"d":"12.70"},{"v":7.6,"d":"7.60"},{"v":219,"d":"219.00"},{"v":5.8,"d":"5.80"},{"v":30.4,"d":"30.40"},{"v":6540,"d":"6540.00"},{"v":677,"d":"677.00"},{"v":10.9,"d":"10.90"},3.52,{"v":504,"d":"504.00"},{"v":92,"d":"92.00"},{"v":566,"d":"566.00"},{"v":141,"d":"141.00"},0.89,{"v":21.1,"d":"21.10"},{"v":0.103,"d":"0.10"},{"v":23.9,"d":"23.90"},{"v":54.8,"d":"54.80"}]
[null,97,"254x146x37",{"v":37,"d":"37.00"},{"v":256,"d":"256.00"},{"v":146.4,"d":"146.40"},{"v":6.3,"d":"6.30"},{"v":10.9,"d":"10.90"},{"v":7.6,"d":"7.60"},{"v":219,"d":"219.00"},6.72,{"v":34.8,"d":"34.80"},{"v":5540,"d":"5540.00"},{"v":571,"d":"571.00"},{"v":10.8,"d":"10.80"},3.48,{"v":433,"d":"433.00"},{"v":78,"d":"78.00"},{"v":483,"d":"483.00"},{"v":119,"d":"119.00"},{"v":0.889,"d":"0.89"},{"v":24.3,"d":"24.30"},{"v":0.0857,"d":"0.09"},{"v":15.3,"d":"15.30"},{"v":47.2,"d":"47.20"}]
[null,98,"254x146x31",{"v":31.1,"d":"31.10"},{"v":251.4,"d":"251.40"},{"v":146.1,"d":"146.10"},{"v":6,"d":"6.00"},{"v":8.6,"d":"8.60"},{"v":7.6,"d":"7.60"},{"v":219,"d":"219.00"},8.49,{"v":36.5,"d":"36.50"},{"v":4410,"d":"4410.00"},{"v":448,"d":"448.00"},{"v":10.5,"d":"10.50"},3.36,{"v":351,"d":"351.00"},{"v":61.3,"d":"61.30"},{"v":393,"d":"393.00"},{"v":94.1,"d":"94.10"},{"v":0.879,"d":"0.88"},{"v":29.6,"d":"29.60"},{"v":0.066,"d":"0.07"},8.55,{"v":39.7,"d":"39.70"}]
[null,99,"254x102x28",{"v":28.3,"d":"28.30"},{"v":260.4,"d":"260.40"},{"v":102.2,"d":"102.20"},{"v":6.3,"d":"6.30"},{"v":10,"d":"10.00"},{"v":7.6,"d":"7.60"},{"v":225.2,"d":"225.20"},5.11,{"v":35.7,"d":"35.70"},{"v":4000,"d":"4000.00"},{"v":179,"d":"179.00"},{"v":10.5,"d":"10.50"},2.22,{"v":308,"d":"308.00"},{"v":34.9,"d":"34.90"},{"v":353,"d":"353.00"},{"v":54.8,"d":"54.80"},{"v":0.874,"d":"0.87"},{"v":27.5,"d":"27.50"},{"v":0.028,"d":"0.03"},9.57,{"v":36.1,"d":"36.10"}]
[null,100,"254x102x25",{"v":25.2,"d":"25.20"},{"v":257.2,"d":"257.20"},{"v":101.9,"d":"101.90"},{"v":6,"d":"6.00"},{"v":8.4,"d":"8.40"},{"v":7.6,"d":"7.60"},{"v":225.2,"d":"225.20"},6.07,{"v":37.5,"d":"37.50"},{"v":3410,"d":"3410.00"},{"v":149,"d":"149.00"},{"v":10.3,"d":"10.30"},2.15,{"v":266,"d":"266.00"},{"v":29.2,"d":"29.20"},{"v":306,"d":"306.00"},{"v":46,"d":"46.00"},{"v":0.868,"d":"0.87"},{"v":31.4,"d":"31.40"},{"v":0.023,"d":"0.02"},6.42,{"v":32,"d":"32.00"}]
[null,101,"254x102x22",{"v":22,"d":"22.00"},{"v":254,"d":"254.00"},{"v":101.6,"d":"101.60"},{"v":5.7,"d":"5.70"},{"v":6.8,"d":"6.80"},{"v":7.6,"d":"7.60"},{"v":225.2,"d":"225.20"},7.47,{"v":39.5,"d":"39.50"},{"v":2840,"d":"2840.00"},{"v":119,"d":"119.00"},{"v":10.1,"d":"10.10"},2.06,{"v":224,"d":"224.00"},{"v":23.5,"d":"23.50"},{"v":259,"d":"259.00"},{"v":37.3,"d":"37.30"},{"v":0.856,"d":"0.86"},{"v":36.3,"d":"36.30"},{"v":0.0182,"d":"0.02"},4.15,{"v":28,"d":"28.00"}]
[null,102,"203x133x30",{"v":30,"d":"30.00"},{"v":206.8,"d":"206.80"},{"v":133.9,"d":"133.90"},{"v":6.4,"d":"6.40"},{"v":9.6,"d":"9.60"},{"v":7.6,"d":"7.60"},{"v":172.4,"d":"172.40"},6.97,{"v":26.9,"d":"26.90"},{"v":2900,"d":"2900.00"},{"v":385,"d":"385.00"},8.71,3.17,{"v":280,"d":"280.00"},{"v":57.5,"d":"57.50"},{"v":314,"d":"314.00"},{"v":88.2,"d":"88.20"},{"v":0.881,"d":"0.88"},{"v":21.5,"d":"21.50"},{"v":0.0374,"d":"0.04"},{"v":10.3,"d":"10.30"},{"v":38.2,"d":"38.20"}]
[null,103,"203x133x25",{"v":25.1,"d":"25.10"},{"v":203.2,"d":"203.20"},{"v":133.2,"d":"133.20"},{"v":5.7,"d":"5.70"},{"v":7.8,"d":"7.80"},{"v":7.6,"d":"7.60"},{"v":172.4,"d":"172.40"},8.54,{"v":30.2,"d":"30.20"},{"v":2340,"d":"2340.00"},{"v":308,"d":"308.00"},8.56,{"v":3.1,"d":"3.10"},{"v":230,"d":"230.00"},{"v":46.2,"d":"46.20"},{"v":258,"d":"258.00"},{"v":70.9,"d":"70.90"},{"v":0.877,"d":"0.88"},{"v":25.6,"d":"25.60"},{"v":0.0294,"d":"0.03"},5.96,{"v":32,"d":"32.00"}]
[null,104,"203x102x23",{"v":23.1,"d":"23.10"},{"v":203.2,"d":"203.20"},{"v":101.8,"d":"101.80"},{"v":5.4,"d":"5.40"},{"v":9.3,"d":"9.30"},{"v":7.6,"d":"7.60"},{"v":169.4,"d":"169.40"},5.47,{"v":31.4,"d":"31.40"},{"v":2100,"d":"2100.00"},{"v":164,"d":"164.00"},8.46,2.36,{"v":207,"d":"207.00"},{"v":32.2,"d":"32.20"},{"v":234,"d":"234.00"},{"v":49.7,"d":"49.70"},{"v":0.888,"d":"0.89"},{"v":22.4,"d":"22.40"},{"v":0.0154,"d":"0.02"},7.02,{"v":29.4,"d":"29.40"}]
[null,105,"178x102x19",{"v":19,"d":"19.00"},{"v":177.8,"d":"177.80"},{"v":101.2,"d":"101.20"},{"v":4.8,"d":"4.80"},{"v":7.9,"d":"7.90"},{"v":7.6,"d":"7.60"},{"v":146.8,"d":"146.80"},6.41,{"v":30.6,"d":"30.60"},{"v":1360,"d":"1360.00"},{"v":137,"d":"137.00"},7.48,2.37,{"v":153,"d":"153.00"},{"v":27,"d":"27.00"},{"v":171,"d":"171.00"},{"v":41.6,"d":"41.60"},{"v":0.886,"d":"0.89"},{"v":22.6,"d":"22.60"},{"v":0.0099,"d":"0.01"},4.41,{"v":24.3,"d":"24.30"}]
[null,106,"152x89x16",{"v":16,"d":"16.00"},{"v":152.4,"d":"152.40"},{"v":88.7,"d":"88.70"},{"v":4.5,"d":"4.50"},{"v":7.7,"d":"7.70"},{"v":7.6,"d":"7.60"},{"v":121.8,"d":"121.80"},5.76,{"v":27.1,"d":"27.10"},{"v":834,"d":"834.00"},{"v":89.8,"d":"89.80"},6.41,{"v":2.1,"d":"2.10"},{"v":109,"d":"109.00"},{"v":20.2,"d":"20.20"},{"v":123,"d":"123.00"},{"v":31.2,"d":"31.20"},{"v":0.889,"d":"0.89"},{"v":19.5,"d":"19.50"},{"v":0.0047,"d":"0.00"},3.56,{"v":20.3,"d":"20.30"}]
[null,107,"127x76x13",{"v":13,"d":"13.00"},{"v":127,"d":"127.00"},{"v":76,"d":"76.00"},{"v":4,"d":"4.00"},{"v":7.6,"d":"7.60"},{"v":7.6,"d":"7.60"},{"v":96.6,"d":"96.60"},{"v":5,"d":"5.00"},{"v":24.2,"d":"24.20"},{"v":473,"d":"473.00"},{"v":55.7,"d":"55.70"},5.35,1.84,{"v":74.6,"d":"74.60"},{"v":14.7,"d":"14.70"},{"v":84.2,"d":"84.20"},{"v":22.6,"d":"22.60"},{"v":0.894,"d":"0.89"},{"v":16.3,"d":"16.30"},{"v":2E-3,"d":"0.00"},2.85,{"v":16.5,"d":"16.50"}]
[null,108]
["UC",109,"356x406x1299",{"v":1299,"d":"1299.00"},{"v":600,"d":"600.00"},{"v":476,"d":"476.00"},{"v":100,"d":"100.00"},{"v":140,"d":"140.00"},{"v":15.4,"d":"15.40"},{"v":290,"d":"290.00"},{"v":1.7,"d":"1.70"},{"v":2.9,"d":"2.90"},{"v":755000,"d":"755000.00"},{"v":254000,"d":"254000.00"},{"v":21.4,"d":"21.40"},{"v":12.4,"d":"12.40"},{"v":25200,"d":"25200.00"},{"v":10700,"d":"10700.00"},{"v":33200,"d":"33200.00"},{"v":16700,"d":"16700.00"},{"v":0.846,"d":"0.85"},3.42,{"v":133.1,"d":"133.10"},{"v":94500,"d":"94500.00"},{"v":1655,"d":"1655.00"}]
[null,110,"356x406x1202",{"v":1202,"d":"1202.00"},{"v":580,"d":"580.00"},{"v":471,"d":"471.00"},{"v":95,"d":"95.00"},{"v":130,"d":"130.00"},{"v":15.4,"d":"15.40"},{"v":290,"d":"290.00"},1.81,3.05,{"v":664000,"d":"664000.00"},{"v":229000,"d":"229000.00"},{"v":20.8,"d":"20.80"},{"v":12.2,"d":"12.20"},{"v":22900,"d":"22900.00"},{"v":9710,"d":"9710.00"},{"v":30000,"d":"30000.00"},{"v":15200,"d":"15200.00"},{"v":0.842,"d":"0.84"},3.59,{"v":114.6,"d":"114.60"},{"v":76300,"d":"76300.00"},{"v":1531,"d":"1531.00"}]
[null,111,"356x406x1086",{"v":1086,"d":"1086.00"},{"v":569,"d":"569.00"},{"v":454,"d":"454.00"},{"v":78,"d":"78.00"},{"v":125,"d":"125.00"},{"v":15,"d":"15.00"},{"v":290,"d":"290.00"},1.82,3.72,{"v":596000,"d":"596000.00"},{"v":196000,"d":"196000.00"},{"v":20.7,"d":"20.70"},{"v":11.9,"d":"11.90"},{"v":20900,"d":"20900.00"},{"v":8640,"d":"8640.00"},{"v":27200,"d":"27200.00"},{"v":13400,"d":"13400.00"},{"v":0.852,"d":"0.85"},3.79,{"v":96.1,"d":"96.10"},{"v":60500,"d":"60500.00"},{"v":1386,"d":"1386.00"}]
[null,112,"356x406x990",{"v":990,"d":"990.00"},{"v":550,"d":"550.00"},{"v":448,"d":"448.00"},{"v":71.9,"d":"71.90"},{"v":115,"d":"115.00"},{"v":15,"d":"15.00"},{"v":290,"d":"290.00"},1.95,4.03,{"v":519000,"d":"519000.00"},{"v":173000,"d":"173000.00"},{"v":20.3,"d":"20.30"},{"v":11.7,"d":"11.70"},{"v":18900,"d":"18900.00"},{"v":7740,"d":"7740.00"},{"v":24300,"d":"24300.00"},{"v":12000,"d":"12000.00"},{"v":0.851,"d":"0.85"},4.02,{"v":81.5,"d":"81.50"},{"v":46900,"d":"46900.00"},{"v":1262,"d":"1262.00"}]
[null,113,"356x406x900",{"v":900,"d":"900.00"},{"v":531,"d":"531.00"},{"v":442,"d":"442.00"},{"v":65.9,"d":"65.90"},{"v":106,"d":"106.00"},{"v":15,"d":"15.00"},{"v":290,"d":"290.00"},2.08,{"v":4.4,"d":"4.40"},{"v":450000,"d":"450000.00"},{"v":153000,"d":"153000.00"},{"v":19.8,"d":"19.80"},{"v":11.6,"d":"11.60"},{"v":17000,"d":"17000.00"},{"v":6940,"d":"6940.00"},{"v":21600,"d":"21600.00"},{"v":10700,"d":"10700.00"},{"v":0.849,"d":"0.85"},4.26,{"v":68.9,"d":"68.90"},{"v":36400,"d":"36400.00"},{"v":1149,"d":"1149.00"}]
[null,114,"356x406x818",{"v":818,"d":"818.00"},{"v":514,"d":"514.00"},{"v":437,"d":"437.00"},{"v":60.5,"d":"60.50"},{"v":97,"d":"97.00"},{"v":15,"d":"15.00"},{"v":290,"d":"290.00"},2.25,4.79,{"v":392000,"d":"392000.00"},{"v":136000,"d":"136000.00"},{"v":19.4,"d":"19.40"},{"v":11.4,"d":"11.40"},{"v":15300,"d":"15300.00"},{"v":6200,"d":"6200.00"},{"v":19300,"d":"19300.00"},{"v":9560,"d":"9560.00"},{"v":0.847,"d":"0.85"},4.55,{"v":58.6,"d":"58.60"},{"v":27800,"d":"27800.00"},{"v":1043,"d":"1043.00"}]
[null,115,"356x406x744",{"v":744,"d":"744.00"},{"v":498,"d":"498.00"},{"v":432,"d":"432.00"},{"v":55.6,"d":"55.60"},{"v":88.9,"d":"88.90"},{"v":15,"d":"15.00"},{"v":290,"d":"290.00"},2.43,5.22,{"v":342000,"d":"342000.00"},{"v":120000,"d":"120000.00"},{"v":19,"d":"19.00"},{"v":11.3,"d":"11.30"},{"v":13700,"d":"13700.00"},{"v":5550,"d":"5550.00"},{"v":17200,"d":"17200.00"},{"v":8550,"d":"8550.00"},{"v":0.845,"d":"0.85"},4.86,{"v":50,"d":"50.00"},{"v":21400,"d":"21400.00"},{"v":948,"d":"948.00"}]
[null,116,"356x406x677",{"v":677,"d":"677.00"},{"v":483,"d":"483.00"},{"v":428,"d":"428.00"},{"v":51.2,"d":"51.20"},{"v":81.5,"d":"81.50"},{"v":15,"d":"15.00"},{"v":290,"d":"290.00"},2.63,5.66,{"v":300000,"d":"300000.00"},{"v":107000,"d":"107000.00"},{"v":18.6,"d":"18.60"},{"v":11.1,"d":"11.10"},{"v":12400,"d":"12400.00"},{"v":4990,"d":"4990.00"},{"v":15400,"d":"15400.00"},{"v":7680,"d":"7680.00"},{"v":0.844,"d":"0.84"},5.19,{"v":42.9,"d":"42.90"},{"v":16400,"d":"16400.00"},{"v":863,"d":"863.00"}]
[null,117,"356x406x634",{"v":633.9,"d":"633.90"},{"v":474.6,"d":"474.60"},{"v":424,"d":"424.00"},{"v":47.6,"d":"47.60"},{"v":77,"d":"77.00"},{"v":15.2,"d":"15.20"},{"v":290.2,"d":"290.20"},2.75,{"v":6.1,"d":"6.10"},{"v":275000,"d":"275000.00"},{"v":98100,"d":"98100.00"},{"v":18.4,"d":"18.40"},{"v":11,"d":"11.00"},{"v":11600,"d":"11600.00"},{"v":4630,"d":"4630.00"},{"v":14200,"d":"14200.00"},{"v":7110,"d":"7110.00"},{"v":0.842,"d":"0.84"},5.46,{"v":38.8,"d":"38.80"},{"v":13700,"d":"13700.00"},{"v":808,"d":"808.00"}]
[null,118,"356x406x592",{"v":592,"d":"592.00"},{"v":465,"d":"465.00"},{"v":421,"d":"421.00"},{"v":45,"d":"45.00"},{"v":72.3,"d":"72.30"},{"v":15,"d":"15.00"},{"v":290,"d":"290.00"},2.91,6.44,{"v":250000,"d":"250000.00"},{"v":90200,"d":"90200.00"},{"v":18.2,"d":"18.20"},{"v":10.9,"d":"10.90"},{"v":10800,"d":"10800.00"},{"v":4280,"d":"4280.00"},{"v":13100,"d":"13100.00"},{"v":6570,"d":"6570.00"},{"v":0.843,"d":"0.84"},5.72,{"v":34.7,"d":"34.70"},{"v":11400,"d":"11400.00"},{"v":755,"d":"755.00"}]
[null,119,"356x406x551",{"v":551,"d":"551.00"},{"v":455.6,"d":"455.60"},{"v":418.5,"d":"418.50"},{"v":42.1,"d":"42.10"},{"v":67.5,"d":"67.50"},{"v":15.2,"d":"15.20"},{"v":290.2,"d":"290.20"},{"v":3.1,"d":"3.10"},6.89,{"v":227000,"d":"227000.00"},{"v":82700,"d":"82700.00"},{"v":18,"d":"18.00"},{"v":10.9,"d":"10.90"},{"v":9960,"d":"9960.00"},{"v":3950,"d":"3950.00"},{"v":12100,"d":"12100.00"},{"v":6060,"d":"6060.00"},{"v":0.842,"d":"0.84"},6.05,{"v":31.1,"d":"31.10"},{"v":9240,"d":"9240.00"},{"v":702,"d":"702.00"}]
[null,120,"356x406x509",{"v":509,"d":"509.00"},{"v":446,"d":"446.00"},{"v":416,"d":"416.00"},{"v":39.1,"d":"39.10"},{"v":62.7,"d":"62.70"},{"v":15,"d":"15.00"},{"v":290,"d":"290.00"},3.32,7.42,{"v":204000,"d":"204000.00"},{"v":75400,"d":"75400.00"},{"v":17.8,"d":"17.80"},{"v":10.8,"d":"10.80"},{"v":9170,"d":"9170.00"},{"v":3620,"d":"3620.00"},{"v":11000,"d":"11000.00"},{"v":5550,"d":"5550.00"},0.84,6.42,{"v":27.6,"d":"27.60"},{"v":7390,"d":"7390.00"},{"v":649,"d":"649.00"}]
[null,121,"356x406x467",{"v":467,"d":"467.00"},{"v":436.6,"d":"436.60"},{"v":412.2,"d":"412.20"},{"v":35.8,"d":"35.80"},{"v":58,"d":"58.00"},{"v":15.2,"d":"15.20"},{"v":290.2,"d":"290.20"},3.55,8.11,{"v":183000,"d":"183000.00"},{"v":67800,"d":"67800.00"},{"v":17.5,"d":"17.50"},{"v":10.7,"d":"10.70"},{"v":8380,"d":"8380.00"},{"v":3290,"d":"3290.00"},{"v":10000,"d":"10000.00"},{"v":5030,"d":"5030.00"},{"v":0.839,"d":"0.84"},6.85,{"v":24.3,"d":"24.30"},{"v":5810,"d":"5810.00"},{"v":595,"d":"595.00"}]
[null,122,"356x406x393",{"v":393,"d":"393.00"},{"v":419,"d":"419.00"},{"v":407,"d":"407.00"},{"v":30.6,"d":"30.60"},{"v":49.2,"d":"49.20"},{"v":15.2,"d":"15.20"},{"v":290.2,"d":"290.20"},4.14,9.48,{"v":147000,"d":"147000.00"},{"v":55400,"d":"55400.00"},{"v":17.1,"d":"17.10"},{"v":10.5,"d":"10.50"},{"v":7000,"d":"7000.00"},{"v":2720,"d":"2720.00"},{"v":8220,"d":"8220.00"},{"v":4150,"d":"4150.00"},{"v":0.837,"d":"0.84"},7.85,{"v":18.9,"d":"18.90"},{"v":3550,"d":"3550.00"},{"v":501,"d":"501.00"}]
[null,123,"356x406x340",{"v":339.9,"d":"339.90"},{"v":406.4,"d":"406.40"},{"v":403,"d":"403.00"},{"v":26.6,"d":"26.60"},{"v":42.9,"d":"42.90"},{"v":15.2,"d":"15.20"},{"v":290.2,"d":"290.20"},{"v":4.7,"d":"4.70"},10.91,{"v":123000,"d":"123000.00"},{"v":46900,"d":"46900.00"},{"v":16.8,"d":"16.80"},{"v":10.4,"d":"10.40"},{"v":6030,"d":"6030.00"},{"v":2330,"d":"2330.00"},{"v":7000,"d":"7000.00"},{"v":3540,"d":"3540.00"},{"v":0.836,"d":"0.84"},8.85,{"v":15.5,"d":"15.50"},{"v":2340,"d":"2340.00"},{"v":433,"d":"433.00"}]
[null,124,"356x406x287",{"v":287.1,"d":"287.10"},{"v":393.6,"d":"393.60"},{"v":399,"d":"399.00"},{"v":22.6,"d":"22.60"},{"v":36.5,"d":"36.50"},{"v":15.2,"d":"15.20"},{"v":290.2,"d":"290.20"},5.47,12.84,{"v":99900,"d":"99900.00"},{"v":38700,"d":"38700.00"},{"v":16.5,"d":"16.50"},{"v":10.3,"d":"10.30"},{"v":5070,"d":"5070.00"},{"v":1940,"d":"1940.00"},{"v":5810,"d":"5810.00"},{"v":2950,"d":"2950.00"},{"v":0.835,"d":"0.84"},{"v":10.2,"d":"10.20"},{"v":12.3,"d":"12.30"},{"v":1440,"d":"1440.00"},{"v":366,"d":"366.00"}]
[null,125,"356x406x235",{"v":235.1,"d":"235.10"},{"v":381,"d":"381.00"},{"v":394.8,"d":"394.80"},{"v":18.4,"d":"18.40"},{"v":30.2,"d":"30.20"},{"v":15.2,"d":"15.20"},{"v":290.2,"d":"290.20"},6.54,15.77,{"v":79100,"d":"79100.00"},{"v":31000,"d":"31000.00"},{"v":16.3,"d":"16.30"},{"v":10.2,"d":"10.20"},{"v":4150,"d":"4150.00"},{"v":1570,"d":"1570.00"},{"v":4690,"d":"4690.00"},{"v":2380,"d":"2380.00"},{"v":0.835,"d":"0.84"},{"v":12,"d":"12.00"},9.54,{"v":812,"d":"812.00"},{"v":299,"d":"299.00"}]
[null,126,"356x368x202",{"v":201.9,"d":"201.90"},{"v":374.6,"d":"374.60"},{"v":374.7,"d":"374.70"},{"v":16.5,"d":"16.50"},{"v":27,"d":"27.00"},{"v":15.2,"d":"15.20"},{"v":290.2,"d":"290.20"},6.94,17.59,{"v":66300,"d":"66300.00"},{"v":23700,"d":"23700.00"},{"v":16.1,"d":"16.10"},{"v":9.6,"d":"9.60"},{"v":3540,"d":"3540.00"},{"v":1260,"d":"1260.00"},{"v":3970,"d":"3970.00"},{"v":1920,"d":"1920.00"},{"v":0.844,"d":"0.84"},{"v":13.3,"d":"13.30"},7.16,{"v":558,"d":"558.00"},{"v":257,"d":"257.00"}]
[null,127,"356x368x177",{"v":177,"d":"177.00"},{"v":368.2,"d":"368.20"},{"v":372.6,"d":"372.60"},{"v":14.4,"d":"14.40"},{"v":23.8,"d":"23.80"},{"v":15.2,"d":"15.20"},{"v":290.2,"d":"290.20"},7.83,20.15,{"v":57100,"d":"57100.00"},{"v":20500,"d":"20500.00"},{"v":15.9,"d":"15.90"},9.54,{"v":3100,"d":"3100.00"},{"v":1100,"d":"1100.00"},{"v":3460,"d":"3460.00"},{"v":1670,"d":"1670.00"},{"v":0.843,"d":"0.84"},{"v":15,"d":"15.00"},6.09,{"v":381,"d":"381.00"},{"v":226,"d":"226.00"}]
[null,128,"356x368x153",{"v":152.9,"d":"152.90"},{"v":362,"d":"362.00"},{"v":370.5,"d":"370.50"},{"v":12.3,"d":"12.30"},{"v":20.7,"d":"20.70"},{"v":15.2,"d":"15.20"},{"v":290.2,"d":"290.20"},8.95,23.59,{"v":48600,"d":"48600.00"},{"v":17600,"d":"17600.00"},{"v":15.8,"d":"15.80"},9.49,{"v":2680,"d":"2680.00"},{"v":948,"d":"948.00"},{"v":2960,"d":"2960.00"},{"v":1430,"d":"1430.00"},{"v":0.843,"d":"0.84"},{"v":17,"d":"17.00"},5.11,{"v":251,"d":"251.00"},{"v":195,"d":"195.00"}]
[null,129,"356x368x129",{"v":129,"d":"129.00"},{"v":355.6,"d":"355.60"},{"v":368.6,"d":"368.60"},{"v":10.4,"d":"10.40"},{"v":17.5,"d":"17.50"},{"v":15.2,"d":"15.20"},{"v":290.2,"d":"290.20"},10.53,{"v":27.9,"d":"27.90"},{"v":40200,"d":"40200.00"},{"v":14600,"d":"14600.00"},{"v":15.6,"d":"15.60"},9.43,{"v":2260,"d":"2260.00"},{"v":793,"d":"793.00"},{"v":2480,"d":"2480.00"},{"v":1200,"d":"1200.00"},{"v":0.845,"d":"0.85"},{"v":19.8,"d":"19.80"},4.18,{"v":153,"d":"153.00"},{"v":164,"d":"164.00"}]
[null,130,"305x305x283",{"v":282.9,"d":"282.90"},{"v":365.3,"d":"365.30"},{"v":322.2,"d":"322.20"},{"v":26.8,"d":"26.80"},{"v":44.1,"d":"44.10"},{"v":15.2,"d":"15.20"},{"v":246.7,"d":"246.70"},3.65,9.21,{"v":78900,"d":"78900.00"},{"v":24600,"d":"24600.00"},{"v":14.8,"d":"14.80"},8.27,{"v":4320,"d":"4320.00"},{"v":1530,"d":"1530.00"},{"v":5110,"d":"5110.00"},{"v":2340,"d":"2340.00"},{"v":0.856,"d":"0.86"},7.65,6.35,{"v":2030,"d":"2030.00"},{"v":360,"d":"360.00"}]
[null,131,"305x305x240",{"v":240,"d":"240.00"},{"v":352.5,"d":"352.50"},{"v":318.4,"d":"318.40"},{"v":23,"d":"23.00"},{"v":37.7,"d":"37.70"},{"v":15.2,"d":"15.20"},{"v":246.7,"d":"246.70"},4.22,10.73,{"v":64200,"d":"64200.00"},{"v":20300,"d":"20300.00"},{"v":14.5,"d":"14.50"},8.15,{"v":3640,"d":"3640.00"},{"v":1280,"d":"1280.00"},{"v":4250,"d":"4250.00"},{"v":1950,"d":"1950.00"},{"v":0.854,"d":"0.85"},8.74,5.03,{"v":1270,"d":"1270.00"},{"v":306,"d":"306.00"}]
[null,132,"305x305x198",{"v":198.1,"d":"198.10"},{"v":339.9,"d":"339.90"},{"v":314.5,"d":"314.50"},{"v":19.1,"d":"19.10"},{"v":31.4,"d":"31.40"},{"v":15.2,"d":"15.20"},{"v":246.7,"d":"246.70"},5.01,12.92,{"v":50900,"d":"50900.00"},{"v":16300,"d":"16300.00"},{"v":14.2,"d":"14.20"},8.04,{"v":3000,"d":"3000.00"},{"v":1040,"d":"1040.00"},{"v":3440,"d":"3440.00"},{"v":1580,"d":"1580.00"},{"v":0.854,"d":"0.85"},{"v":10.2,"d":"10.20"},3.88,{"v":734,"d":"734.00"},{"v":252,"d":"252.00"}]
[null,133,"305x305x158",{"v":158.1,"d":"158.10"},{"v":327.1,"d":"327.10"},{"v":311.2,"d":"311.20"},{"v":15.8,"d":"15.80"},{"v":25,"d":"25.00"},{"v":15.2,"d":"15.20"},{"v":246.7,"d":"246.70"},6.22,15.61,{"v":38700,"d":"38700.00"},{"v":12600,"d":"12600.00"},{"v":13.9,"d":"13.90"},{"v":7.9,"d":"7.90"},{"v":2370,"d":"2370.00"},{"v":808,"d":"808.00"},{"v":2680,"d":"2680.00"},{"v":1230,"d":"1230.00"},{"v":0.852,"d":"0.85"},{"v":12.4,"d":"12.40"},2.87,{"v":378,"d":"378.00"},{"v":201,"d":"201.00"}]
[null,134,"305x305x137",{"v":136.9,"d":"136.90"},{"v":320.5,"d":"320.50"},{"v":309.2,"d":"309.20"},{"v":13.8,"d":"13.80"},{"v":21.7,"d":"21.70"},{"v":15.2,"d":"15.20"},{"v":246.7,"d":"246.70"},7.12,17.88,{"v":32800,"d":"32800.00"},{"v":10700,"d":"10700.00"},{"v":13.7,"d":"13.70"},7.83,{"v":2050,"d":"2050.00"},{"v":692,"d":"692.00"},{"v":2300,"d":"2300.00"},{"v":1050,"d":"1050.00"},{"v":0.852,"d":"0.85"},{"v":14.1,"d":"14.10"},2.39,{"v":249,"d":"249.00"},{"v":174,"d":"174.00"}]
[null,135,"305x305x118",{"v":117.9,"d":"117.90"},{"v":314.5,"d":"314.50"},{"v":307.4,"d":"307.40"},{"v":12,"d":"12.00"},{"v":18.7,"d":"18.70"},{"v":15.2,"d":"15.20"},{"v":246.7,"d":"246.70"},8.22,20.56,{"v":27700,"d":"27700.00"},{"v":9060,"d":"9060.00"},{"v":13.6,"d":"13.60"},7.77,{"v":1760,"d":"1760.00"},{"v":589,"d":"589.00"},{"v":1960,"d":"1960.00"},{"v":895,"d":"895.00"},{"v":0.852,"d":"0.85"},{"v":16.1,"d":"16.10"},1.98,{"v":161,"d":"161.00"},{"v":150,"d":"150.00"}]
[null,136,"305x305x97",{"v":96.9,"d":"96.90"},{"v":307.9,"d":"307.90"},{"v":305.3,"d":"305.30"},{"v":9.9,"d":"9.90"},{"v":15.4,"d":"15.40"},{"v":15.2,"d":"15.20"},{"v":246.7,"d":"246.70"},9.91,24.92,{"v":22200,"d":"22200.00"},{"v":7310,"d":"7310.00"},{"v":13.4,"d":"13.40"},7.69,{"v":1450,"d":"1450.00"},{"v":479,"d":"479.00"},{"v":1590,"d":"1590.00"},{"v":726,"d":"726.00"},{"v":0.851,"d":"0.85"},{"v":19.2,"d":"19.20"},1.56,{"v":91.2,"d":"91.20"},{"v":123,"d":"123.00"}]
[null,137,"254x254x167",{"v":167.1,"d":"167.10"},{"v":289.1,"d":"289.10"},{"v":265.2,"d":"265.20"},{"v":19.2,"d":"19.20"},{"v":31.7,"d":"31.70"},{"v":12.7,"d":"12.70"},{"v":200.3,"d":"200.30"},4.18,10.43,{"v":30000,"d":"30000.00"},{"v":9870,"d":"9870.00"},{"v":11.9,"d":"11.90"},6.81,{"v":2080,"d":"2080.00"},{"v":744,"d":"744.00"},{"v":2420,"d":"2420.00"},{"v":1140,"d":"1140.00"},{"v":0.851,"d":"0.85"},8.48,1.63,{"v":626,"d":"626.00"},{"v":213,"d":"213.00"}]
[null,138,"254x254x132",{"v":132,"d":"132.00"},{"v":276.3,"d":"276.30"},{"v":261.3,"d":"261.30"},{"v":15.3,"d":"15.30"},{"v":25.3,"d":"25.30"},{"v":12.7,"d":"12.70"},{"v":200.3,"d":"200.30"},5.16,13.09,{"v":22500,"d":"22500.00"},{"v":7530,"d":"7530.00"},{"v":11.6,"d":"11.60"},6.69,{"v":1630,"d":"1630.00"},{"v":576,"d":"576.00"},{"v":1870,"d":"1870.00"},{"v":878,"d":"878.00"},0.85,{"v":10.3,"d":"10.30"},1.19,{"v":319,"d":"319.00"},{"v":168,"d":"168.00"}]
[null,139,"254x254x107",{"v":107.1,"d":"107.10"},{"v":266.7,"d":"266.70"},{"v":258.8,"d":"258.80"},{"v":12.8,"d":"12.80"},{"v":20.5,"d":"20.50"},{"v":12.7,"d":"12.70"},{"v":200.3,"d":"200.30"},6.31,15.65,{"v":17500,"d":"17500.00"},{"v":5930,"d":"5930.00"},{"v":11.3,"d":"11.30"},6.59,{"v":1310,"d":"1310.00"},{"v":458,"d":"458.00"},{"v":1480,"d":"1480.00"},{"v":697,"d":"697.00"},{"v":0.848,"d":"0.85"},{"v":12.4,"d":"12.40"},{"v":0.898,"d":"0.90"},{"v":172,"d":"172.00"},{"v":136,"d":"136.00"}]
[null,140,"254x254x89",{"v":88.9,"d":"88.90"},{"v":260.3,"d":"260.30"},{"v":256.3,"d":"256.30"},{"v":10.3,"d":"10.30"},{"v":17.3,"d":"17.30"},{"v":12.7,"d":"12.70"},{"v":200.3,"d":"200.30"},7.41,19.45,{"v":14300,"d":"14300.00"},{"v":4860,"d":"4860.00"},{"v":11.2,"d":"11.20"},6.55,{"v":1100,"d":"1100.00"},{"v":379,"d":"379.00"},{"v":1220,"d":"1220.00"},{"v":575,"d":"575.00"},0.85,{"v":14.5,"d":"14.50"},{"v":0.717,"d":"0.72"},{"v":102,"d":"102.00"},{"v":113,"d":"113.00"}]
[null,141,"254x254x73",{"v":73.1,"d":"73.10"},{"v":254.1,"d":"254.10"},{"v":254.6,"d":"254.60"},{"v":8.6,"d":"8.60"},{"v":14.2,"d":"14.20"},{"v":12.7,"d":"12.70"},{"v":200.3,"d":"200.30"},8.96,23.29,{"v":11400,"d":"11400.00"},{"v":3910,"d":"3910.00"},{"v":11.1,"d":"11.10"},6.48,{"v":898,"d":"898.00"},{"v":307,"d":"307.00"},{"v":992,"d":"992.00"},{"v":465,"d":"465.00"},{"v":0.849,"d":"0.85"},{"v":17.2,"d":"17.20"},{"v":0.562,"d":"0.56"},{"v":57.6,"d":"57.60"},{"v":93.1,"d":"93.10"}]
[null,142,"203x203x127",{"v":127.5,"d":"127.50"},{"v":241.4,"d":"241.40"},{"v":213.9,"d":"213.90"},{"v":18.1,"d":"18.10"},{"v":30.1,"d":"30.10"},{"v":10.2,"d":"10.20"},{"v":160.8,"d":"160.80"},3.55,8.88,{"v":15400,"d":"15400.00"},{"v":4920,"d":"4920.00"},9.75,{"v":5.5,"d":"5.50"},{"v":1280,"d":"1280.00"},{"v":460,"d":"460.00"},{"v":1520,"d":"1520.00"},{"v":704,"d":"704.00"},{"v":0.856,"d":"0.86"},7.36,{"v":0.549,"d":"0.55"},{"v":427,"d":"427.00"},{"v":162,"d":"162.00"}]
[null,143,"203x203x113",{"v":113.5,"d":"113.50"},{"v":235,"d":"235.00"},{"v":212.1,"d":"212.10"},{"v":16.3,"d":"16.30"},{"v":26.9,"d":"26.90"},{"v":10.2,"d":"10.20"},{"v":160.8,"d":"160.80"},3.94,9.87,{"v":13300,"d":"13300.00"},{"v":4290,"d":"4290.00"},9.59,5.45,{"v":1130,"d":"1130.00"},{"v":404,"d":"404.00"},{"v":1330,"d":"1330.00"},{"v":618,"d":"618.00"},{"v":0.852,"d":"0.85"},8.11,{"v":0.464,"d":"0.46"},{"v":305,"d":"305.00"},{"v":145,"d":"145.00"}]
[null,144,"203x203x100",{"v":99.6,"d":"99.60"},{"v":228.6,"d":"228.60"},{"v":210.3,"d":"210.30"},{"v":14.5,"d":"14.50"},{"v":23.7,"d":"23.70"},{"v":10.2,"d":"10.20"},{"v":160.8,"d":"160.80"},4.44,11.09,{"v":11300,"d":"11300.00"},{"v":3680,"d":"3680.00"},9.44,5.39,{"v":988,"d":"988.00"},{"v":350,"d":"350.00"},{"v":1150,"d":"1150.00"},{"v":534,"d":"534.00"},{"v":0.852,"d":"0.85"},9.01,{"v":0.386,"d":"0.39"},{"v":210,"d":"210.00"},{"v":127,"d":"127.00"}]
[null,145,"203x203x86",{"v":86.1,"d":"86.10"},{"v":222.2,"d":"222.20"},{"v":209.1,"d":"209.10"},{"v":12.7,"d":"12.70"},{"v":20.5,"d":"20.50"},{"v":10.2,"d":"10.20"},{"v":160.8,"d":"160.80"},{"v":5.1,"d":"5.10"},12.66,{"v":9450,"d":"9450.00"},{"v":3130,"d":"3130.00"},9.28,5.34,{"v":850,"d":"850.00"},{"v":299,"d":"299.00"},{"v":977,"d":"977.00"},{"v":456,"d":"456.00"},{"v":0.849,"d":"0.85"},{"v":10.2,"d":"10.20"},{"v":0.318,"d":"0.32"},{"v":137,"d":"137.00"},{"v":110,"d":"110.00"}]
[null,146,"203x203x71",{"v":71,"d":"71.00"},{"v":215.8,"d":"215.80"},{"v":206.4,"d":"206.40"},{"v":10,"d":"10.00"},{"v":17.3,"d":"17.30"},{"v":10.2,"d":"10.20"},{"v":160.8,"d":"160.80"},5.97,16.08,{"v":7620,"d":"7620.00"},{"v":2540,"d":"2540.00"},9.18,{"v":5.3,"d":"5.30"},{"v":706,"d":"706.00"},{"v":246,"d":"246.00"},{"v":799,"d":"799.00"},{"v":374,"d":"374.00"},{"v":0.853,"d":"0.85"},{"v":11.9,"d":"11.90"},0.25,{"v":80.2,"d":"80.20"},{"v":90.4,"d":"90.40"}]
[null,147,"203x203x60",{"v":60,"d":"60.00"},{"v":209.6,"d":"209.60"},{"v":205.8,"d":"205.80"},{"v":9.4,"d":"9.40"},{"v":14.2,"d":"14.20"},{"v":10.2,"d":"10.20"},{"v":160.8,"d":"160.80"},7.25,17.11,{"v":6120,"d":"6120.00"},{"v":2060,"d":"2060.00"},8.96,{"v":5.2,"d":"5.20"},{"v":584,"d":"584.00"},{"v":201,"d":"201.00"},{"v":656,"d":"656.00"},{"v":305,"d":"305.00"},{"v":0.846,"d":"0.85"},{"v":14.1,"d":"14.10"},{"v":0.197,"d":"0.20"},{"v":47.2,"d":"47.20"},{"v":76.4,"d":"76.40"}]
[null,148,"203x203x52",{"v":52,"d":"52.00"},{"v":206.2,"d":"206.20"},{"v":204.3,"d":"204.30"},{"v":7.9,"d":"7.90"},{"v":12.5,"d":"12.50"},{"v":10.2,"d":"10.20"},{"v":160.8,"d":"160.80"},8.17,20.35,{"v":5260,"d":"5260.00"},{"v":1780,"d":"1780.00"},8.91,5.18,{"v":510,"d":"510.00"},{"v":174,"d":"174.00"},{"v":567,"d":"567.00"},{"v":264,"d":"264.00"},{"v":0.847,"d":"0.85"},{"v":15.8,"d":"15.80"},{"v":0.167,"d":"0.17"},{"v":31.8,"d":"31.80"},{"v":66.3,"d":"66.30"}]
[null,149,"203x203x46",{"v":46.1,"d":"46.10"},{"v":203.2,"d":"203.20"},{"v":203.6,"d":"203.60"},{"v":7.2,"d":"7.20"},{"v":11,"d":"11.00"},{"v":10.2,"d":"10.20"},{"v":160.8,"d":"160.80"},9.25,22.33,{"v":4570,"d":"4570.00"},{"v":1550,"d":"1550.00"},8.82,5.13,{"v":450,"d":"450.00"},{"v":152,"d":"152.00"},{"v":497,"d":"497.00"},{"v":231,"d":"231.00"},{"v":0.847,"d":"0.85"},{"v":17.7,"d":"17.70"},{"v":0.143,"d":"0.14"},{"v":22.2,"d":"22.20"},{"v":58.7,"d":"58.70"}]
[null,150,"152x152x51",{"v":51.2,"d":"51.20"},{"v":170.2,"d":"170.20"},{"v":157.4,"d":"157.40"},{"v":11,"d":"11.00"},{"v":15.7,"d":"15.70"},{"v":7.6,"d":"7.60"},{"v":123.6,"d":"123.60"},5.01,11.24,{"v":3230,"d":"3230.00"},{"v":1020,"d":"1020.00"},7.04,3.96,{"v":379,"d":"379.00"},{"v":130,"d":"130.00"},{"v":438,"d":"438.00"},{"v":199,"d":"199.00"},{"v":0.848,"d":"0.85"},{"v":10.1,"d":"10.10"},{"v":0.061,"d":"0.06"},{"v":48.8,"d":"48.80"},{"v":65.2,"d":"65.20"}]
[null,151,"152x152x44",{"v":44,"d":"44.00"},{"v":166,"d":"166.00"},{"v":155.9,"d":"155.90"},{"v":9.5,"d":"9.50"},{"v":13.6,"d":"13.60"},{"v":7.6,"d":"7.60"},{"v":123.6,"d":"123.60"},5.73,13.01,{"v":2700,"d":"2700.00"},{"v":860,"d":"860.00"},6.94,3.92,{"v":326,"d":"326.00"},{"v":110,"d":"110.00"},{"v":372,"d":"372.00"},{"v":169,"d":"169.00"},{"v":0.847,"d":"0.85"},{"v":11.5,"d":"11.50"},0.05,{"v":31.7,"d":"31.70"},{"v":56.1,"d":"56.10"}]
[null,152,"152x152x37",{"v":37,"d":"37.00"},{"v":161.8,"d":"161.80"},{"v":154.4,"d":"154.40"},{"v":8,"d":"8.00"},{"v":11.5,"d":"11.50"},{"v":7.6,"d":"7.60"},{"v":123.6,"d":"123.60"},6.71,15.45,{"v":2210,"d":"2210.00"},{"v":706,"d":"706.00"},6.85,3.87,{"v":273,"d":"273.00"},{"v":91.5,"d":"91.50"},{"v":309,"d":"309.00"},{"v":140,"d":"140.00"},{"v":0.848,"d":"0.85"},{"v":13.3,"d":"13.30"},0.04,{"v":19.2,"d":"19.20"},{"v":47.1,"d":"47.10"}]
[null,153,"152x152x30",{"v":30,"d":"30.00"},{"v":157.6,"d":"157.60"},{"v":152.9,"d":"152.90"},{"v":6.5,"d":"6.50"},{"v":9.4,"d":"9.40"},{"v":7.6,"d":"7.60"},{"v":123.6,"d":"123.60"},8.13,19.02,{"v":1750,"d":"1750.00"},{"v":560,"d":"560.00"},6.76,3.83,{"v":222,"d":"222.00"},{"v":73.3,"d":"73.30"},{"v":248,"d":"248.00"},{"v":112,"d":"112.00"},{"v":0.847,"d":"0.85"},{"v":16.1,"d":"16.10"},{"v":0.031,"d":"0.03"},{"v":10.5,"d":"10.50"},{"v":38.3,"d":"38.30"}]
[null,154,"152x152x23",{"v":23,"d":"23.00"},{"v":152.4,"d":"152.40"},{"v":152.2,"d":"152.20"},{"v":5.8,"d":"5.80"},{"v":6.8,"d":"6.80"},{"v":7.6,"d":"7.60"},{"v":123.6,"d":"123.60"},11.19,21.31,{"v":1250,"d":"1250.00"},{"v":400,"d":"400.00"},6.54,{"v":3.7,"d":"3.70"},{"v":164,"d":"164.00"},{"v":52.6,"d":"52.60"},{"v":182,"d":"182.00"},{"v":80.1,"d":"80.10"},{"v":0.842,"d":"0.84"},{"v":20.6,"d":"20.60"},{"v":0.021,"d":"0.02"},4.63,{"v":29.2,"d":"29.20"}]
[null,155]
["PFC",156,"430x100x64",{"v":64.4,"d":"64.40"},{"v":430,"d":"430.00"},{"v":100,"d":"100.00"},{"v":11,"d":"11.00"},{"v":19,"d":"19.00"},{"v":15,"d":"15.00"},{"v":362,"d":"362.00"},5.26,{"v":32.9,"d":"32.90"},{"v":21940,"d":"21940.00"},{"v":722,"d":"722.00"},{"v":16.3,"d":"16.30"},2.97,{"v":1020,"d":"1020.00"},{"v":97.9,"d":"97.90"},{"v":1222,"d":"1222.00"},{"v":176,"d":"176.00"},{"v":0.917,"d":"0.92"},{"v":22.5,"d":"22.50"},{"v":0.219,"d":"0.22"},{"v":63,"d":"63.00"},{"v":82.1,"d":"82.10"}]
[null,157,"380x100x54",{"v":54,"d":"54.00"},{"v":380,"d":"380.00"},{"v":100,"d":"100.00"},{"v":9.5,"d":"9.50"},{"v":17.5,"d":"17.50"},{"v":15,"d":"15.00"},{"v":315,"d":"315.00"},5.71,{"v":33.2,"d":"33.20"},{"v":15030,"d":"15030.00"},{"v":643,"d":"643.00"},{"v":14.8,"d":"14.80"},3.06,{"v":791,"d":"791.00"},{"v":89.2,"d":"89.20"},{"v":933,"d":"933.00"},{"v":161,"d":"161.00"},{"v":0.932,"d":"0.93"},{"v":21.2,"d":"21.20"},0.15,{"v":45.7,"d":"45.70"},{"v":68.7,"d":"68.70"}]
[null,158,"300x100x46",{"v":45.5,"d":"45.50"},{"v":300,"d":"300.00"},{"v":100,"d":"100.00"},{"v":9,"d":"9.00"},{"v":16.5,"d":"16.50"},{"v":15,"d":"15.00"},{"v":237,"d":"237.00"},6.06,{"v":26.3,"d":"26.30"},{"v":8229,"d":"8229.00"},{"v":568,"d":"568.00"},{"v":11.9,"d":"11.90"},3.13,{"v":549,"d":"549.00"},{"v":81.7,"d":"81.70"},{"v":641,"d":"641.00"},{"v":148,"d":"148.00"},{"v":0.944,"d":"0.94"},{"v":17,"d":"17.00"},{"v":0.081,"d":"0.08"},{"v":36.8,"d":"36.80"},{"v":58,"d":"58.00"}]
[null,159,"300x90x41",{"v":41.4,"d":"41.40"},{"v":300,"d":"300.00"},{"v":90,"d":"90.00"},{"v":9,"d":"9.00"},{"v":15.5,"d":"15.50"},{"v":12,"d":"12.00"},{"v":245,"d":"245.00"},5.81,{"v":27.2,"d":"27.20"},{"v":7218,"d":"7218.00"},{"v":404,"d":"404.00"},{"v":11.7,"d":"11.70"},2.77,{"v":481,"d":"481.00"},{"v":63.1,"d":"63.10"},{"v":568,"d":"568.00"},{"v":114,"d":"114.00"},{"v":0.934,"d":"0.93"},{"v":18.4,"d":"18.40"},{"v":0.058,"d":"0.06"},{"v":28.8,"d":"28.80"},{"v":52.7,"d":"52.70"}]
[null,160,"260x90x35",{"v":34.8,"d":"34.80"},{"v":260,"d":"260.00"},{"v":90,"d":"90.00"},{"v":8,"d":"8.00"},{"v":14,"d":"14.00"},{"v":12,"d":"12.00"},{"v":208,"d":"208.00"},6.43,{"v":26,"d":"26.00"},{"v":4728,"d":"4728.00"},{"v":353,"d":"353.00"},{"v":10.3,"d":"10.30"},2.82,{"v":364,"d":"364.00"},{"v":56.3,"d":"56.30"},{"v":425,"d":"425.00"},{"v":102,"d":"102.00"},{"v":0.942,"d":"0.94"},{"v":17.2,"d":"17.20"},{"v":0.038,"d":"0.04"},{"v":20.6,"d":"20.60"},{"v":44.4,"d":"44.40"}]
[null,161,"260x75x28",{"v":27.6,"d":"27.60"},{"v":260,"d":"260.00"},{"v":75,"d":"75.00"},{"v":7,"d":"7.00"},{"v":12,"d":"12.00"},{"v":12,"d":"12.00"},{"v":212,"d":"212.00"},6.25,{"v":30.3,"d":"30.30"},{"v":3619,"d":"3619.00"},{"v":185,"d":"185.00"},{"v":10.1,"d":"10.10"},{"v":2.3,"d":"2.30"},{"v":278,"d":"278.00"},{"v":34.4,"d":"34.40"},{"v":328,"d":"328.00"},{"v":62,"d":"62.00"},{"v":0.932,"d":"0.93"},{"v":20.5,"d":"20.50"},0.02,{"v":11.7,"d":"11.70"},{"v":35.1,"d":"35.10"}]
[null,162,"230x90x32",{"v":32.2,"d":"32.20"},{"v":230,"d":"230.00"},{"v":90,"d":"90.00"},{"v":7.5,"d":"7.50"},{"v":14,"d":"14.00"},{"v":12,"d":"12.00"},{"v":178,"d":"178.00"},6.43,{"v":23.7,"d":"23.70"},{"v":3518,"d":"3518.00"},{"v":334,"d":"334.00"},9.27,2.86,{"v":306,"d":"306.00"},{"v":55,"d":"55.00"},{"v":355,"d":"355.00"},{"v":98.9,"d":"98.90"},0.95,{"v":15.1,"d":"15.10"},{"v":0.028,"d":"0.03"},{"v":19.3,"d":"19.30"},{"v":41,"d":"41.00"}]
[null,163,"230x75x26",{"v":25.7,"d":"25.70"},{"v":230,"d":"230.00"},{"v":75,"d":"75.00"},{"v":6.5,"d":"6.50"},{"v":12.5,"d":"12.50"},{"v":12,"d":"12.00"},{"v":181,"d":"181.00"},{"v":6,"d":"6.00"},{"v":27.8,"d":"27.80"},{"v":2748,"d":"2748.00"},{"v":181,"d":"181.00"},9.17,2.35,{"v":239,"d":"239.00"},{"v":34.8,"d":"34.80"},{"v":278,"d":"278.00"},{"v":63.2,"d":"63.20"},{"v":0.947,"d":"0.95"},{"v":17.3,"d":"17.30"},{"v":0.015,"d":"0.02"},{"v":11.8,"d":"11.80"},{"v":32.7,"d":"32.70"}]
[null,164,"200x90x30",{"v":29.7,"d":"29.70"},{"v":200,"d":"200.00"},{"v":90,"d":"90.00"},{"v":7,"d":"7.00"},{"v":14,"d":"14.00"},{"v":12,"d":"12.00"},{"v":148,"d":"148.00"},6.43,{"v":21.1,"d":"21.10"},{"v":2523,"d":"2523.00"},{"v":314,"d":"314.00"},8.16,2.88,{"v":252,"d":"252.00"},{"v":53.4,"d":"53.40"},{"v":291,"d":"291.00"},{"v":94.5,"d":"94.50"},{"v":0.954,"d":"0.95"},{"v":12.9,"d":"12.90"},0.02,{"v":18.3,"d":"18.30"},{"v":37.9,"d":"37.90"}]
[null,165,"200x75x23",{"v":23.4,"d":"23.40"},{"v":200,"d":"200.00"},{"v":75,"d":"75.00"},{"v":6,"d":"6.00"},{"v":12.5,"d":"12.50"},{"v":12,"d":"12.00"},{"v":151,"d":"151.00"},{"v":6,"d":"6.00"},{"v":25.2,"d":"25.20"},{"v":1963,"d":"1963.00"},{"v":170,"d":"170.00"},8.11,2.39,{"v":196,"d":"196.00"},{"v":33.8,"d":"33.80"},{"v":227,"d":"227.00"},{"v":60.6,"d":"60.60"},{"v":0.956,"d":"0.96"},{"v":14.8,"d":"14.80"},{"v":0.011,"d":"0.01"},{"v":11.1,"d":"11.10"},{"v":29.9,"d":"29.90"}]
[null,166,"180x90x26",{"v":26.1,"d":"26.10"},{"v":180,"d":"180.00"},{"v":90,"d":"90.00"},{"v":6.5,"d":"6.50"},{"v":12.5,"d":"12.50"},{"v":12,"d":"12.00"},{"v":131,"d":"131.00"},{"v":7.2,"d":"7.20"},{"v":20.2,"d":"20.20"},{"v":1817,"d":"1817.00"},{"v":277,"d":"277.00"},{"v":7.4,"d":"7.40"},2.89,{"v":202,"d":"202.00"},{"v":47.4,"d":"47.40"},{"v":232,"d":"232.00"},{"v":83.5,"d":"83.50"},{"v":0.949,"d":"0.95"},{"v":12.8,"d":"12.80"},{"v":0.014,"d":"0.01"},{"v":13.3,"d":"13.30"},{"v":33.2,"d":"33.20"}]
[null,167,"180x75x20",{"v":20.3,"d":"20.30"},{"v":180,"d":"180.00"},{"v":75,"d":"75.00"},{"v":6,"d":"6.00"},{"v":10.5,"d":"10.50"},{"v":12,"d":"12.00"},{"v":135,"d":"135.00"},7.14,{"v":22.5,"d":"22.50"},{"v":1370,"d":"1370.00"},{"v":146,"d":"146.00"},7.27,2.38,{"v":152,"d":"152.00"},{"v":28.8,"d":"28.80"},{"v":176,"d":"176.00"},{"v":51.8,"d":"51.80"},{"v":0.946,"d":"0.95"},{"v":15.3,"d":"15.30"},{"v":0.008,"d":"0.01"},7.34,{"v":25.9,"d":"25.90"}]
[null,168,"150x90x24",{"v":23.9,"d":"23.90"},{"v":150,"d":"150.00"},{"v":90,"d":"90.00"},{"v":6.5,"d":"6.50"},{"v":12,"d":"12.00"},{"v":12,"d":"12.00"},{"v":102,"d":"102.00"},{"v":7.5,"d":"7.50"},{"v":15.7,"d":"15.70"},{"v":1162,"d":"1162.00"},{"v":253,"d":"253.00"},6.18,2.89,{"v":155,"d":"155.00"},{"v":44.4,"d":"44.40"},{"v":179,"d":"179.00"},{"v":76.9,"d":"76.90"},{"v":0.936,"d":"0.94"},{"v":10.8,"d":"10.80"},{"v":0.009,"d":"0.01"},{"v":11.8,"d":"11.80"},{"v":30.4,"d":"30.40"}]
[null,169,"150x75x18",{"v":17.9,"d":"17.90"},{"v":150,"d":"150.00"},{"v":75,"d":"75.00"},{"v":5.5,"d":"5.50"},{"v":10,"d":"10.00"},{"v":12,"d":"12.00"},{"v":106,"d":"106.00"},{"v":7.5,"d":"7.50"},{"v":19.3,"d":"19.30"},{"v":861,"d":"861.00"},{"v":131,"d":"131.00"},6.15,{"v":2.4,"d":"2.40"},{"v":115,"d":"115.00"},{"v":26.6,"d":"26.60"},{"v":132,"d":"132.00"},{"v":47.2,"d":"47.20"},{"v":0.946,"d":"0.95"},{"v":13.1,"d":"13.10"},{"v":0.005,"d":"0.01"},{"v":6.1,"d":"6.10"},{"v":22.8,"d":"22.80"}]
[null,170,"125x65x15",{"v":14.8,"d":"14.80"},{"v":125,"d":"125.00"},{"v":65,"d":"65.00"},{"v":5.5,"d":"5.50"},{"v":9.5,"d":"9.50"},{"v":12,"d":"12.00"},{"v":82,"d":"82.00"},6.84,{"v":14.9,"d":"14.90"},{"v":483,"d":"483.00"},{"v":80,"d":"80.00"},5.07,2.06,{"v":77.3,"d":"77.30"},{"v":18.8,"d":"18.80"},{"v":89.9,"d":"89.90"},{"v":33.2,"d":"33.20"},{"v":0.942,"d":"0.94"},{"v":11.1,"d":"11.10"},{"v":2E-3,"d":"0.00"},4.72,{"v":18.8,"d":"18.80"}]
[null,171,"100x50x10",{"v":10.2,"d":"10.20"},{"v":100,"d":"100.00"},{"v":50,"d":"50.00"},{"v":5,"d":"5.00"},{"v":8.5,"d":"8.50"},{"v":9,"d":"9.00"},{"v":65,"d":"65.00"},5.88,{"v":13,"d":"13.00"},{"v":208,"d":"208.00"},{"v":32.3,"d":"32.30"},{"v":4,"d":"4.00"},1.58,{"v":41.5,"d":"41.50"},9.89,{"v":48.9,"d":"48.90"},{"v":17.5,"d":"17.50"},{"v":0.942,"d":"0.94"},{"v":10,"d":"10.00"},{"v":0,"d":"0.00"},2.53,{"v":13,"d":"13.00"}]

{"sheet":"from author","index":2,"n_rows":39,"n_cols":11,"rows_kept":39,"merged":[[2,2,2,5],[2,6,2,9],[3,2,3,5],[3,6,3,9],[4,12,4,13],[6,2,9,9],[12,2,22,9],[23,2,23,7],[24,2,27,9],[31,2,34,9],[38,2,50,9]]}
[null,"version: 2.2. - FREE LITE VERSION",{"$nulls":8},"© 2010-2019 Damian Janicki"]
[]
[null,null,"For latest updates and news visit:",{"$nulls":3},"Contact me at:"]
[null,null,"www.YourSpreadsheets.co.uk",{"$nulls":3},"info@yourspreadsheets.co.uk"]
[]
[]
[null,null,"General information:\nNote: This spreadsheet contains macros.\nTo change company logo: right click it and select 'change picture'."]
[]
[]
[]
[]
[]
[null,null,"The Author takes no liability for use of this spreadsheet and gives no guarantee that it is error free. \n\nIn no event shall the Author be responsible for any special, incidental or consequential damages whatsoever arising from the use of this spreadsheet, even if the Author has been advised of the possibility of such damage.\n\nThis spreadsheet is a freeware and can be distributed freely but only in its original form.\n\nReverse-engineering, decompiling or disassembling of this spreadsheet is not allowable.\n\nA full list of terms and conditions can be found here:"]
{"$rows_empty":10}
[null,null,"www.yourspreadsheets.co.uk/checkout.html"]
[null,null,"\nBy using this spreadsheet you understand and agree with the terms and conditions. You also acknowledge that you do not become an owner of this spreadsheet.\n\nDamian Janicki"]
[]
[]
[]
[]
[]
[]
[null,null,"This is a Free Lite Version. The full version of the spreadsheet allows to:\n- Input your company information and change logo;\n- Change beam span.\n- Change loading."]
[]
[]
[]
[]
[]
[]
[null,null,"This spreadsheet is based on BS 5950:1 2000.\n\nChangelog:\n26.08.2019 - v.2.2. - updated steel section sizes database. Added in-spreadsheet help pop-up messages. Also a few extra calculation steps are now visible on the print out.\n14.08.2011 - v.2.1. - assigned to a new domain: www.YourSpreadsheets.co.uk.\n27.11.2010 - v.1.6. - cell protection revised to work on Excel 97 and older.\n29.09.2010 - v.1.5. - added option to change mLT between stabilizing and destabilizing load. Activation is now requierd.\n05.08.2010 - v.1.4. - added option to limit allowable deflection to L/200; L/250 or 25mm (good practise for long spans).\n03.06.2010 - v.1.3. - minor cosmetic changes. Note from the Author revised.\n02.05.2010 - v.1.2. - official release of the spreadsheet."]