{"text_format":"3","workbook":"xlsx","n_sheets":3,"sheets":["steel","calculations","from author"],"not_rendered":{"charts":4,"images":2,"macros":1,"defined_names":47,"comments":1},"read":"whole","date_system":"1900"}

{"sheet":"steel","index":0,"n_rows":71,"n_cols":38,"rows_kept":71,"merged":[[0,1,0,15],[0,16,0,24],[1,3,3,15],[1,16,2,19],[2,20,2,21],[2,22,2,24],[3,16,3,17],[3,18,3,19],[3,20,3,21],[3,22,3,24],[4,3,4,15],[4,16,4,17],[4,18,4,19],[4,20,4,21],[4,22,4,24],[6,2,6,5],[6,7,6,13],[6,17,6,23],[6,26,6,27],[7,2,7,3],[7,4,7,5],[7,8,8,9],[7,10,8,13],[8,2,8,3],[8,4,8,5],[9,2,9,3],[9,4,9,5],[9,7,9,13],[11,2,12,3],[11,4,12,5],[11,7,12,11],[14,2,15,3],[14,4,15,5],[14,7,14,13],[15,8,15,9],[15,10,15,11],[16,8,16,9],[16,10,16,11],[21,2,21,13],[22,4,22,5],[22,6,22,7],[22,10,23,11],[22,12,23,13],[23,2,23,3],[23,4,23,5],[23,6,23,7],[23,8,23,9],[24,2,24,3],[24,4,24,5],[24,6,24,7],[24,8,24,9],[25,2,25,3],[25,4,25,5],[25,6,25,7],[25,8,25,9],[26,2,26,3],[26,4,26,5],[26,6,26,7],[26,8,26,9],[26,12,26,13],[27,2,27,3],[27,4,27,5],[27,6,27,7],[27,8,27,9],[27,12,27,13],[33,2,33,13],[33,15,33,17],[33,20,33,21],[34,2,34,5],[34,6,34,8],[34,9,34,11],[34,12,34,13],[34,15,34,17],[34,20,34,21],[35,2,35,5],[35,6,35,8],[35,9,35,11],[35,12,35,13],[35,15,35,17],[35,20,35,21],[36,2,36,5],[36,6,36,8],[36,9,36,11],[36,12,36,13],[36,15,36,17],[36,20,36,21],[37,2,37,5],[37,6,37,8],[37,9,37,11],[37,12,37,13],[37,15,37,17],[37,20,37,21],[40,15,40,23],[41,20,41,21],[42,15,42,17],[42,20,42,21],[43,15,43,17],[43,20,43,21],[44,2,44,7],[44,8,44,13],[45,2,45,7],[45,8,45,9],[46,2,46,7],[46,8,46,9],[47,2,47,13],[48,2,48,7],[48,8,48,9],[49,2,49,7],[49,8,49,9],[50,2,50,7],[50,8,50,9],[52,2,52,7],[52,8,52,13],[53,2,53,7],[53,8,53,9],[54,2,54,7],[54,8,54,9],[55,2,55,13],[56,2,56,7],[56,8,56,9],[60,2,60,7],[60,8,60,13],[61,2,61,7],[61,8,61,9],[61,11,61,12],[62,2,62,7],[62,8,62,9],[63,2,63,7],[63,8,63,9],[65,2,65,7],[65,8,65,13],[66,2,66,7],[66,8,66,9],[66,11,66,12],[67,2,67,7],[67,8,67,9],[67,11,67,13],[68,2,68,7],[68,8,68,9]]}
[null,"version: 2.2. - FREE LITE VERSION",{"$nulls":14},"© 2010-2019 Damian Janicki"]
[{"$nulls":3},"YourSpreadsheets™\nYour Office Address Goes Here\nwww.YourSpreadsheets.co.uk\nTel: 010 1234 567890 (example only)",{"$nulls":12},"TEST PROJECT NAME",{"$nulls":15},123459,1]
[{"$nulls":20},"Revision",null,"A",{"$nulls":9},123458,2]
[{"$nulls":16},"Job No:",null,22190,null,"Page:",null,{"v":1,"d":"01"}]
[null,null,"Member: ","test member (this is unlicensed version of the spreadsheet)",{"$nulls":12},"Prepared By:",null,"DJ",null,"Date:",null,{"$f":"TODAY()","v":"2019-08-26"},{"$nulls":9},"fy"]
[{"$nulls":30},"Steel grade:","S275",{"$f":"IF(OR(tw>100,Tf>100),225,IF(OR(tw>80,Tf>80),235,IF(OR(tw>63,Tf>63),245,IF(OR(tw>40,Tf>40),255,IF(OR(tw>16,Tf>16),265,275)))))","v":275},null,"Reaction:",{"$f":"(UDL1d*8+PUDL1d*3+PUDL2d*LePUDL2+PLa1d+PLb1d)-AK6","v":{"v":19.415,"d":"19.42"}},{"$f":"(UDL1d*8^2/2+PUDL1d*3*(PosPUDL1+3/2)+PUDL2d*LePUDL2*(PosPUDL2+LePUDL2/2)+PLa1d*PosPLa1+PLb1d*PosPLb1)/8","v":{"v":16.665,"d":"16.67"}}]
[null,null,"GENERAL DATA",{"$nulls":4},"SELECTED SECTION",{"$nulls":9},"SECTION PROPERTIES",{"$nulls":8},"SUMMARY:",{"$nulls":4},"S355",{"$f":"IF(OR(tw>100,Tf>100),295,IF(OR(tw>80,Tf>80),315,IF(OR(tw>63,Tf>63),325,IF(OR(tw>40,Tf>40),335,IF(OR(tw>16,Tf>16),345,355)))))","v":355},null,null,{"$f":"(2*8+PUDL1l*3+PUDL2l*LePUDL2+PLa1l+PLb1l)-AK7","v":{"v":11.3125,"d":"11.31"}},{"$f":"(2*8^2/2+PUDL1l*3*(PosPUDL1+3/2)+PUDL2l*LePUDL2*(PosPUDL2+LePUDL2/2)+PLa1l*PosPLa1+PLb1l*PosPLb1)/8","v":{"v":9.6875,"d":"9.69"}}]
[null,null,"Steel Grade:",null,"S460",{"$nulls":3},{"$f":"IF(AF12>155,\"PFC\",IF(AF12>107,\"UC\",\"UB\"))","v":"UB"},{"$nulls":8},"D =",{"$f":"VLOOKUP(AF12,calculations!B92:Y262,4)","v":{"v":355,"d":"355.0"}},"mm",null,"rx =",{"$f":"VLOOKUP(AF12,calculations!B92:Y262,14)","v":14.8},"cm",null,null,{"$f":"I51","v":{"v":0.828743660402278,"d":"0.83"}},"moment",{"$nulls":3},"S460",{"$f":"IF(OR(tw>80,Tf>80),400,IF(OR(tw>63,Tf>63),410,IF(OR(tw>40,Tf>40),430,IF(OR(tw>16,Tf>16),440,460))))","v":460}]
[null,null,"py [MPa] =",null,{"$f":"AG10","v":460},{"$nulls":12},"B =",{"$f":"VLOOKUP(AF12,calculations!B92:Y262,5)","v":171.5},"mm",null,"ry =",{"$f":"VLOOKUP(AF12,calculations!B92:Y262,15)","v":{"v":3.86,"d":"3.9"}},"cm",null,null,{"$f":"I57","v":{"v":0.06245069319166074,"d":"0.06"}},"shear"]
[null,null,"E [GPa] =",null,205,null,null,{"$f":"\"Classification: \"&IF(AL20=1,\"plastic\",IF(AL20=2,\"compact\",IF(AL20=3,\"semi-compact\",\"slender\")))","v":"Classification: compact"},{"$nulls":9},"t =",{"$f":"VLOOKUP(AF12,calculations!B92:Y262,6)","v":7.4},"mm",null,"Ixx =",{"$f":"VLOOKUP(AF12,calculations!B92:Y262,12)","v":14100},"cm4",null,null,{"$f":"I64","v":{"v":0.2349,"d":"0.23"}},"LL",null,null,"Selected:",null,{"$f":"$AG$8","v":460}]
[{"$nulls":17},"T =",{"$f":"VLOOKUP(AF12,calculations!B92:Y262,7)","v":11.5},"mm",null,"Iyy =",{"$f":"VLOOKUP(AF12,calculations!B92:Y262,13)","v":968},"cm4",null,null,{"$f":"I69","v":{"v":0.5636,"d":"0.56"}},"DL+LL"]
[null,null,"SPAN [m] =",null,{"v":8,"d":"8.00"},null,null,"         INCLUDE S/W",{"$nulls":9},"r =",{"$f":"VLOOKUP(AF12,calculations!B92:Y262,8)","v":10.2},"mm",null,"Zx =",{"$f":"VLOOKUP(AF12,calculations!B92:Y262,16)","v":{"v":796,"d":"796.0"}},"cm3",{"$nulls":6},"Selected Section:",83]
[{"$nulls":17},"d =",{"$f":"VLOOKUP(AF12,calculations!B92:Y262,9)","v":311.6},"mm",null,"Zy =",{"$f":"VLOOKUP(AF12,calculations!B92:Y262,17)","v":{"v":113,"d":"113.0"}},"cm3"]
[{"$nulls":17},"A =",{"$f":"VLOOKUP(AF12,calculations!B92:Y262,24)","v":64.9},"cm2",null,"Sx =",{"$f":"VLOOKUP(AF12,calculations!B92:Y262,18)","v":{"v":896,"d":"896.0"}},"cm3",{"$nulls":6},"Destabilizing load:",true,{"$f":"IF(AF14=TRUE,1,0.925)","v":1},null,"UDL1d",{"$f":"3+IF(AG15=1,0.01*VLOOKUP(AF12,calculations!B92:Y262,3),0)","v":3.51}]
[null,null,"EFFECTIVE \nLENGTH [m] =",null,{"v":6,"d":"6.00"},null,null,"SAFETY FACTORS",{"$nulls":9},"weight =",{"$f":"VLOOKUP(AF12,calculations!B92:Y262,3)","v":{"v":51,"d":"51.0"}},"kg/m",null,"Sy =",{"$f":"VLOOKUP(AF12,calculations!B92:Y262,19)","v":{"v":174,"d":"174.0"}},"cm3",{"$nulls":6},"Include s/w:",true,{"$f":"IF(AF15=TRUE,1,0)","v":1}]
[{"$nulls":8},"γLL =",null,{"v":1.6,"d":"1.60"},{"$nulls":22},1,2,3,4]
[null,null,"Destabilizing load:",{"$nulls":5},"γDL =",null,{"v":1.4,"d":"1.40"},{"$nulls":19},"Classification:","ε",{"$f":"(275/fy)^0.5","v":{"v":0.7731921410338582,"d":"0.77"}},"plastic","compact","semi-compact","slender"]
[{"$nulls":31},"b/T",{"$f":"B/2/Tf","v":{"v":7.456521739130435,"d":"7.46"}},{"$f":"9*AG17","v":6.958729269304724},{"$f":"10*AG17","v":7.7319214103385825},{"$f":"15*AG17","v":11.597882115507874},null,{"$f":"IF(AG18>AJ18,4,IF(AG18>AI18,3,IF(AG18>AH18,2,1)))","v":2}]
[{"$nulls":31},"d/t",{"$f":"de/tw","v":{"v":42.10810810810811,"d":"42.11"}},{"$f":"IF(I8=\"PFC\",40,80)*AG17","v":61.85537128270866},{"$f":"IF(I8=\"PFC\",40,100)*AG17","v":77.31921410338583},{"$f":"IF(I8=\"PFC\",40,120)*AG17","v":92.78305692406299},null,{"$f":"IF(AG19>AJ19,4,IF(AG19>AI19,3,IF(AG19>AH19,2,1)))","v":1}]
[{"$nulls":31},"b/T","checks are in the hidden row!",{"$nulls":3},"Selected:",{"$f":"MAX(AL18,AL19)","v":2}]
[{"$nulls":30},"Applied shear:",{"$f":"AF60","v":45.28}]
[null,null,"LOADING",{"$nulls":27},"Shear capacity:",{"$f":"0.6*fy*tw*D/1000","v":{"v":725.052,"d":"725.05"}}]
[{"$nulls":4},"Dead",null,"Imposed",{"$nulls":3},"position from left",null,"length"]
[null,null,"UDL =",null,{"v":3,"d":"3.00"},null,{"v":2,"d":"2.00"},null,"kN/m"]
[null,null,"Partial UDL 'a' =",null,{"v":2,"d":"2.00"},null,{"v":1,"d":"1.00"},null,"kN/m",null,{"v":1,"d":"1.00"},"m",{"v":3,"d":"3.00"},"m",{"$nulls":16},"Applied moment:",{"$f":"AF59","v":92.03}]
[null,null,"Partial UDL 'b' =",{"$nulls":5},"kN/m",null,null,"m",null,"m",{"$nulls":17},1,2,3,4]
[null,null,"Point Load 'a' =",null,{"v":2,"d":"2.00"},null,{"v":2,"d":"2.00"},null,"kN",null,{"v":3,"d":"3.00"},"m","~~~~",{"$nulls":17},"Moment Capacity:","plastic","compact","semi-compact","slender"]
[null,null,"Point Load 'b' =",{"$nulls":5},"kN",null,null,"m","~~~~",{"$nulls":17},"Low shear",{"$f":"IF(AF21<(AF22*0.6),fy*Sx/1000,\"\")","v":412.16},{"$f":"AF28","v":412.16},{"$f":"IF(AF21<(AF22*0.6),fy*Zx/1000,\"\")","v":366.16},"ERROR",{"$f":"HLOOKUP(AL20,AF26:AI29,3)","v":412.16}]
[{"$nulls":30},"High shear",{"$f":"IF(AF21>(AF22*0.6),fy*(Sx-AF30*tw*D^2/4000)/1000,\"\")","v":""},{"$f":"AF29","v":""},{"$f":"IF(AF21>(AF22*0.6),fy*(Zx-AF30*tw*D^2/4000/1.5)/1000,\"\")","v":""},"ERROR",{"$f":"HLOOKUP(AL20,AF26:AI29,4)","v":""}]
[{"$nulls":30},"ρ",{"$f":"IF(AF21<0.6*AF22,\"\",IF(((2*AF21/AF22)-1)^2>1,1,((2*AF21/AF22)-1)^2))","v":""},null,null,"limiting Mc:",{"$f":"1.2*fy*Zx/1000","v":439.392}]
{"$rows_left_out":42}
{"sheet":"calculations","index":1,"n_rows":262,"n_cols":105,"rows_kept":262,"hidden":true,"merged":[[41,1,43,1]]}
[]
[null,null,"LOADING DIAGRAM"]
[]
[null,"Beam",0.1,{"$f":"0.1+8","v":8.1}]
[null,null,0,0]
[]
[null,"Supports",0.1,{"$f":"C7","v":0.1},{"$f":"0.1+8","v":8.1},{"$f":"E7","v":8.1}]
[null,null,{"$f":"C9","v":-1.9020000000000001},0,{"$f":"C8","v":-1.9020000000000001},0]
[null,null,{"$f":"-0.2*MAX(SUM(UDL1d,2,PUDL1d,PUDL1l),SUM(UDL1d,2,PLa1d,PLa1l),SUM(UDL1d,2,PLb1d,PLb1l))","v":-1.9020000000000001}]
[null,"UDL",0.1,0.1,{"$f":"IF(OR(UDL1d>0,2>0),0.1+8,0)","v":8.1},{"$f":"IF(OR(UDL1d>0,2>0),0.1+8,0)","v":8.1}]
[null,"Dead",0,{"$f":"UDL1d","v":3.51},{"$f":"UDL1d","v":3.51},0]
[null,"Live",{"$f":"IF(2>0,UDL1d,0)","v":3.51},{"$f":"IF(2>0,UDL1d+2,0)","v":5.51},{"$f":"IF(2>0,UDL1d+2,0)","v":5.51},{"$f":"IF(2>0,UDL1d,0)","v":3.51}]
[]
[null,"PUDL a",{"$f":"IF(OR(PUDL1d>0,PUDL1l>0),0.1+PosPUDL1,0)","v":1.1},{"$f":"IF(OR(PUDL1d>0,PUDL1l>0),0.1+PosPUDL1,0)","v":1.1},{"$f":"IF(OR(PUDL1d>0,PUDL1l>0),0.1+PosPUDL1+3,0)","v":4.1},{"$f":"IF(OR(PUDL1d>0,PUDL1l>0),0.1+PosPUDL1+3,0)","v":4.1}]
[null,"Dead",{"$f":"UDL1d+2","v":5.51},{"$f":"UDL1d+2+PUDL1d","v":7.51},{"$f":"UDL1d+2+PUDL1d","v":7.51},{"$f":"UDL1d+2","v":5.51}]
[null,"Live",{"$f":"UDL1d+2+PUDL1d","v":7.51},{"$f":"UDL1d+2+PUDL1d+PUDL1l","v":8.51},{"$f":"UDL1d+2+PUDL1d+PUDL1l","v":8.51},{"$f":"UDL1d+2+PUDL1d","v":7.51}]
[]
[null,"PUDL b",{"$f":"IF(OR(PUDL2d>0,PUDL2l>0),0.1+PosPUDL2,0)","v":0},{"$f":"IF(OR(PUDL2d>0,PUDL2l>0),0.1+PosPUDL2,0)","v":0},{"$f":"IF(OR(PUDL2d>0,PUDL2l>0),0.1+PosPUDL2+LePUDL2,0)","v":0},{"$f":"IF(OR(PUDL2d>0,PUDL2l>0),0.1+PosPUDL2+LePUDL2,0)","v":0}]
[null,"Dead",{"$f":"UDL1d+2","v":5.51},{"$f":"UDL1d+2+PUDL2d","v":5.51},{"$f":"UDL1d+2+PUDL2d","v":5.51},{"$f":"UDL1d+2","v":5.51}]
[null,"Live",{"$f":"UDL1d+2+PUDL2d","v":5.51},{"$f":"UDL1d+2+PUDL2d+PUDL2l","v":5.51},{"$f":"UDL1d+2+PUDL2d+PUDL2l","v":5.51},{"$f":"UDL1d+2+PUDL2d","v":5.51}]
[]
[null,"LL a",{"$f":"IF(OR(PLa1d>0,PLa1l>0),0.1+PosPLa1,0)","v":3.1},{"$f":"IF(OR(PLa1d>0,PLa1l>0),0.1+PosPLa1,0)","v":3.1}]
[null,"Dead",{"$f":"IF(PLa1d>0,UDL1d+2,0)","v":5.51},{"$f":"IF(PLa1d>0,UDL1d+2+PLa1d,0)","v":7.51}]
[null,"Live",{"$f":"IF(PLa1l>0,UDL1d+2+PLa1d,0)","v":7.51},{"$f":"IF(PLa1l>0,UDL1d+2+PLa1d+PLa1l,0)","v":9.51}]
[]
[null,"LL b",{"$f":"IF(OR(PLb1d>0,PLb1l>0),0.1+PosPLb1,0)","v":0},{"$f":"IF(OR(PLb1d>0,PLb1l>0),0.1+PosPLb1,0)","v":0}]
[null,"Dead",{"$f":"IF(PLb1d>0,UDL1d+2,0)","v":0},{"$f":"IF(PLb1d>0,UDL1d+2+PLb1d,0)","v":0}]
[null,"Live",{"$f":"IF(PLb1l>0,UDL1d+2+PLb1d,0)","v":0},{"$f":"IF(PLb1l>0,UDL1d+2+PLb1d+PLb1l,0)","v":0}]
[]
[]
{"$rows_left_out":233}
{"sheet":"from author","index":2,"n_rows":39,"n_cols":11,"rows_kept":39,"merged":[[2,2,2,5],[2,6,2,9],[3,2,3,5],[3,6,3,9],[4,12,4,13],[6,2,9,9],[12,2,22,9],[23,2,23,7],[24,2,27,9],[31,2,34,9],[38,2,50,9]]}
[null,"version: 2.2. - FREE LITE VERSION",{"$nulls":8},"© 2010-2019 Damian Janicki"]
[]
[null,null,"For latest updates and news visit:",{"$nulls":3},"Contact me at:"]
[null,null,"www.YourSpreadsheets.co.uk",{"$nulls":3},"info@yourspreadsheets.co.uk"]
[]
[]
[null,null,"General information:\nNote: This spreadsheet contains macros.\nTo change company logo: right click it and select 'change picture'."]
[]
[]
[]
[]
[]
[null,null,"The Author takes no liability for use of this spreadsheet and gives no guarantee that it is error free. \n\nIn no event shall the Author be responsible for any special, incidental or consequential damages whatsoever arising from the use of this spreadsheet, even if the Author has been advised of the possibility of such damage.\n\nThis spreadsheet is a freeware and can be distributed freely but only in its original form.\n\nReverse-engineering, decompiling or disassembling of this spreadsheet is not allowable.\n\nA full list of terms and conditions can be found here:"]
{"$rows_empty":10}
[null,null,"www.yourspreadsheets.co.uk/checkout.html"]
[null,null,"\nBy using this spreadsheet you understand and agree with the terms and conditions. You also acknowledge that you do not become an owner of this spreadsheet.\n\nDamian Janicki"]
[]
[]
[]
[]
[]
[]
[null,null,"This is a Free Lite Version. The full version of the spreadsheet allows to:\n- Input your company information and change logo;\n- Change beam span.\n- Change loading."]
[]
[]
[]
[]
[]
[]
[null,null,"This spreadsheet is based on BS 5950:1 2000.\n\nChangelog:\n26.08.2019 - v.2.2. - updated steel section sizes database. Added in-spreadsheet help pop-up messages. Also a few extra calculation steps are now visible on the print out.\n14.08.2011 - v.2.1. - assigned to a new domain: www.YourSpreadsheets.co.uk.\n27.11.2010 - v.1.6. - cell protection revised to work on Excel 97 and older.\n29.09.2010 - v.1.5. - added option to change mLT between stabilizing and destabilizing load. Activation is now requierd.\n05.08.2010 - v.1.4. - added option to limit allowable deflection to L/200; L/250 or 25mm (good practise for long spans).\n03.06.2010 - v.1.3. - minor cosmetic changes. Note from the Author revised.\n02.05.2010 - v.1.2. - official release of the spreadsheet."]