{"text_format":"1","workbook":"xlsx","n_sheets":3,"sheets":["bracing","datasheet","from author"],"not_rendered":{"charts":1,"images":8,"macros":1,"external_links":0,"defined_names":35,"comments":1,"pivot_tables":0},"unopened":[],"bounds":{"document_bytes":16777216,"sheet_cells":100000,"rows_first":2000,"rows_last":500,"rows_between":2000,"halvings":0,"cell_chars":16384,"cell_head_chars":4096},"cells_cut":0,"cells_raw":0,"read":"whole","date_system":"1900"}

{"sheet":"bracing","index":0,"n_rows":65,"n_cols":55,"rows_kept":65,"cut":false,"hidden":false,"merged":[[52,20,52,21],[53,32,53,34],[53,35,53,37],[55,2,59,27],[44,10,44,11],[45,8,45,9],[45,10,45,11],[46,8,46,9],[46,10,46,11],[47,8,47,9],[47,20,47,21],[48,20,48,21],[49,20,49,21],[53,2,53,27],[51,20,51,21],[51,8,51,9],[44,3,44,5],[45,3,45,5],[51,3,51,5],[47,3,47,5],[48,3,48,5],[49,3,49,5],[48,13,48,14],[52,8,52,9],[38,46,42,46],[38,54,42,54],[38,53,42,53],[38,48,42,48],[38,47,42,47],[39,20,42,21],[39,22,42,22],[39,23,42,23],[50,20,50,21],[38,22,38,26],[38,12,38,21],[39,25,42,25],[43,20,43,21],[44,20,44,21],[45,20,45,21],[43,13,43,14],[44,13,44,14],[45,13,45,14],[46,13,46,14],[47,13,47,14],[46,20,46,21],[39,17,42,17],[39,18,42,18],[39,15,42,15],[48,8,48,9],[48,10,48,11],[49,8,49,9],[50,8,50,9],[43,3,43,5],[46,3,46,5],[50,3,50,5],[43,8,43,9],[43,10,43,11],[44,8,44,9],[49,10,49,11],[50,10,50,11],[50,13,50,14],[51,13,51,14],[52,13,52,14],[5,25,5,28],[60,15,60,27],[5,4,5,14],[5,18,5,21],[5,15,5,17],[37,2,37,27],[7,2,7,14],[18,2,18,14],[7,16,7,27],[13,2,13,12],[12,2,12,12],[8,9,8,14],[8,2,8,8],[12,13,12,14],[27,2,27,12],[27,13,27,14],[60,2,60,14],[5,2,5,3],[38,7,42,7],[39,12,42,12],[47,10,47,11],[52,3,52,5],[39,13,42,14],[38,6,42,6],[5,22,5,24],[13,13,13,14],[11,2,11,12],[11,13,11,14],[24,2,24,4],[9,2,9,8],[9,9,9,14],[38,8,38,11],[39,8,42,9],[39,10,42,11],[38,2,42,2],[26,2,26,14],[20,2,20,4],[21,2,21,4],[22,2,22,4],[23,2,23,4],[14,13,14,14],[15,13,15,14],[51,10,51,11],[52,10,52,11],[49,13,49,14],[19,2,19,4],[29,13,29,14],[25,5,25,14],[32,5,32,14],[38,3,42,5],[0,1,0,15],[0,16,0,28],[4,22,4,24],[4,25,4,28],[1,4,4,14],[1,15,3,21],[4,18,4,21],[4,15,4,17],[1,22,1,27],[2,22,2,24],[2,25,2,28],[3,22,3,24],[3,25,3,28],[14,2,14,12],[15,2,15,12],[16,2,16,12],[38,51,42,51],[38,52,42,52],[39,19,42,19],[39,16,42,16],[38,49,42,49],[38,50,42,50],[8,42,8,43],[8,40,8,41],[10,2,10,8],[10,9,10,14],[17,2,17,14],[17,38,24,38],[10,38,16,38],[39,26,42,26],[39,24,42,24],[38,27,42,27],[31,2,31,12],[31,13,31,14],[30,2,30,12],[30,13,30,14],[28,13,28,14],[28,2,28,12],[29,2,29,12],[16,13,16,14]]}
[null,"Version: 1.0.",null,null,null,null,null,null,null,null,null,null,null,null,null,null,"© 2016 Damian Janicki"]
[null,null,null,null,"  YourSpreadsheets™\n   Top Floor, Made up 52 Marcus Hill, London\n   www.YourSpreadsheets.co.uk\n   Tel: 020 7542 8734",null,null,null,null,null,null,null,null,null,null,"TEST PROJECT"]
[null,null,null,null,null,null,null,null,null,null,null,null,null,null,null,null,null,null,null,null,null,null,"Revision",null,null,"A"]
[null,null,null,null,null,null,null,null,null,null,null,null,null,null,null,null,null,null,null,null,null,null,"Page:",null,null,12]
[null,null,null,null,null,null,null,null,null,null,null,null,null,null,null,"Job No:",null,null,22813,null,null,null,"Date:",null,null,{"$f":"TODAY()","v":"2016-08-31"}]
[null,null,"Member: ",null,"BRACING EXAMPLE",null,null,null,null,null,null,null,null,null,null,"Prepared By:",null,null,"DJ",null,null,null,"Checked By:",null,null,"DJ"]
[]
[null,null,"BASIC DATA:",null,null,null,null,null,null,null,null,null,null,null,null,null,"DIAGRAM:",null,null,null,null,null,null,null,null,null,null,null,null,null,"Bracing type:",null,"Factor for effective length:",0.7,null,"Steel section type:",null,null,null,"Steel design strength per limiting thickness:"]
[null,null,"Bracing type:",null,null,null,null,null,null,"Single diagonal",null,null,null,null,null,null,null,null,null,null,null,null,null,null,null,null,null,null,null,null,"Single diagonal","(SD)",null,0.85,null,"Flat bars","fb",null,null,null,"fy",null,"fu"]
[null,null,"Steel section type:",null,null,null,null,null,null,"CHS (hot rolled)",null,null,null,null,null,null,null,null,null,null,null,null,null,null,null,null,null,null,null,null,"Cross bracing (tension only)","(X)",null,1,null,"Equal Angles (UKA)","EA",null,null,null,"t<16","16<t<40","t<=3","3<t<=100"]
[null,null,"Steel grade:",null,null,null,null,null,null,"S355 H",null,null,null,null,null,null,null,null,null,null,null,null,null,null,null,null,null,null,null,null,"Horizontal K-bracing","(HK)",null,1.2,null,"Unequal Angles (UKA)","UA",null,"Grade (hollow sections)\nhot rolled and cold formed","S235 H",235,225,360,360]
[null,null,"Elastic modulus of steel 'E' [GPa] =",null,null,null,null,null,null,null,null,null,null,205,null,null,null,null,null,null,null,null,null,null,null,null,null,null,null,null,"Inverted V-bracing","(VK)",null,1.5,null,"CHS (hot rolled)","CHS",null,null,"S275 H",275,265,430,410]
[null,null,"Number of stories =",null,null,null,null,null,null,null,null,null,null,"six",null,null,null,null,null,null,null,null,null,null,null,null,null,null,null,null,"Selected:",{"$f":"INDEX(AF9:AF12,MATCH($J$9,AE9:AE12,0))","v":"(SD)"},null,2,null,"RHS (hot rolled)","RHS",null,null,"S355 H",355,345,510,470]
[null,null,"Bay length 'wbay' [m] =",null,null,null,null,null,null,null,null,null,null,3,null,null,null,null,null,null,null,null,null,null,null,null,null,null,null,null,null,null,null,null,null,"SHS (hot rolled)","SHS",null,null,"S275 NH/NLH",275,265,370,370]
[null,null,"Amplification factor for sway-sensitive structures 'kamp' =",null,null,null,null,null,null,null,null,null,null,1,null,null,null,null,null,null,null,null,null,null,null,null,null,null,null,null,null,null,null,null,null,"CHS (cold formed)","CHS",null,null,"S355 NH/NLH",355,345,470,470]
[null,null,"Effective length parameter 'k' [m] =",null,null,null,null,null,null,null,null,null,null,1,null,null,null,null,null,null,null,null,null,null,null,null,null,null,null,null,null,null,null,null,null,"RHS (cold formed)","RHS",null,null,"S420 NH/NLH",420,400,520,520,"row number"]
[null,null,"Area of holes in tension members 'Aholes' [mm2] =",null,null,null,null,null,null,null,null,null,null,452.2,null,null,null,null,null,null,null,null,null,null,null,null,null,null,null,null,null,null,null,null,null,"SHS (cold formed)","SHS",null,null,"S460 NH/NLH",460,440,540,540,7]
[null,null,{"$f":"IF(OR(AND(OR(AK18=AK9,AK18=AK10,AK18=AK11),MATCH(J11,AN11:AN25,0)<=$AS$17),AND(AK18<>AK9,AK18<>AK10,AK18<>AK11,MATCH(J11,AN11:AN25,0)>$AS$17)),\"Incorrect steel grade selected\",\"\")","v":""},null,null,null,null,null,null,null,null,null,null,null,null,null,null,null,null,null,null,null,null,null,null,null,null,null,null,null,null,null,null,null,null,"selected:",{"$f":"INDEX(AK9:AK17,MATCH($J$10,AJ9:AJ17,0))","v":"CHS"},null,"Grade (hot roller sections)","S235",235,225,360,360]
[null,null,"STOREY DATA:",null,null,null,null,null,null,null,null,null,null,null,null,null,null,null,null,null,null,null,null,null,null,null,null,null,null,null,null,null,null,null,null,null,null,null,null,"S275",275,265,430,410]
[null,null,"Storey:",null,null,1,2,3,4,5,6,7,8,9,10,null,null,null,null,null,null,null,null,null,null,null,null,null,null,null,null,null,null,null,null,null,null,null,null,"S355",355,345,510,470]
[null,null,"Height 'h' [m]",null,null,4,4,3,3,3,3,3,3,3,3,null,null,null,null,null,null,null,null,null,null,null,null,null,null,null,"Number of stories:",null,null,"Pass options:",null,null,null,null,null,"S450",450,430,550,550]
[null,null,"Load 'FH' [kN]",null,null,30,20,{"$f":"G22","v":20},20,20,20,20,20,20,20,null,null,null,null,null,null,null,null,null,null,null,null,null,null,null,"one",null,null,"OK"]
[null,null,"Dim 'a' [m]",null,null,2,{"$f":"F23","v":2},{"$f":"G23","v":2},2,2,2,2,2,2,2,null,null,null,null,null,null,null,null,null,null,null,null,null,null,null,"two",null,null,"FAIL"]
[null,null,"Dim 'b' [m]",null,null,{"$f":"IF($AF$13=$AF$11,4-F23,3-F23)","v":1},{"$f":"IF($AF$13=$AF$11,4-G23,3-G23)","v":1},{"$f":"IF($AF$13=$AF$11,H21-H23,3-H23)","v":1},1,1,1,1,1,1,1,null,null,null,null,null,null,null,null,null,null,null,null,null,null,null,"three",null,null,"Cl. 4"]
[null,null,"Height 'H' [m]",null,null,4,{"$f":"SUM(F21:G21)","v":8},{"$f":"SUM(F21:H21)","v":11},{"$f":"SUM(F21:I21)","v":14},{"$f":"SUM(F21:J21)","v":17},{"$f":"SUM(F21:K21)","v":20},{"$f":"SUM(F21:L21)","v":23},{"$f":"SUM(F21:M21)","v":26},{"$f":"SUM(F21:N21)","v":29},{"$f":"SUM(F21:O21)","v":32},null,null,null,null,null,null,null,null,null,null,null,null,null,null,null,"four"]
[null,null,null,null,null,"Horizontal load is treated as ultimate and reversible",null,null,null,null,null,null,null,null,null,null,null,null,null,null,null,null,null,null,null,null,null,null,null,null,"five",null,null,"Elastic modulus of steel:"]
[null,null,"REACTIONS:",null,null,null,null,null,null,null,null,null,null,null,null,null,null,null,null,null,null,null,null,null,null,null,null,null,null,null,"six",null,null,{"$f":"N12*10^3","v":205000}]
[null,null,"Sum of all horizontal loads 'FH_total' [kN] =",null,null,null,null,null,null,null,null,null,null,{"$f":"SUM(OFFSET($F$22,0,0,1,$AF$32))","v":130},null,null,null,null,null,null,null,null,null,null,null,null,null,null,null,null,"seven"]
[null,null,"Horizontal reaction at point A 'RA_hor' [kN] =",null,null,null,null,null,null,null,null,null,null,{"$f":"AF35","v":0},null,null,null,null,null,null,null,null,null,null,null,null,null,null,null,null,"eigth"]
[null,null,"Vertical reaction at point A 'RA_ver' [kN] =",null,null,null,null,null,null,null,null,null,null,{"$f":"-AF36","v":-506.66666666666669},null,null,null,null,null,null,null,null,null,null,null,null,null,null,null,null,"nine"]
[null,null,"Horizontal reaction at point B 'RB_hor' [kN] =",null,null,null,null,null,null,null,null,null,null,{"$f":"AF39","v":-130},null,null,null,null,null,null,null,null,null,null,null,null,null,null,null,null,"ten"]
[null,null,"Vertical reaction at point B 'RB_ver' [kN] =",null,null,null,null,null,null,null,null,null,null,{"$f":"AF40","v":506.66666666666669},null,null,null,null,null,null,null,null,null,null,null,null,null,null,null,null,"selected:",{"$f":"MATCH($N$13,$AE$22:$AE$31,0)","v":6}]
[null,null,null,null,null,"For clarity reactions are given for +ve load rather than reversible"]
[null,null,null,null,null,null,null,null,null,null,null,null,null,null,null,null,null,null,null,null,null,null,null,null,null,null,null,null,null,null,"Reactions at A:"]
[null,null,null,null,null,null,null,null,null,null,null,null,null,null,null,null,null,null,null,null,null,null,null,null,null,null,null,null,null,null,"Horizontal",{"$f":"-IF(AF13=AF9,0,IF(AF13=AF10,(AF50*3/AF44),IF(AF13=AF11,(AF52*3/AF48),(AF51*AF45/AF47))))","v":0},"kN"]
[null,null,null,null,null,null,null,null,null,null,null,null,null,null,null,null,null,null,null,null,null,null,null,null,null,null,null,null,null,null,"Vertical",{"$f":"IF(AF32<2,PRODUCT($F$22,$F$25),IF(AF32<3,SUMPRODUCT($F$22:$G$22,$F$25:$G$25),IF(AF32<4,SUMPRODUCT($F$22:$H$22,$F$25:$H$25),IF(AF32<5,SUMPRODUCT($F$22:$I$22,$F$25:$I$25),IF(AF32<6,SUMPRODUCT($F$22:$J$22,$F$25:$J$25),IF(AF32<7,SUMPRODUCT($F$22:$K$22,$F$25:$K$25),IF(AF32<8,SUMPRODUCT($F$22:$L$22,$F$25:$L$25),IF(AF32<9,SUMPRODUCT($F$22:$M$22,$F$25:$M$25),IF(AF32<10,SUMPRODUCT($F$22:$N$22,$F$25:$N$25),IF(AF32<11,SUMPRODUCT($F$22:$O$22,$F$25:$O$25)))))))))))/3","v":506.66666666666669},"kN"]
[]
[null,null,"BRACING MEMBER DESIGN:",null,null,null,null,null,null,null,null,null,null,null,null,null,null,null,null,null,null,null,null,null,null,null,null,null,null,null,"Reactions at B:"]
[null,null,"STOREY","Bracing member section size",null,null,"Net area [cm2]","Slenderness","Tension check",null,null,null,"Compression check",null,null,null,null,null,null,null,null,null,"Section check",null,null,null,null,"RESULT",null,null,"Horizontal",{"$f":"-IF(AF13=AF9,(AF50*3/AF44),IF(AF13=AF10,0,IF(AF13=AF11,0,(AF52*AF46/AF48))))","v":-130},"kN",null,null,null,null,null,null,null,null,null,null,null,null,null,"Area (cm2)","rmin (cm)","Cumulative force (kN)","Nominal yield strength fy (N/mm2)","Nominal ultimate tensial strength fu (N/mm2)","Design tension plastic resistance of gross section Nt,Rd (kN)","Design ultimate tension resistance of net section Nu,Rd (kN)","Compression resistance Nc,Rd (kN)","Ieff(Second moment of area along YY)(cm^4)"]
[null,null,null,null,null,null,null,null,{"$f":"IF($N$15<>1,\"Amplified tension force [kN]\",\"Tension force [kN]\")","v":"Tension force [kN]"},null,"Member capacity [kN]",null,"Eff. length [m]",{"$f":"IF($N$15<>1,\"Amplified compression force [kN]\",\"Compression force [kN]\")","v":"Compression force [kN]"},null,"λbar","Buckling curve","Imperf. factor","Red. factor φ","Red. factor χ","Compression resistance [kN]",null," Value ε",{"$f":"IF(OR($J$10=$AJ$12,$J$10=$AJ$15),\"d/t ratio\",\"Flange ratio\")","v":"d/t ratio"},"Web ratio","Ratio limit","Section class",null,null,null,"Vertical",{"$f":"AF36","v":506.66666666666669},"kN"]
[]
[null,null,null,null,null,null,null,null,null,null,null,null,null,null,null,null,null,null,null,null,null,null,null,null,null,null,null,null,null,null,"Calculations:"]
[null,null,null,null,null,null,null,null,null,null,null,null,null,null,null,null,null,null,null,null,null,null,null,null,null,null,null,null,null,null,"Storey",1,2,3,4,5,6,7,8,9,10]
[null,null,1,"101.6 x 10",null,null,{"$f":"MAX(0,AU44-$N$17/100)","v":24.277999999999999},{"$f":"$M$44*100/AV44","v":153.37423312883436},{"$f":"$N$15*IF($AF$13=$AF$9,(AW44/(3/AF44)),IF($AF$13=$AF$10,(AW44/(3/AF44)),IF($AF$13=$AF$11,(AW44*MAX(AF47,AF48)/3),IF($AF$13=$AF$12,(AW44*MAX(AF47,AF48)/3)))))","v":216.66666666666669},null,{"$f":"MIN(AZ44,BA44)","v":933.59945454545448},null,{"$f":"(IF($AF$13=$AF$9,AF44,IF($AF$13=$AF$10,AF44,IF($AF$13=$AF$11,MAX(AF47,AF48),IF($AF$13=$AF$12,MAX(AF47,AF48))))))*$N$16","v":5},{"$f":"IF($AF$13=$AF$9,$N$15*(AW44/(3/$AF$44)),IF($AF$13=$AF$10,\"n/a\",IF($AF$13=$AF$11,$N$15*(AW44*MAX($AF$47,$AF$48)/3),IF($AF$13=$AF$12,$N$15*(AW44*MAX($AF$47,$AF$48)/3)))))","v":216.66666666666669},null,{"$f":"IF(OR($AA44=1,$AA44=2,$AA44=3),(($M44*100/$AV44)/$AM56),((($M44*100/$AV44)/$AM56)*($G44/$AU44)^0.5))","v":2.0075531746740682},{"$f":"IF($AF$13=$AF$10,\"n/a\",IF(OR($J$10=$AJ$12,$J$10=$AJ$13,$J$10=$AJ$14),IF(OR($AX44=235,$AX44=275,$AX44=355,$AX44=420),\"a\",\"a0\"),IF(OR($J$10=$AJ$15,$J$10=$AJ$16,$J$10=$AJ$17),\"c\")))","v":"a"},{"$f":"IF($AF$13=$AF$10,\"n/a\",INDEX($AN$60:$AO$62,MATCH($Q44,$AN$60:$AN$62,0),2))","v":0.21},{"$f":"IF($AF$13=$AF$10,\"n/a\",0.5*(1+($R44*($P44-0.2)+$P44^2)))","v":2.7049279579127421},{"$f":"IF($AF$13=$AF$10,\"n/a\",MIN(1,1/($S44+($S44^2-$P44^2)^0.5)))","v":0.22134855868727019},{"$f":"IF($AF$13=$AF$10,\"n/a\",IF(OR($AA44=1,$AA44=2,$AA44=3),(IF($T44>1,1,$T44)*$AU44*$AX44/10),(IF($T44>1,1,$T44)*$G44*$AX44/11)))","v":226.30676640186502},null,{"$f":"(235/$AX44)^0.5","v":0.81361651346682706},{"$f":"IF($J$10=$AJ$12,INDEX(tchshf,MATCH(D44,lchshf,0),7),IF($J$10=$AJ$13,INDEX(trhs,MATCH(D44,RHS,0),8),IF($J$10=$AJ$14,INDEX(tshs,MATCH(D44,SHS,0),7),IF($J$10=$AJ$15,INDEX(tchscf,MATCH(D44,lchscf,0),7),IF($J$10=$AJ$16,INDEX(trhscf,MATCH(D44,lrhscf,0),8),IF($J$10=$AJ$17,INDEX(tshscf,MATCH(D44,lshscf,0),7),\"n/a\"))))))","v":10.199999999999999},{"$f":"IF($J$10=$AJ$13,INDEX(trhs,MATCH(D44,RHS,0),7),IF($J$10=$AJ$14,INDEX(tshs,MATCH(D44,SHS,0),7),IF($J$10=$AJ$16,INDEX(trhscf,MATCH(D44,lrhscf,0),7),IF($J$10=$AJ$17,INDEX(tshscf,MATCH(D44,lshscf,0),7),\"n/a\"))))","v":"n/a"},{"$f":"IF(OR($J$10=$AJ$12,$J$10=$AJ$15),INDEX(AJ56:AL56,1,MIN(3,AA44)),INDEX(AG56:AI56,1,MIN(3,AA44)))","v":33.098591549295783},{"$f":"IF($AF$13=$AF$10,\"n/a\",IF(OR($J$10=$AJ$13,$J$10=$AJ$14,$J$10=$AJ$16,$J$10=$AJ$17),IF(MAX($X44,$Y44)<$AG56,1,IF(MAX($X44,$Y44)<$AH56,2,IF(MAX($X44,$Y44)<$AI56,3,4))),IF(OR($J$10=$AJ$12,$J$10=$AJ$15),IF(MAX($X44,$Y44)<$AJ56,1,IF(MAX($X44,$Y44)<$AK56,2,IF(MAX($X44,$Y44)<$AL56,3,4))))))","v":1},{"$f":"IF(AND(C44<=$AF$32,$AF$13<>$AF$10,$AA44=4),$AH$24,IF(C44<=$AF$32,IF(OR(I44>K44,AND($AF$13<>$AF$10,N44>U44)),$AH$23,$AH$22)))","v":"OK"},null,null,"Max length of bracing(for X & SD only)",{"$f":"(4^2+3^2)^0.5","v":5},{"$f":"(4^2+3^2)^0.5","v":5},{"$f":"(H21^2+3^2)^0.5","v":4.2426406871192848},4.2426406871192848,4.2426406871192848,4.2426406871192848,4.2426406871192848,4.2426406871192848,4.2426406871192848,4.2426406871192848,"mtr.",null,null,null,null,{"$f":"IF($J$10=$AJ$10,INDEX(teq,MATCH(D44,eq,0),6),IF($J$10=$AJ$12,INDEX(tchshf,MATCH(D44,lchshf,0),6),IF($J$10=$AJ$13,INDEX(trhs,MATCH(D44,RHS,0),6),IF($J$10=$AJ$14,INDEX(tshs,MATCH(D44,SHS,0),6),IF($J$10=$AJ$11,INDEX(tuneq,MATCH(D44,uneq,0),6),IF($J$10=$AJ$9,INDEX(tflatb,MATCH(D44,flatb,0),4),IF($J$10=$AJ$15,INDEX(tchscf,MATCH(D44,lchscf,0),6),IF($J$10=$AJ$16,INDEX(trhscf,MATCH(D44,lrhscf,0),6),IF($J$10=$AJ$17,INDEX(tshscf,MATCH(D44,lshscf,0),6))))))))))","v":28.8},{"$f":"IF($J$10=$AJ$10,INDEX(teq,MATCH(D44,eq,0),11),IF($J$10=$AJ$12,INDEX(tchshf,MATCH(D44,lchshf,0),9),IF($J$10=$AJ$13,INDEX(trhs,MATCH(D44,RHS,0),12),IF($J$10=$AJ$14,INDEX(tshs,MATCH(D44,SHS,0),9),IF($J$10=$AJ$11,INDEX(tuneq,MATCH(D44,uneq,0),14),IF($J$10=$AJ$9,INDEX(tflatb,MATCH(D44,flatb,0),6),IF($J$10=$AJ$15,INDEX(tchscf,MATCH(D44,lchscf,0),9),IF($J$10=$AJ$16,INDEX(trhscf,MATCH(D44,lrhscf,0),12),IF($J$10=$AJ$17,INDEX(tshscf,MATCH(D44,lshscf,0),9))))))))))","v":3.26},{"$f":"IF($AF$32<2,$F$22,IF($AF$32<3,SUM($F$22:$G$22),IF($AF$32<4,SUM($F$22:$H$22),IF($AF$32<5,SUM($F$22:$I$22),IF($AF$32<6,SUM($F$22:$J$22),IF($AF$32<7,SUM($F$22:$K$22),IF($AF$32<8,SUM($F$22:$L$22),IF($AF$32<9,SUM($F$22:$M$22),IF($AF$32<10,SUM($F$22:$N$22),IF($AF$32<11,SUM($F$22:$O$22)))))))))))","v":130},{"$f":"INDEX($AO$11:$AP$25,MATCH($J$11,$AN$11:$AN$25,0),INDEX(datasheet!$A$17:$A$1224,MATCH($D44,datasheet!$C$17:$C$1224,0)))","v":355},{"$f":"INDEX($AQ$11:$AR$25,MATCH($J$11,$AN$11:$AN$25,0),INDEX(datasheet!$B$17:$B$1224,MATCH($D44,datasheet!$C$17:$C$1224,0)))","v":470},{"$f":"($AX44*$AU44/10)","v":1022.4},{"$f":"(0.9*$AY44*$G44/11)","v":933.59945454545448},{"$f":"IF(OR($AA44=1,$AA44=2,$AA44=3),($AU44*$AX44/10),($G44*$AX44/10))","v":1022.4},{"$f":"IF($J$10=$AJ$10,INDEX(teq,MATCH(D44,eq,0),8),IF($J$10=$AJ$12,INDEX(tchshf,MATCH(D44,lchshf,0),8),IF($J$10=$AJ$13,INDEX(trhs,MATCH(D44,RHS,0),10),IF($J$10=$AJ$14,INDEX(tshs,MATCH(D44,SHS,0),8),IF($J$10=$AJ$11,INDEX(tuneq,MATCH(D44,uneq,0),10),IF($J$10=$AJ$9,INDEX(tflatb,MATCH(D44,flatb,0),4),IF($J$10=$AJ$15,INDEX(tchscf,MATCH(D44,lchscf,0),8),IF($J$10=$AJ$16,INDEX(trhscf,MATCH(D44,lrhscf,0),10),IF($J$10=$AJ$17,INDEX(tshscf,MATCH(D44,lshscf,0),8))))))))))","v":305}]
[null,null,2,{"$f":"D44","v":"101.6 x 10"},null,null,{"$f":"MAX(0,AU45-$N$17/100)","v":24.277999999999999},{"$f":"$M$45*100/AV45","v":153.37423312883436},{"$f":"$N$15*IF($AF$13=$AF$9,(AW45/(3/$AG$44)),IF($AF$13=$AF$10,(AW45/(3/$AG$44)),IF($AF$13=$AF$11,(AW45*MAX($AG$47,$AG$48)/3),IF($AF$13=$AF$12,(AW45*MAX($AG$47,$AG$48)/3)))))","v":166.66666666666669},null,933.59945454545448,null,{"$f":"(IF($AF$13=$AF$9,AG44,IF($AF$13=$AF$10,AG44,IF($AF$13=$AF$11,MAX(AG47,AG48),IF($AF$13=$AF$12,MAX(AG47,AG48))))))*$N$16","v":5},{"$f":"IF($AF$13=$AF$9,$N$15*(AW45/(3/$AG$44)),IF($AF$13=$AF$10,\"n/a\",IF($AF$13=$AF$11,$N$15*(AW45*MAX($AG$47,$AG$48)/3),IF($AF$13=$AF$12,$N$15*(AW45*MAX($AG$47,$AG$48)/3)))))","v":166.66666666666669},null,2.0075531746740682,{"$f":"IF($AF$13=$AF$10,\"n/a\",IF(OR($J$10=$AJ$12,$J$10=$AJ$13,$J$10=$AJ$14),IF(OR($AX45=235,$AX45=275,$AX45=355,$AX45=420),\"a\",\"a0\"),IF(OR($J$10=$AJ$15,$J$10=$AJ$16,$J$10=$AJ$17),\"c\")))","v":"a"},{"$f":"IF($AF$13=$AF$10,\"n/a\",INDEX($AN$60:$AO$62,MATCH($Q45,$AN$60:$AN$62,0),2))","v":0.21},{"$f":"IF($AF$13=$AF$10,\"n/a\",0.5*(1+($R45*($P45-0.2)+$P45^2)))","v":2.7049279579127421},{"$f":"IF($AF$13=$AF$10,\"n/a\",MIN(1,1/($S45+($S45^2-$P45^2)^0.5)))","v":0.22134855868727019},{"$f":"IF($AF$13=$AF$10,\"n/a\",IF(OR($AA45=1,$AA45=2,$AA45=3),(IF($T45>1,1,$T45)*$AU45*$AX45/10),(IF($T45>1,1,$T45)*$G45*$AX45/11)))","v":226.30676640186502},null,0.81361651346682706,10.199999999999999,"n/a",{"$f":"IF(OR($J$10=$AJ$12,$J$10=$AJ$15),INDEX(AJ57:AL57,1,MIN(3,AA45)),INDEX(AG57:AI57,1,MIN(3,AA45)))","v":33.098591549295783},1,{"$f":"IF(AND(C45<=$AF$32,$AF$13<>$AF$10,$AA45=4),$AH$24,IF(C45<=$AF$32,IF(OR(I45>K45,AND($AF$13<>$AF$10,N45>U45)),$AH$23,$AH$22)))","v":"OK"},null,null,"Dimension from base to knee",{"$f":"$F$23","v":2},{"$f":"$G$23","v":2},{"$f":"$H$23","v":2},{"$f":"$I$23","v":2},{"$f":"$J$23","v":2},{"$f":"$K$23","v":2},{"$f":"$L$23","v":2},{"$f":"$M$23","v":2},{"$f":"$N$23","v":2},{"$f":"$O$23","v":2},"mtr.","for K bracing only",null,null,null,28.8,3.26,{"$f":"IF($AF$32<2,$F$22,IF($AF$32<3,SUM($F$22:$G$22),IF($AF$32<4,SUM($F$22:$H$22),IF($AF$32<5,SUM($F$22:$I$22),IF($AF$32<6,SUM($F$22:$J$22),IF($AF$32<7,SUM($F$22:$K$22),IF($AF$32<8,SUM($F$22:$L$22),IF($AF$32<9,SUM($F$22:$M$22),IF($AF$32<10,SUM($F$22:$N$22),IF($AF$32<11,SUM($F$22:$O$22)))))))))))-$F$22","v":100},{"$f":"INDEX($AO$11:$AP$25,MATCH($J$11,$AN$11:$AN$25,0),INDEX(datasheet!$A$17:$A$1224,MATCH($D45,datasheet!$C$17:$C$1224,0)))","v":355},{"$f":"INDEX($AQ$11:$AR$25,MATCH($J$11,$AN$11:$AN$25,0),INDEX(datasheet!$B$17:$B$1224,MATCH($D45,datasheet!$C$17:$C$1224,0)))","v":470},1022.4,933.59945454545448,1022.4,305]
[null,null,3,{"$f":"D45","v":"101.6 x 10"},null,null,24.277999999999999,{"$f":"$M$46*100/AV46","v":130.14235236562223},{"$f":"$N$15*IF($AF$13=$AF$9,(AW46/(3/$AH$44)),IF($AF$13=$AF$10,(AW46/(3/$AH$44)),IF($AF$13=$AF$11,(AW46*MAX($AH$47,$AH$48)/3),IF($AF$13=$AF$12,(AW46*MAX($AH$47,$AH$48)/3)))))","v":113.13708498984759},null,933.59945454545448,null,{"$f":"(IF($AF$13=$AF$9,AH44,IF($AF$13=$AF$10,AH44,IF($AF$13=$AF$11,MAX(AH47,AH48),IF($AF$13=$AF$12,MAX(AH47,AH48))))))*$N$16","v":4.2426406871192848},{"$f":"IF($AF$13=$AF$9,$N$15*(AW46/(3/$AH$44)),IF($AF$13=$AF$10,\"n/a\",IF($AF$13=$AF$11,$N$15*(AW46*MAX($AH$47,$AH$48)/3),IF($AF$13=$AF$12,$N$15*(AW46*MAX($AH$47,$AH$48)/3)))))","v":113.13708498984759},null,1.7034653560855382,"a",0.21,2.108760972080796,0.29834957022171871,305.03260059468522,null,0.81361651346682706,10.199999999999999,"n/a",33.098591549295783,1,"OK",null,null,"Dimension from knee to top of frame",{"$f":"$F$24","v":1},{"$f":"$G$24","v":1},{"$f":"$H$24","v":1},{"$f":"$I$24","v":1},{"$f":"$J$24","v":1},{"$f":"$K$24","v":1},{"$f":"$L$24","v":1},{"$f":"$M$24","v":1},{"$f":"$N$24","v":1},{"$f":"$O$24","v":1},"mtr.","for K bracing only",null,null,null,28.8,3.26,{"$f":"IF($AF$32<2,$F$22,IF($AF$32<3,SUM($F$22:$G$22),IF($AF$32<4,SUM($F$22:$H$22),IF($AF$32<5,SUM($F$22:$I$22),IF($AF$32<6,SUM($F$22:$J$22),IF($AF$32<7,SUM($F$22:$K$22),IF($AF$32<8,SUM($F$22:$L$22),IF($AF$32<9,SUM($F$22:$M$22),IF($AF$32<10,SUM($F$22:$N$22),IF($AF$32<11,SUM($F$22:$O$22)))))))))))-SUM($F$22:$G$22)","v":80},{"$f":"INDEX($AO$11:$AP$25,MATCH($J$11,$AN$11:$AN$25,0),INDEX(datasheet!$A$17:$A$1224,MATCH($D46,datasheet!$C$17:$C$1224,0)))","v":355},{"$f":"INDEX($AQ$11:$AR$25,MATCH($J$11,$AN$11:$AN$25,0),INDEX(datasheet!$B$17:$B$1224,MATCH($D46,datasheet!$C$17:$C$1224,0)))","v":470},1022.4,933.59945454545448,1022.4,305]
[null,null,4,"101.6 x 10",null,null,24.277999999999999,{"$f":"$M$47*100/AV47","v":130.14235236562223},{"$f":"$N$15*IF($AF$13=$AF$9,(AW47/(3/$AI$44)),IF($AF$13=$AF$10,(AW47/(3/$AI$44)),IF($AF$13=$AF$11,(AW47*MAX($AI$47,$AI$48)/3),IF($AF$13=$AF$12,(AW47*MAX($AI$47,$AI$48)/3)))))","v":84.852813742385692},null,933.59945454545448,null,{"$f":"(IF($AF$13=$AF$9,AI44,IF($AF$13=$AF$10,AI44,IF($AF$13=$AF$11,MAX(AI47,AI48),IF($AF$13=$AF$12,MAX(AI47,AI48))))))*$N$16","v":4.2426406871192848},{"$f":"IF($AF$13=$AF$9,$N$15*(AW47/(3/$AI$44)),IF($AF$13=$AF$10,\"n/a\",IF($AF$13=$AF$11,$N$15*(AW47*MAX($AI$47,$AI$48)/3),IF($AF$13=$AF$12,$N$15*(AW47*MAX($AI$47,$AI$48)/3)))))","v":84.852813742385692},null,1.7034653560855382,"a",0.21,2.108760972080796,0.29834957022171871,305.03260059468522,null,0.81361651346682706,10.199999999999999,"n/a",33.098591549295783,1,"OK",null,null,"Length of top brace            ",{"$f":"IF($AF$13=$AF$11,(($AF$45^2+3^2)^0.5),(($AF$45^2+4^2)^0.5))","v":4.4721359549995796},{"$f":"IF($AF$13=$AF$11,(($AG$45^2+3^2)^0.5),(($AG$45^2+4^2)^0.5))","v":4.4721359549995796},{"$f":"IF($AF$13=$AF$11,(($AH$45^2+3^2)^0.5),(($AH$45^2+$H$21^2)^0.5))","v":3.6055512754639891},{"$f":"IF($AF$13=$AF$11,(($AI$45^2+3^2)^0.5),(($AI$45^2+$I$21^2)^0.5))","v":3.6055512754639891},{"$f":"IF($AF$13=$AF$11,(($AJ$45^2+3^2)^0.5),(($AJ$45^2+$J$21^2)^0.5))","v":3.6055512754639891},{"$f":"IF($AF$13=$AF$11,(($AK$45^2+3^2)^0.5),(($AK$45^2+$K$21^2)^0.5))","v":3.6055512754639891},{"$f":"IF($AF$13=$AF$11,(($AL$45^2+3^2)^0.5),(($AL$45^2+$L$21^2)^0.5))","v":3.6055512754639891},{"$f":"IF($AF$13=$AF$11,(($AM$45^2+3^2)^0.5),(($AM$45^2+$M$21^2)^0.5))","v":3.6055512754639891},{"$f":"IF($AF$13=$AF$11,(($AN$45^2+3^2)^0.5),(($AN$45^2+$N$21^2)^0.5))","v":3.6055512754639891},{"$f":"IF($AF$13=$AF$11,(($AO$45^2+3^2)^0.5),(($AO$45^2+$O$21^2)^0.5))","v":3.6055512754639891},"mtr.","for K bracing only",null,null,null,28.8,3.26,{"$f":"IF($AF$32<2,$F$22,IF($AF$32<3,SUM($F$22:$G$22),IF($AF$32<4,SUM($F$22:$H$22),IF($AF$32<5,SUM($F$22:$I$22),IF($AF$32<6,SUM($F$22:$J$22),IF($AF$32<7,SUM($F$22:$K$22),IF($AF$32<8,SUM($F$22:$L$22),IF($AF$32<9,SUM($F$22:$M$22),IF($AF$32<10,SUM($F$22:$N$22),IF($AF$32<11,SUM($F$22:$O$22)))))))))))-SUM($F$22:$H$22)","v":60},{"$f":"INDEX($AO$11:$AP$25,MATCH($J$11,$AN$11:$AN$25,0),INDEX(datasheet!$A$17:$A$1224,MATCH($D47,datasheet!$C$17:$C$1224,0)))","v":355},{"$f":"INDEX($AQ$11:$AR$25,MATCH($J$11,$AN$11:$AN$25,0),INDEX(datasheet!$B$17:$B$1224,MATCH($D47,datasheet!$C$17:$C$1224,0)))","v":470},1022.4,933.59945454545448,1022.4,305]
[null,null,5,{"$f":"D47","v":"101.6 x 10"},null,null,24.277999999999999,{"$f":"$M$48*100/AV48","v":130.14235236562223},{"$f":"$N$15*IF($AF$13=$AF$9,(AW48/(3/$AJ$44)),IF($AF$13=$AF$10,(AW48/(3/$AJ$44)),IF($AF$13=$AF$11,(AW48*MAX($AJ$47,$AJ$48)/3),IF($AF$13=$AF$12,(AW48*MAX($AJ$47,$AJ$48)/3)))))","v":56.568542494923797},null,933.59945454545448,null,{"$f":"(IF($AF$13=$AF$9,AJ44,IF($AF$13=$AF$10,AJ44,IF($AF$13=$AF$11,MAX(AJ47,AJ48),IF($AF$13=$AF$12,MAX(AJ47,AJ48))))))*$N$16","v":4.2426406871192848},{"$f":"IF($AF$13=$AF$9,$N$15*(AW48/(3/$AJ$44)),IF($AF$13=$AF$10,\"n/a\",IF($AF$13=$AF$11,$N$15*(AW48*MAX($AJ$47,$AJ$48)/3),IF($AF$13=$AF$12,$N$15*(AW48*MAX($AJ$47,$AJ$48)/3)))))","v":56.568542494923797},null,1.7034653560855382,"a",0.21,2.108760972080796,0.29834957022171871,305.03260059468522,null,0.81361651346682706,10.199999999999999,"n/a",33.098591549295783,1,"OK",null,null,"Length of bottom brace",{"$f":"IF($AF$13=$AF$11,($AF$46^2+3^2)^0.5,(($AF$46^2+4^2)^0.5))","v":4.1231056256176606},{"$f":"IF($AF$13=$AF$11,($AG$46^2+3^2)^0.5,(($AG$46^2+4^2)^0.5))","v":4.1231056256176606},{"$f":"IF($AF$13=$AF$11,($AH$46^2+3^2)^0.5,(($AH$46^2+$H$21^2)^0.5))","v":3.1622776601683795},{"$f":"IF($AF$13=$AF$11,($AI$46^2+3^2)^0.5,(($AI$46^2+$I$21^2)^0.5))","v":3.1622776601683795},{"$f":"IF($AF$13=$AF$11,($AJ$46^2+3^2)^0.5,(($AJ$46^2+$J$21^2)^0.5))","v":3.1622776601683795},{"$f":"IF($AF$13=$AF$11,($AK$46^2+3^2)^0.5,(($AK$46^2+$K$21^2)^0.5))","v":3.1622776601683795},{"$f":"IF($AF$13=$AF$11,($AL$46^2+3^2)^0.5,(($AL$46^2+$L$21^2)^0.5))","v":3.1622776601683795},{"$f":"IF($AF$13=$AF$11,($AM$46^2+3^2)^0.5,(($AM$46^2+$M$21^2)^0.5))","v":3.1622776601683795},{"$f":"IF($AF$13=$AF$11,($AN$46^2+3^2)^0.5,(($AN$46^2+$N$21^2)^0.5))","v":3.1622776601683795},{"$f":"IF($AF$13=$AF$11,($AO$46^2+3^2)^0.5,(($AO$46^2+$O$21^2)^0.5))","v":3.1622776601683795},"mtr.","for K bracing only",null,null,null,28.8,3.26,{"$f":"IF($AF$32<2,$F$22,IF($AF$32<3,SUM($F$22:$G$22),IF($AF$32<4,SUM($F$22:$H$22),IF($AF$32<5,SUM($F$22:$I$22),IF($AF$32<6,SUM($F$22:$J$22),IF($AF$32<7,SUM($F$22:$K$22),IF($AF$32<8,SUM($F$22:$L$22),IF($AF$32<9,SUM($F$22:$M$22),IF($AF$32<10,SUM($F$22:$N$22),IF($AF$32<11,SUM($F$22:$O$22)))))))))))-SUM($F$22:$I$22)","v":40},{"$f":"INDEX($AO$11:$AP$25,MATCH($J$11,$AN$11:$AN$25,0),INDEX(datasheet!$A$17:$A$1224,MATCH($D48,datasheet!$C$17:$C$1224,0)))","v":355},{"$f":"INDEX($AQ$11:$AR$25,MATCH($J$11,$AN$11:$AN$25,0),INDEX(datasheet!$B$17:$B$1224,MATCH($D48,datasheet!$C$17:$C$1224,0)))","v":470},1022.4,933.59945454545448,1022.4,305]
[null,null,6,"101.6 x 10",null,null,24.277999999999999,{"$f":"$M$49*100/AV49","v":130.14235236562223},{"$f":"$N$15*IF($AF$13=$AF$9,(AW49/(3/$AK$44)),IF($AF$13=$AF$10,(AW49/(3/$AK$44)),IF($AF$13=$AF$11,(AW49*MAX($AK$47,$AK$48)/3),IF($AF$13=$AF$12,(AW49*MAX($AK$47,$AK$48)/3)))))","v":28.284271247461898},null,933.59945454545448,null,{"$f":"(IF($AF$13=$AF$9,AK44,IF($AF$13=$AF$10,AK44,IF($AF$13=$AF$11,MAX(AK47,AK48),IF($AF$13=$AF$12,MAX(AK47,AK48))))))*$N$16","v":4.2426406871192848},{"$f":"IF($AF$13=$AF$9,$N$15*(AW49/(3/$AK$44)),IF($AF$13=$AF$10,\"n/a\",IF($AF$13=$AF$11,$N$15*(AW49*MAX($AK$47,$AK$48)/3),IF($AF$13=$AF$12,$N$15*(AW49*MAX($AK$47,$AK$48)/3)))))","v":28.284271247461898},null,1.7034653560855382,"a",0.21,2.108760972080796,0.29834957022171871,305.03260059468522,null,0.81361651346682706,10.199999999999999,"n/a",33.098591549295783,1,"OK",null,null,"Cumulative total load ",{"$f":"AW44","v":130},{"$f":"AW45","v":100},{"$f":"AW46","v":80},{"$f":"AW47","v":60},{"$f":"AW48","v":40},{"$f":"AW49","v":20},{"$f":"AW50","v":0},{"$f":"AW51","v":-20},{"$f":"AW52","v":-40},{"$f":"AW53","v":-60},"kN",null,null,null,null,28.8,3.26,{"$f":"IF($AF$32<2,$F$22,IF($AF$32<3,SUM($F$22:$G$22),IF($AF$32<4,SUM($F$22:$H$22),IF($AF$32<5,SUM($F$22:$I$22),IF($AF$32<6,SUM($F$22:$J$22),IF($AF$32<7,SUM($F$22:$K$22),IF($AF$32<8,SUM($F$22:$L$22),IF($AF$32<9,SUM($F$22:$M$22),IF($AF$32<10,SUM($F$22:$N$22),IF($AF$32<11,SUM($F$22:$O$22)))))))))))-SUM($F$22:$J$22)","v":20},{"$f":"INDEX($AO$11:$AP$25,MATCH($J$11,$AN$11:$AN$25,0),INDEX(datasheet!$A$17:$A$1224,MATCH($D49,datasheet!$C$17:$C$1224,0)))","v":355},{"$f":"INDEX($AQ$11:$AR$25,MATCH($J$11,$AN$11:$AN$25,0),INDEX(datasheet!$B$17:$B$1224,MATCH($D49,datasheet!$C$17:$C$1224,0)))","v":470},1022.4,933.59945454545448,1022.4,305]
[null,null,7,"101.6 x 10",null,null,24.277999999999999,{"$f":"$M$50*100/AV50","v":130.14235236562223},{"$f":"$N$15*IF($AF$13=$AF$9,(AW50/(3/$AL$44)),IF($AF$13=$AF$10,(AW50/(3/$AL$44)),IF($AF$13=$AF$11,(AW50*MAX($AL$47,$AL$48)/3),IF($AF$13=$AF$12,(AW50*MAX($AL$47,$AL$48)/3)))))","v":0},null,933.59945454545448,null,{"$f":"(IF($AF$13=$AF$9,AL44,IF($AF$13=$AF$10,AL44,IF($AF$13=$AF$11,MAX(AL47,AL48),IF($AF$13=$AF$12,MAX(AL47,AL48))))))*$N$16","v":4.2426406871192848},{"$f":"IF($AF$13=$AF$9,$N$15*(AW50/(3/$AL$44)),IF($AF$13=$AF$10,\"n/a\",IF($AF$13=$AF$11,$N$15*(AW50*MAX($AL$47,$AL$48)/3),IF($AF$13=$AF$12,$N$15*(AW50*MAX($AL$47,$AL$48)/3)))))","v":0},null,1.7034653560855382,"a",0.21,2.108760972080796,0.29834957022171871,305.03260059468522,null,0.81361651346682706,10.199999999999999,"n/a",33.098591549295783,1,false,null,null,"Maximum  force on bracing member (X,SD only)",{"$f":"AF49/(3/AF44)","v":216.66666666666669},166.66666666666669,113.13708498984759,84.852813742385692,56.568542494923797,28.284271247461898,0,-28.284271247461898,-56.568542494923797,-84.852813742385692,"kN",null,null,null,null,28.8,3.26,{"$f":"IF($AF$32<2,$F$22,IF($AF$32<3,SUM($F$22:$G$22),IF($AF$32<4,SUM($F$22:$H$22),IF($AF$32<5,SUM($F$22:$I$22),IF($AF$32<6,SUM($F$22:$J$22),IF($AF$32<7,SUM($F$22:$K$22),IF($AF$32<8,SUM($F$22:$L$22),IF($AF$32<9,SUM($F$22:$M$22),IF($AF$32<10,SUM($F$22:$N$22),IF($AF$32<11,SUM($F$22:$O$22)))))))))))-SUM($F$22:$K$22)","v":0},{"$f":"INDEX($AO$11:$AP$25,MATCH($J$11,$AN$11:$AN$25,0),INDEX(datasheet!$A$17:$A$1224,MATCH($D50,datasheet!$C$17:$C$1224,0)))","v":355},{"$f":"INDEX($AQ$11:$AR$25,MATCH($J$11,$AN$11:$AN$25,0),INDEX(datasheet!$B$17:$B$1224,MATCH($D50,datasheet!$C$17:$C$1224,0)))","v":470},1022.4,933.59945454545448,1022.4,305]
[null,null,8,"101.6 x 10",null,null,24.277999999999999,{"$f":"$M$51*100/AV51","v":130.14235236562223},{"$f":"$N$15*IF($AF$13=$AF$9,(AW51/(3/$AM$44)),IF($AF$13=$AF$10,(AW51/(3/$AM$44)),IF($AF$13=$AF$11,(AW51*MAX($AM$47,$AM$48)/3),IF($AF$13=$AF$12,(AW51*MAX($AM$47,$AM$48)/3)))))","v":-28.284271247461898},null,933.59945454545448,null,{"$f":"(IF($AF$13=$AF$9,AM44,IF($AF$13=$AF$10,AM44,IF($AF$13=$AF$11,MAX(AM47,AM48),IF($AF$13=$AF$12,MAX(AM47,AM48))))))*$N$16","v":4.2426406871192848},{"$f":"IF($AF$13=$AF$9,$N$15*(AW51/(3/$AM$44)),IF($AF$13=$AF$10,\"n/a\",IF($AF$13=$AF$11,$N$15*(AW51*MAX($AM$47,$AM$48)/3),IF($AF$13=$AF$12,$N$15*(AW51*MAX($AM$47,$AM$48)/3)))))","v":-28.284271247461898},null,1.7034653560855382,"a",0.21,2.108760972080796,0.29834957022171871,305.03260059468522,null,0.81361651346682706,10.199999999999999,"n/a",33.098591549295783,1,false,null,null,"Maximum force",{"$f":"AF49*AF47/3","v":193.79255804998181},149.07119849998597,96.148034012373046,72.111025509279784,48.074017006186523,24.037008503093261,0,-24.037008503093261,-48.074017006186523,-72.111025509279784,"kN",{"$f":"IF(AF13=AF11,\"Not applicable\",\"Applicable\")","v":"Applicable"},null,null,null,28.8,3.26,{"$f":"IF($AF$32<2,$F$22,IF($AF$32<3,SUM($F$22:$G$22),IF($AF$32<4,SUM($F$22:$H$22),IF($AF$32<5,SUM($F$22:$I$22),IF($AF$32<6,SUM($F$22:$J$22),IF($AF$32<7,SUM($F$22:$K$22),IF($AF$32<8,SUM($F$22:$L$22),IF($AF$32<9,SUM($F$22:$M$22),IF($AF$32<10,SUM($F$22:$N$22),IF($AF$32<11,SUM($F$22:$O$22)))))))))))-SUM($F$22:$L$22)","v":-20},{"$f":"INDEX($AO$11:$AP$25,MATCH($J$11,$AN$11:$AN$25,0),INDEX(datasheet!$A$17:$A$1224,MATCH($D51,datasheet!$C$17:$C$1224,0)))","v":355},{"$f":"INDEX($AQ$11:$AR$25,MATCH($J$11,$AN$11:$AN$25,0),INDEX(datasheet!$B$17:$B$1224,MATCH($D51,datasheet!$C$17:$C$1224,0)))","v":470},1022.4,933.59945454545448,1022.4,305]
[null,null,9,"101.6 x 10",null,null,24.277999999999999,{"$f":"$M$52*100/AV52","v":130.14235236562223},{"$f":"$N$15*IF($AF$13=$AF$9,(AW52/(3/$AN$44)),IF($AF$13=$AF$10,(AW52/(3/$AN$44)),IF($AF$13=$AF$11,(AW52*MAX($AN$47,$AN$48)/3),IF($AF$13=$AF$12,(AW52*MAX($AN$47,$AN$48)/3)))))","v":-56.568542494923797},null,933.59945454545448,null,{"$f":"(IF($AF$13=$AF$9,AN44,IF($AF$13=$AF$10,AN44,IF($AF$13=$AF$11,MAX(AN47,AN48),IF($AF$13=$AF$12,MAX(AN47,AN48))))))*$N$16","v":4.2426406871192848},{"$f":"IF($AF$13=$AF$9,$N$15*(AW52/(3/$AN$44)),IF($AF$13=$AF$10,\"n/a\",IF($AF$13=$AF$11,$N$15*(AW52*MAX($AN$47,$AN$48)/3),IF($AF$13=$AF$12,$N$15*(AW52*MAX($AN$47,$AN$48)/3)))))","v":-56.568542494923797},null,1.7034653560855382,"a",0.21,2.108760972080796,0.29834957022171871,305.03260059468522,null,0.81361651346682706,10.199999999999999,"n/a",33.098591549295783,1,false,null,null,"Maximum force",{"$f":"AF49*AF48/3","v":178.66791044343196},137.43685418725536,84.327404271156794,63.245553203367592,42.163702135578397,21.081851067789199,0,-21.081851067789199,-42.163702135578397,-63.245553203367592,"kN",{"$f":"IF(AF13=AF11,\"Not applicable\",\"Applicable\")","v":"Applicable"},null,null,null,28.8,3.26,{"$f":"IF($AF$32<2,$F$22,IF($AF$32<3,SUM($F$22:$G$22),IF($AF$32<4,SUM($F$22:$H$22),IF($AF$32<5,SUM($F$22:$I$22),IF($AF$32<6,SUM($F$22:$J$22),IF($AF$32<7,SUM($F$22:$K$22),IF($AF$32<8,SUM($F$22:$L$22),IF($AF$32<9,SUM($F$22:$M$22),IF($AF$32<10,SUM($F$22:$N$22),IF($AF$32<11,SUM($F$22:$O$22)))))))))))-SUM($F$22:$M$22)","v":-40},{"$f":"INDEX($AO$11:$AP$25,MATCH($J$11,$AN$11:$AN$25,0),INDEX(datasheet!$A$17:$A$1224,MATCH($D52,datasheet!$C$17:$C$1224,0)))","v":355},{"$f":"INDEX($AQ$11:$AR$25,MATCH($J$11,$AN$11:$AN$25,0),INDEX(datasheet!$B$17:$B$1224,MATCH($D52,datasheet!$C$17:$C$1224,0)))","v":470},1022.4,933.59945454545448,1022.4,305]
[null,null,10,{"$f":"D52","v":"101.6 x 10"},null,null,24.277999999999999,{"$f":"$M$53*100/AV53","v":130.14235236562223},{"$f":"$N$15*IF($AF$13=$AF$9,(AW53/(3/$AO$44)),IF($AF$13=$AF$10,(AW53/(3/$AO$44)),IF($AF$13=$AF$11,(AW53*MAX($AO$47,$AO$48)/3),IF($AF$13=$AF$12,(AW53*MAX($AO$47,$AO$48)/3)))))","v":-84.852813742385692},null,933.59945454545448,null,{"$f":"(IF($AF$13=$AF$9,AO44,IF($AF$13=$AF$10,AO44,IF($AF$13=$AF$11,MAX(AO47,AO48),IF($AF$13=$AF$12,MAX(AO47,AO48))))))*$N$16","v":4.2426406871192848},{"$f":"IF($AF$13=$AF$9,$N$15*(AW53/(3/$AO$44)),IF($AF$13=$AF$10,\"n/a\",IF($AF$13=$AF$11,$N$15*(AW53*MAX($AO$47,$AO$48)/3),IF($AF$13=$AF$12,$N$15*(AW53*MAX($AO$47,$AO$48)/3)))))","v":-84.852813742385692},null,1.7034653560855382,"a",0.21,2.108760972080796,0.29834957022171871,305.03260059468522,null,0.81361651346682706,10.199999999999999,"n/a",33.098591549295783,1,false,null,null,null,null,null,null,null,null,null,null,null,null,null,null,null,null,null,null,28.8,3.26,{"$f":"IF($AF$32<2,$F$22,IF($AF$32<3,SUM($F$22:$G$22),IF($AF$32<4,SUM($F$22:$H$22),IF($AF$32<5,SUM($F$22:$I$22),IF($AF$32<6,SUM($F$22:$J$22),IF($AF$32<7,SUM($F$22:$K$22),IF($AF$32<8,SUM($F$22:$L$22),IF($AF$32<9,SUM($F$22:$M$22),IF($AF$32<10,SUM($F$22:$N$22),IF($AF$32<11,SUM($F$22:$O$22)))))))))))-SUM($F$22:$N$22)","v":-60},{"$f":"INDEX($AO$11:$AP$25,MATCH($J$11,$AN$11:$AN$25,0),INDEX(datasheet!$A$17:$A$1224,MATCH($D53,datasheet!$C$17:$C$1224,0)))","v":355},{"$f":"INDEX($AQ$11:$AR$25,MATCH($J$11,$AN$11:$AN$25,0),INDEX(datasheet!$B$17:$B$1224,MATCH($D53,datasheet!$C$17:$C$1224,0)))","v":470},1022.4,933.59945454545448,1022.4,305]
[null,null,{"$f":"IF(NOT(ISERROR(MATCH(0,OFFSET(G44,0,0,AF32),0))),\"Area of holes is too great for some sections, reduce area of holes or increase section size\",IF(NOT(ISERROR(MATCH(AH24,OFFSET(AB44,0,0,AF32),0))),\"Some sections are Class 4 slender, these are beyond scope of this spreadsheet\",IF(ISERROR(SUM(OFFSET(AB44,0,0,AF32))),\"Some sections are incorrect for this steel section type. Re-select\",\"\")))","v":""},null,null,null,null,null,null,null,null,null,null,null,null,null,null,null,null,null,null,null,null,null,null,null,null,null,null,null,null,null,"RHS/SHS(HF/CF)",null,null,"CHS"]
[null,null,"NOTES:",null,null,null,null,null,null,null,null,null,null,null,null,null,null,null,null,null,null,null,null,null,null,null,null,null,null,null,null,null,"33e","38e","42e","50e^2","70e^2","90e^2","93.9e"]
[null,null,"1. Class 4 slender sections are beyond scope of this spreadsheet;\n2. Bracing is assumed to be central on connecting members, no account is made for moment due to eccentric connection;\n3. All connections are pinned. And assumed as Category A to EN 1993-1-8;\n4. Members are designed for reversible load. Reactions are given for +ve loads only;\n5. Annotations used: Eff. - effective; Imperf. - imperfection; Red. - reduction; Fl. - flange; W. - web;\n6. Block tearing failure around bolts in tension members not considered.",null,null,null,null,null,null,null,null,null,null,null,null,null,null,null,null,null,null,null,null,null,null,null,null,null,null,null,null,1,{"$f":"33*$W44","v":26.849344944405292},{"$f":"38*$W44","v":30.917427511739429},{"$f":"42*$W44","v":34.171893565606737},{"$f":"50*$W44^2","v":33.098591549295783},{"$f":"70*$W44^2","v":46.338028169014095},{"$f":"90*$W44^2","v":59.577464788732406},{"$f":"93.9*$W44","v":76.398590614535067}]
[null,null,null,null,null,null,null,null,null,null,null,null,null,null,null,null,null,null,null,null,null,null,null,null,null,null,null,null,null,null,null,2,26.849344944405292,30.917427511739429,34.171893565606737,33.098591549295783,46.338028169014095,59.577464788732406,76.398590614535067]
[null,null,null,null,null,null,null,null,null,null,null,null,null,null,null,null,null,null,null,null,null,null,null,null,null,null,null,null,null,null,null,3,26.849344944405292,30.917427511739429,34.171893565606737,33.098591549295783,46.338028169014095,59.577464788732406,76.398590614535067]
[null,null,null,null,null,null,null,null,null,null,null,null,null,null,null,null,null,null,null,null,null,null,null,null,null,null,null,null,null,null,null,4,26.849344944405292,30.917427511739429,34.171893565606737,33.098591549295783,46.338028169014095,59.577464788732406,76.398590614535067]
[null,null,null,null,null,null,null,null,null,null,null,null,null,null,null,null,null,null,null,null,null,null,null,null,null,null,null,null,null,null,null,5,26.849344944405292,30.917427511739429,34.171893565606737,33.098591549295783,46.338028169014095,59.577464788732406,76.398590614535067,"a",0.21]
[null,null,"Spreadsheet provided by: www.YourSpreadsheets.co.uk",null,null,null,null,null,null,null,null,null,null,null,null,"calculations are based on Eurocode 1993-1-1 (2005) + UK N.A.",null,null,null,null,null,null,null,null,null,null,null,null,null,null,null,6,26.849344944405292,30.917427511739429,34.171893565606737,33.098591549295783,46.338028169014095,59.577464788732406,76.398590614535067,"a0",0.13]
[null,null,null,null,null,null,null,null,null,null,null,null,null,null,null,null,null,null,null,null,null,null,null,null,null,null,null,null,null,null,null,7,26.849344944405292,30.917427511739429,34.171893565606737,33.098591549295783,46.338028169014095,59.577464788732406,76.398590614535067,"c",0.49]
[null,null,null,null,null,null,null,null,null,null,null,null,null,null,null,null,null,null,null,null,null,null,null,null,null,null,null,null,null,null,null,8,26.849344944405292,30.917427511739429,34.171893565606737,33.098591549295783,46.338028169014095,59.577464788732406,76.398590614535067]
[null,null,null,null,null,null,null,null,null,null,null,null,null,null,null,null,null,null,null,null,null,null,null,null,null,null,null,null,null,null,null,9,26.849344944405292,30.917427511739429,34.171893565606737,33.098591549295783,46.338028169014095,59.577464788732406,76.398590614535067]
[null,null,null,null,null,null,null,null,null,null,null,null,null,null,null,null,null,null,null,null,null,null,null,null,null,null,null,null,null,null,null,10,26.849344944405292,30.917427511739429,34.171893565606737,33.098591549295783,46.338028169014095,59.577464788732406,76.398590614535067]

{"sheet":"datasheet","index":1,"n_rows":1224,"n_cols":54,"rows_kept":1224,"cut":false,"hidden":true,"merged":[[81,12,81,13],[81,14,81,15],[80,8,80,9],[80,12,80,13],[80,14,80,15],[80,16,80,17],[81,16,81,17],[81,18,81,19],[11,5,11,6],[44,22,44,24],[7,3,7,4],[10,5,10,6],[10,9,10,11],[10,12,10,14],[11,9,11,11],[11,12,11,14],[80,20,80,21],[41,3,41,4],[41,18,41,20],[44,5,44,6],[44,8,44,9],[44,10,44,13],[44,14,44,17],[44,18,44,19],[74,3,74,4],[45,18,45,19],[45,8,45,9],[45,10,45,13],[45,14,45,17],[80,18,80,19],[81,20,81,21],[80,10,80,11],[45,22,45,24],[45,5,45,6],[662,2,663,2],[664,2,664,5],[664,13,664,14],[664,15,664,16],[351,13,351,14],[351,15,351,16],[352,13,352,14],[352,15,352,16],[345,3,345,4],[353,3,353,5],[354,3,354,5],[82,3,82,5],[83,3,83,5],[84,3,84,5],[85,3,85,5],[355,3,355,5],[356,3,356,5],[658,3,658,4],[81,8,81,9],[81,10,81,11],[665,2,665,5],[665,13,665,14],[665,15,665,16],[795,3,795,5],[960,3,960,4],[964,2,965,2],[784,3,784,4],[790,2,790,5],[790,13,790,14],[790,15,790,16],[791,2,791,5],[791,13,791,14],[791,15,791,16],[792,3,792,5],[793,3,793,5],[794,3,794,5],[666,3,666,5],[667,3,667,5],[668,3,668,5],[669,3,669,5],[1082,18,1082,19],[1082,20,1082,21],[1083,2,1083,5],[1083,8,1083,9],[1083,10,1083,11],[1087,3,1087,5],[1083,14,1083,15],[1083,16,1083,17],[1083,18,1083,19],[1083,20,1083,21],[1082,2,1082,5],[1082,8,1082,9],[1082,10,1082,11],[1082,12,1082,13],[1082,14,1082,15],[1082,16,1082,17],[966,2,966,5],[966,13,966,14],[966,15,966,16],[967,2,967,5],[967,13,967,14],[967,15,967,16],[1084,3,1084,5],[1085,3,1085,5],[1086,3,1086,5],[971,3,971,5],[1076,3,1076,4],[1080,2,1081,2],[1083,12,1083,13],[968,3,968,5],[969,3,969,5],[970,3,970,5]]}
[]
[]
[]
[]
[]
[null,null,null,null,null,null,null,null,null,null,null,null,null,null,null,null,null,null,null,null,null,null,null,null,null,null,"CHART DATA"]
[null,null,"Advance® UKA - Equal"]
[null,null,null,"Table 1.1.5.1",null,null,null,null,null,null,null,null,null,null,null,null,null,null,null,null,null,null,null,null,null,null,null,null,null,null,null,null,null,null,null,null,null,null,null,null,null,null,"Constants"]
[null,null,null,null,null,null,null,null,null,null,null,null,null,null,null,null,null,null,null,null,null,null,null,null,null,null,null,null,null,null,null,null,null,null,null,null,null,null,"Constants",null,null,null,"extension",{"$f":"0.25+(bracing!AF32/bracing!AF32^2)*(0.2*bracing!AF32-0.2)","v":0.41666666666666669}]
[null,null,null,"DIMENSIONS AND PROPERTIES",null,null,null,null,null,null,null,null,null,null,null,null,null,null,null,null,null,null,null,null,null,null,null,null,null,null,null,null,null,null,null,null,null,null,"load X coordinates",{"$f":"-bracing!N14/2","v":-1.5},null,null,"text offset",{"$f":"0.4+(bracing!AF32/bracing!AF32^2)*(0.5*bracing!AF32-0.5)","v":0.81666666666666665}]
[null,null,"Section",null,"Mass","Radius",null,"Area","Distance","Second Moment",null,null,"Radius",null,null,"Elastic","Torsional","Equivalent",null,null,null,null,null,null,null,null,null,null,null,null,null,null,null,null,null,null,null,null,"load arrow length",{"$f":"bracing!N14/3","v":1},null,null,"dim offset",{"$f":"2+(bracing!AF32/bracing!AF32^2)*(1.5*bracing!AF32-1.5)","v":3.25}]
[null,null,"Designation",null,"per",null,null,"of","to","of Area",null,null,"of Gyration",null,null,"Modulus","Constant","Slenderness",null,null,null,null,null,null,null,null,null,null,null,null,null,null,null,null,null,null,null,null,"load text offset",{"$f":"AN10+(1/bracing!AF32)","v":-1.3333333333333333},null,null,"bracing label offset",{"$f":"AR11+(bracing!N14*bracing!AF32/bracing!AF32^2)*(2-1/bracing!AF32*1.5)","v":4.125}]
[null,null,"Size","Thickness","Metre","Root","Toe","Section","Centre of","Axis","Axis","Axis","Axis","Axis","Axis","Axis",null,"Coefficient",null,null,null,null,null,null,null,null,null,null,null,null,null,null,null,null,null,null,null,null,null,null,null,null,null,{"$f":"AR11+(bracing!N14*1/bracing!AF32)*(2.5-1/bracing!AF32*1.5)","v":4.375}]
[null,null,null,null,null,null,null,null,"Gravity","x-x, y-y","u-u","v-v","x-x, y-y","u-u","v-v","x-x, y-y",null,null,null,null,null,null,null,null,null,null,null,"X","Y",null,null,"X","Y",null,null,"X","Y",null,null,"X","Y",null,null,"X","Y",null,null,"X","Y",null,null,null,"X","Y"]
[null,null,"A x A","t",null,"r1","r2",null,"c",null,null,null,null,null,null,null,"J","Φa",null,null,null,null,null,null,null,null,"Columns",null,null,null,"Bracing No 1",null,null,null,"Bracing No 2",null,null,null,"Loads",null,null,null,"Dimension line 1",null,null,null,"Dimension line 2",null,null,null,null,"Dimension labels"]
["fy","fu","mm","mm","kg/m","mm","mm","cm2","cm","cm4","cm4","cm4","cm","cm","cm","cm3","cm4",null,null,null,null,null,null,null,null,null,"Left",0,0,null,1,0,{"$f":"IF(bracing!$AF$13=bracing!$AF$9,4,IF(bracing!$AF$13=bracing!$AF$10,4,IF(bracing!$AF$13=bracing!$AF$11,4,0)))","v":4},null,1,{"$f":"IF(bracing!$AF$13=bracing!$AF$9,0,IF(bracing!$AF$13=bracing!$AF$10,0,IF(bracing!$AF$13=bracing!$AF$11,0,bracing!F23)))","v":0},{"$f":"IF(bracing!$AF$13=bracing!$AF$9,0,IF(bracing!$AF$13=bracing!$AF$10,0,IF(bracing!$AF$13=bracing!$AF$11,0,bracing!F21)))","v":0},null,1,{"$f":"$AN$10","v":-1.5},{"$f":"IF(AM16<=bracing!$AF$32,INDEX(bracing!$F$25:$O$25,1,AM16),4)","v":4},null,null,{"$f":"bracing!N14+AR11","v":6.25},{"$f":"-AR9","v":-0.41666666666666669},null,null,{"$f":"AR16+AR11","v":9.5},{"$f":"AS16","v":-0.41666666666666669},null,null,{"$f":"bracing!N14&\"m\"","v":"3m"},{"$f":"bracing!N14/2","v":1.5},{"$f":"AW26+$AR$10","v":-2.4333333333333336}]
[1,2,"90 x 90 x 7",7,9.61,11,5.5,12.2,2.4500000000000002,92.6,147,38.299999999999997,2.75,3.46,1.77,14.1,2.2400000000000002,3.8,null,null,null,null,null,null,null,null,null,0,{"$f":"INDEX(bracing!F25:O25,1,bracing!AF32)","v":20},null,null,{"$f":"IF(bracing!$AF$13=bracing!$AF$9,3,IF(bracing!$AF$13=bracing!$AF$10,3,IF(bracing!$AF$13=bracing!$AF$11,3,INDEX(bracing!$F$23:$O$23,1,AE16))))","v":3},{"$f":"IF(bracing!$AF$13=bracing!$AF$9,0,IF(bracing!$AF$13=bracing!$AF$10,0,IF(bracing!$AF$13=bracing!$AF$11,INDEX(bracing!$F$23:$O$23,1,AE16),4)))","v":0},null,null,{"$f":"IF(bracing!$AF$13=bracing!$AF$9,0,IF(bracing!$AF$13=bracing!$AF$10,bracing!N14,IF(bracing!$AF$13=bracing!$AF$11,bracing!N14,bracing!N14)))","v":0},{"$f":"IF(bracing!$AF$13=bracing!$AF$9,0,IF(bracing!$AF$13=bracing!$AF$10,bracing!F21,IF(bracing!$AF$13=bracing!$AF$11,bracing!F23,0)))","v":0},null,null,{"$f":"$AN$10+$AN$11","v":-0.5},{"$f":"AO16","v":4},null,null,{"$f":"AR16","v":6.25},{"$f":"INDEX(bracing!F25:O25,1,bracing!AF32)+AR9","v":20.416666666666668},null,null,{"$f":"AV16","v":9.5},{"$f":"AS17","v":20.416666666666668}]
[1,2,"90 x 90 x 8",8,10.9,11,5.5,13.9,2.5,104,166,43.1,2.74,3.45,1.76,16.100000000000001,3.28,3.33,null,null,null,null,null,null,null,null,null,null,null,null,null,null,null,null,null,null,null,null,null,null,null,null,null,null,null,null,null,null,null,null,null,{"$f":"INDEX(bracing!F25:O25,1,bracing!AF32)&\"m\"","v":"20m"},{"$f":"AV16-AR10","v":8.6833333333333336},{"$f":"INDEX(bracing!F25:O25,1,bracing!AF32)/2","v":10}]
[1,2,"90 x 90 x 10",10,13.4,11,5.5,17.100000000000001,2.58,127,201,52.6,2.72,3.42,1.75,19.8,6.2,2.64,null,null,null,null,null,null,null,null,"Right",{"$f":"3","v":3},{"$f":"AC16","v":0},null,2,{"$f":"IF($AE19<=bracing!$AF$32,IF(bracing!$AF$13=bracing!$AF$9,0,IF(bracing!$AF$13=bracing!$AF$10,0,IF(bracing!$AF$13=bracing!$AF$11,0,0))),0)","v":0},{"$f":"IF($AE19<=bracing!$AF$32,IF(bracing!$AF$13=bracing!$AF$9,INDEX(bracing!$F$25:$O$25,1,AE19),IF(bracing!$AF$13=bracing!$AF$10,INDEX(bracing!$F$25:$O$25,1,AE19),IF(bracing!$AF$13=bracing!$AF$11,INDEX(bracing!$F$25:$O$25,1,AE19),INDEX(bracing!$F$25:$O$25,1,AE19-1)))),0)","v":8},null,2,{"$f":"IF($AI19<=bracing!$AF$32,IF(bracing!$AF$13=bracing!$AF$9,0,IF(bracing!$AF$13=bracing!$AF$10,0,IF(bracing!$AF$13=bracing!$AF$11,0,INDEX(bracing!$F$23:$O$23,1,AI19)))),0)","v":0},{"$f":"IF($AI19<=bracing!$AF$32,IF(bracing!$AF$13=bracing!$AF$9,0,IF(bracing!$AF$13=bracing!$AF$10,INDEX(bracing!$F$25:$O$25,1,AI19-1),IF(bracing!$AF$13=bracing!$AF$11,INDEX(bracing!$F$25:$O$25,1,AI19-1),INDEX(bracing!$F$25:$O$25,1,AI19)))),0)","v":0},null,2,{"$f":"$AN$10","v":-1.5},{"$f":"IF(AM19<=bracing!$AF$32,INDEX(bracing!$F$25:$O$25,1,AM19),4)","v":8},null,0,{"$f":"$AR$16-$AR$9","v":5.833333333333333},0,null,null,{"$f":"$AV$16-$AR$9","v":9.0833333333333339},0]
[1,2,"90 x 90 x 12",12,15.9,11,5.5,20.3,2.66,148,235,62,2.7,3.4,1.75,23.4,10.46,2.17,null,null,null,null,null,null,null,null,null,{"$f":"AB19","v":3},{"$f":"AC17","v":20},null,null,{"$f":"IF($AE19<=bracing!$AF$32,IF(bracing!$AF$13=bracing!$AF$9,3,IF(bracing!$AF$13=bracing!$AF$10,3,IF(bracing!$AF$13=bracing!$AF$11,3,INDEX(bracing!$F$23:$O$23,1,AE19)))),0)","v":3},{"$f":"IF($AE19<=bracing!$AF$32,IF(bracing!$AF$13=bracing!$AF$9,INDEX(bracing!$F$25:$O$25,1,AE19-1),IF(bracing!$AF$13=bracing!$AF$10,INDEX(bracing!$F$25:$O$25,1,AE19-1),IF(bracing!$AF$13=bracing!$AF$11,INDEX(bracing!$F$25:$O$25,1,AE19-1)+INDEX(bracing!$F$23:$O$23,1,AE19),INDEX(bracing!$F$25:$O$25,1,AE19)))),0)","v":4},null,null,{"$f":"IF($AI19<=bracing!$AF$32,IF(bracing!$AF$13=bracing!$AF$9,0,IF(bracing!$AF$13=bracing!$AF$10,3,IF(bracing!$AF$13=bracing!$AF$11,3,3))),0)","v":0},{"$f":"IF($AI19<=bracing!$AF$32,IF(bracing!$AF$13=bracing!$AF$9,0,IF(bracing!$AF$13=bracing!$AF$10,INDEX(bracing!$F$25:$O$25,1,AI19),IF(bracing!$AF$13=bracing!$AF$11,INDEX(bracing!$F$25:$O$25,1,AI19-1)+INDEX(bracing!$F$23:$O$23,1,AI19),INDEX(bracing!$F$25:$O$25,1,AI19-1)))),0)","v":0},null,null,{"$f":"$AN$10+$AN$11","v":-0.5},{"$f":"AO19","v":8},null,null,{"$f":"$AR$16+$AR$9","v":6.666666666666667},0,null,null,{"$f":"$AV$16+$AR$9","v":9.9166666666666661},0,null,1,{"$f":"IF(AY20<=bracing!$AF$32,INDEX(bracing!$F$21:$O$21,1,AY20)&\"m\",\"\")","v":"4m"},{"$f":"AR16-$AR$10","v":5.4333333333333336},{"$f":"IF(AY20<=bracing!$AF$32,INDEX(bracing!$F$25:$O$25,1,AY20)-INDEX(bracing!$F$21:$O$21,1,AY20)/2,0)","v":2}]
[1,2,"100 x 100 x 8",8,12.2,12,6,15.5,2.74,145,230,59.9,3.06,3.85,1.96,20,3.68,3.7]
[1,2,"100 x 100 x 10",10,15,12,6,19.2,2.82,177,280,73,3.04,3.83,1.95,24.6,6.97,2.94,null,null,null,null,null,null,null,null,"Beams per storey",null,null,null,3,{"$f":"IF($AE22<=bracing!$AF$32,IF(bracing!$AF$13=bracing!$AF$9,0,IF(bracing!$AF$13=bracing!$AF$10,0,IF(bracing!$AF$13=bracing!$AF$11,0,0))),0)","v":0},{"$f":"IF($AE22<=bracing!$AF$32,IF(bracing!$AF$13=bracing!$AF$9,INDEX(bracing!$F$25:$O$25,1,AE22),IF(bracing!$AF$13=bracing!$AF$10,INDEX(bracing!$F$25:$O$25,1,AE22),IF(bracing!$AF$13=bracing!$AF$11,INDEX(bracing!$F$25:$O$25,1,AE22),INDEX(bracing!$F$25:$O$25,1,AE22-1)))),0)","v":11},null,3,{"$f":"IF($AI22<=bracing!$AF$32,IF(bracing!$AF$13=bracing!$AF$9,0,IF(bracing!$AF$13=bracing!$AF$10,0,IF(bracing!$AF$13=bracing!$AF$11,0,INDEX(bracing!$F$23:$O$23,1,AI22)))),0)","v":0},{"$f":"IF($AI22<=bracing!$AF$32,IF(bracing!$AF$13=bracing!$AF$9,0,IF(bracing!$AF$13=bracing!$AF$10,INDEX(bracing!$F$25:$O$25,1,AI22-1),IF(bracing!$AF$13=bracing!$AF$11,INDEX(bracing!$F$25:$O$25,1,AI22-1),INDEX(bracing!$F$25:$O$25,1,AI22)))),0)","v":0},null,3,{"$f":"$AN$10","v":-1.5},{"$f":"IF(AM22<=bracing!$AF$32,INDEX(bracing!$F$25:$O$25,1,AM22),4)","v":11},null,1,{"$f":"$AR$16-$AR$9","v":5.833333333333333},{"$f":"IF(AQ22<=bracing!$AF$32,INDEX(bracing!$F$25:$O$25,1,AQ22),$AS$19)","v":4},null,null,{"$f":"AV19","v":9.0833333333333339},{"$f":"INDEX(bracing!F25:O25,1,bracing!AF32)","v":20},null,2,{"$f":"IF(AY22<=bracing!$AF$32,INDEX(bracing!$F$21:$O$21,1,AY22)&\"m\",\"\")","v":"4m"},{"$f":"BA20","v":5.4333333333333336},{"$f":"IF(AY22<=bracing!$AF$32,INDEX(bracing!$F$25:$O$25,1,AY22)-INDEX(bracing!$F$21:$O$21,1,AY22)/2,0)","v":6}]
[1,2,"100 x 100 x 12",12,17.8,12,6,22.7,2.9,207,328,85.7,3.02,3.8,1.94,29.1,11.8,2.44,null,null,null,null,null,null,null,null,1,0,{"$f":"4","v":4},null,null,{"$f":"IF($AE22<=bracing!$AF$32,IF(bracing!$AF$13=bracing!$AF$9,3,IF(bracing!$AF$13=bracing!$AF$10,3,IF(bracing!$AF$13=bracing!$AF$11,3,INDEX(bracing!$F$23:$O$23,1,AE22)))),0)","v":3},{"$f":"IF($AE22<=bracing!$AF$32,IF(bracing!$AF$13=bracing!$AF$9,INDEX(bracing!$F$25:$O$25,1,AE22-1),IF(bracing!$AF$13=bracing!$AF$10,INDEX(bracing!$F$25:$O$25,1,AE22-1),IF(bracing!$AF$13=bracing!$AF$11,INDEX(bracing!$F$25:$O$25,1,AE22-1)+INDEX(bracing!$F$23:$O$23,1,AE22),INDEX(bracing!$F$25:$O$25,1,AE22)))),0)","v":8},null,null,{"$f":"IF($AI22<=bracing!$AF$32,IF(bracing!$AF$13=bracing!$AF$9,0,IF(bracing!$AF$13=bracing!$AF$10,3,IF(bracing!$AF$13=bracing!$AF$11,3,3))),0)","v":0},{"$f":"IF($AI22<=bracing!$AF$32,IF(bracing!$AF$13=bracing!$AF$9,0,IF(bracing!$AF$13=bracing!$AF$10,INDEX(bracing!$F$25:$O$25,1,AI22),IF(bracing!$AF$13=bracing!$AF$11,INDEX(bracing!$F$25:$O$25,1,AI22-1)+INDEX(bracing!$F$23:$O$23,1,AI22),INDEX(bracing!$F$25:$O$25,1,AI22-1)))),0)","v":0},null,null,{"$f":"$AN$10+$AN$11","v":-0.5},{"$f":"AO22","v":11},null,null,{"$f":"$AR$16+$AR$9","v":6.666666666666667},{"$f":"AS22","v":4},null,null,{"$f":"AV20","v":9.9166666666666661},{"$f":"AW22","v":20}]
[1,2,"100 x 100 x 15",15,21.9,12,6,27.9,3.02,249,395,105,2.98,3.76,1.94,35.6,22.3,1.92,null,null,null,null,null,null,null,null,null,{"$f":"3","v":3},{"$f":"AC23","v":4},null,null,null,null,null,null,null,null,null,null,null,null,null,null,null,null,null,null,null,null,null,3,{"$f":"IF(AY24<=bracing!$AF$32,INDEX(bracing!$F$21:$O$21,1,AY24)&\"m\",\"\")","v":"3m"},{"$f":"BA22","v":5.4333333333333336},{"$f":"IF(AY24<=bracing!$AF$32,INDEX(bracing!$F$25:$O$25,1,AY24)-INDEX(bracing!$F$21:$O$21,1,AY24)/2,0)","v":9.5}]
[1,2,"120 x 120 x 8",8,14.7,13,6.5,18.7,3.23,256,411,107,3.69,4.67,2.38,29.1,4.4400000000000004,4.5599999999999996,null,null,null,null,null,null,null,null,null,null,null,null,4,{"$f":"IF($AE25<=bracing!$AF$32,IF(bracing!$AF$13=bracing!$AF$9,0,IF(bracing!$AF$13=bracing!$AF$10,0,IF(bracing!$AF$13=bracing!$AF$11,0,0))),0)","v":0},{"$f":"IF($AE25<=bracing!$AF$32,IF(bracing!$AF$13=bracing!$AF$9,INDEX(bracing!$F$25:$O$25,1,AE25),IF(bracing!$AF$13=bracing!$AF$10,INDEX(bracing!$F$25:$O$25,1,AE25),IF(bracing!$AF$13=bracing!$AF$11,INDEX(bracing!$F$25:$O$25,1,AE25),INDEX(bracing!$F$25:$O$25,1,AE25-1)))),0)","v":14},null,4,{"$f":"IF($AI25<=bracing!$AF$32,IF(bracing!$AF$13=bracing!$AF$9,0,IF(bracing!$AF$13=bracing!$AF$10,0,IF(bracing!$AF$13=bracing!$AF$11,0,INDEX(bracing!$F$23:$O$23,1,AI25)))),0)","v":0},{"$f":"IF($AI25<=bracing!$AF$32,IF(bracing!$AF$13=bracing!$AF$9,0,IF(bracing!$AF$13=bracing!$AF$10,INDEX(bracing!$F$25:$O$25,1,AI25-1),IF(bracing!$AF$13=bracing!$AF$11,INDEX(bracing!$F$25:$O$25,1,AI25-1),INDEX(bracing!$F$25:$O$25,1,AI25)))),0)","v":0},null,4,{"$f":"$AN$10","v":-1.5},{"$f":"IF(AM25<=bracing!$AF$32,INDEX(bracing!$F$25:$O$25,1,AM25),4)","v":14},null,2,{"$f":"$AR$16-$AR$9","v":5.833333333333333},{"$f":"IF(AQ25<=bracing!$AF$32,INDEX(bracing!$F$25:$O$25,1,AQ25),$AS$19)","v":8},null,"Dimension line 3"]
[1,2,"120 x 120 x 10",10,18.2,13,6.5,23.2,3.31,313,497,129,3.67,4.63,2.36,36,8.41,3.61,null,null,null,null,null,null,null,null,2,{"$f":"IF($AA26<=bracing!$AF$32,AB23,0)","v":0},{"$f":"IF($AA26<=bracing!$AF$32,INDEX(bracing!$F$25:$O$25,1,AA26),0)","v":8},null,null,{"$f":"IF($AE25<=bracing!$AF$32,IF(bracing!$AF$13=bracing!$AF$9,3,IF(bracing!$AF$13=bracing!$AF$10,3,IF(bracing!$AF$13=bracing!$AF$11,3,INDEX(bracing!$F$23:$O$23,1,AE25)))),0)","v":3},{"$f":"IF($AE25<=bracing!$AF$32,IF(bracing!$AF$13=bracing!$AF$9,INDEX(bracing!$F$25:$O$25,1,AE25-1),IF(bracing!$AF$13=bracing!$AF$10,INDEX(bracing!$F$25:$O$25,1,AE25-1),IF(bracing!$AF$13=bracing!$AF$11,INDEX(bracing!$F$25:$O$25,1,AE25-1)+INDEX(bracing!$F$23:$O$23,1,AE25),INDEX(bracing!$F$25:$O$25,1,AE25)))),0)","v":11},null,null,{"$f":"IF($AI25<=bracing!$AF$32,IF(bracing!$AF$13=bracing!$AF$9,0,IF(bracing!$AF$13=bracing!$AF$10,3,IF(bracing!$AF$13=bracing!$AF$11,3,3))),0)","v":0},{"$f":"IF($AI25<=bracing!$AF$32,IF(bracing!$AF$13=bracing!$AF$9,0,IF(bracing!$AF$13=bracing!$AF$10,INDEX(bracing!$F$25:$O$25,1,AI25),IF(bracing!$AF$13=bracing!$AF$11,INDEX(bracing!$F$25:$O$25,1,AI25-1)+INDEX(bracing!$F$23:$O$23,1,AI25),INDEX(bracing!$F$25:$O$25,1,AI25-1)))),0)","v":0},null,null,{"$f":"$AN$10+$AN$11","v":-0.5},{"$f":"AO25","v":14},null,null,{"$f":"$AR$16+$AR$9","v":6.666666666666667},{"$f":"AS25","v":8},null,null,{"$f":"-AR9","v":-0.41666666666666669},{"$f":"-AR11","v":-3.25},null,4,{"$f":"IF(AY26<=bracing!$AF$32,INDEX(bracing!$F$21:$O$21,1,AY26)&\"m\",\"\")","v":"3m"},{"$f":"BA24","v":5.4333333333333336},{"$f":"IF(AY26<=bracing!$AF$32,INDEX(bracing!$F$25:$O$25,1,AY26)-INDEX(bracing!$F$21:$O$21,1,AY26)/2,0)","v":12.5}]
[1,2,"120 x 120 x 12",12,21.6,13,6.5,27.5,3.4,368,584,152,3.65,4.5999999999999996,2.35,42.7,14.2,2.99,null,null,null,null,null,null,null,null,null,{"$f":"IF($AA26<=bracing!$AF$32,AB24,0)","v":3},{"$f":"AC26","v":8},null,null,null,null,null,null,null,null,null,null,null,null,null,null,null,null,null,null,{"$f":"bracing!N14+AR9","v":3.4166666666666665},{"$f":"AW26","v":-3.25}]
[1,2,"120 x 120 x 15",15,26.6,13,6.5,33.9,3.51,445,710,186,3.62,4.57,2.34,52.4,27,2.37,null,null,null,null,null,null,null,null,null,null,null,null,5,{"$f":"IF($AE28<=bracing!$AF$32,IF(bracing!$AF$13=bracing!$AF$9,0,IF(bracing!$AF$13=bracing!$AF$10,0,IF(bracing!$AF$13=bracing!$AF$11,0,0))),0)","v":0},{"$f":"IF($AE28<=bracing!$AF$32,IF(bracing!$AF$13=bracing!$AF$9,INDEX(bracing!$F$25:$O$25,1,AE28),IF(bracing!$AF$13=bracing!$AF$10,INDEX(bracing!$F$25:$O$25,1,AE28),IF(bracing!$AF$13=bracing!$AF$11,INDEX(bracing!$F$25:$O$25,1,AE28),INDEX(bracing!$F$25:$O$25,1,AE28-1)))),0)","v":17},null,5,{"$f":"IF($AI28<=bracing!$AF$32,IF(bracing!$AF$13=bracing!$AF$9,0,IF(bracing!$AF$13=bracing!$AF$10,0,IF(bracing!$AF$13=bracing!$AF$11,0,INDEX(bracing!$F$23:$O$23,1,AI28)))),0)","v":0},{"$f":"IF($AI28<=bracing!$AF$32,IF(bracing!$AF$13=bracing!$AF$9,0,IF(bracing!$AF$13=bracing!$AF$10,INDEX(bracing!$F$25:$O$25,1,AI28-1),IF(bracing!$AF$13=bracing!$AF$11,INDEX(bracing!$F$25:$O$25,1,AI28-1),INDEX(bracing!$F$25:$O$25,1,AI28)))),0)","v":0},null,5,{"$f":"$AN$10","v":-1.5},{"$f":"IF(AM28<=bracing!$AF$32,INDEX(bracing!$F$25:$O$25,1,AM28),4)","v":17},null,3,{"$f":"$AR$16-$AR$9","v":5.833333333333333},{"$f":"IF(AQ28<=bracing!$AF$32,INDEX(bracing!$F$25:$O$25,1,AQ28),$AS$19)","v":11},null,null,null,null,null,5,{"$f":"IF(AY28<=bracing!$AF$32,INDEX(bracing!$F$21:$O$21,1,AY28)&\"m\",\"\")","v":"3m"},{"$f":"BA26","v":5.4333333333333336},{"$f":"IF(AY28<=bracing!$AF$32,INDEX(bracing!$F$25:$O$25,1,AY28)-INDEX(bracing!$F$21:$O$21,1,AY28)/2,0)","v":15.5}]
[1,2,"150 x 150 x 10",10,23,16,8,29.3,4.03,624,990,258,4.62,5.82,2.97,56.9,10.8,4.51,null,null,null,null,null,null,null,null,3,{"$f":"IF($AA29<=bracing!$AF$32,AB26,0)","v":0},{"$f":"IF($AA29<=bracing!$AF$32,INDEX(bracing!$F$25:$O$25,1,AA29),0)","v":11},null,null,{"$f":"IF($AE28<=bracing!$AF$32,IF(bracing!$AF$13=bracing!$AF$9,3,IF(bracing!$AF$13=bracing!$AF$10,3,IF(bracing!$AF$13=bracing!$AF$11,3,INDEX(bracing!$F$23:$O$23,1,AE28)))),0)","v":3},{"$f":"IF($AE28<=bracing!$AF$32,IF(bracing!$AF$13=bracing!$AF$9,INDEX(bracing!$F$25:$O$25,1,AE28-1),IF(bracing!$AF$13=bracing!$AF$10,INDEX(bracing!$F$25:$O$25,1,AE28-1),IF(bracing!$AF$13=bracing!$AF$11,INDEX(bracing!$F$25:$O$25,1,AE28-1)+INDEX(bracing!$F$23:$O$23,1,AE28),INDEX(bracing!$F$25:$O$25,1,AE28)))),0)","v":14},null,null,{"$f":"IF($AI28<=bracing!$AF$32,IF(bracing!$AF$13=bracing!$AF$9,0,IF(bracing!$AF$13=bracing!$AF$10,3,IF(bracing!$AF$13=bracing!$AF$11,3,3))),0)","v":0},{"$f":"IF($AI28<=bracing!$AF$32,IF(bracing!$AF$13=bracing!$AF$9,0,IF(bracing!$AF$13=bracing!$AF$10,INDEX(bracing!$F$25:$O$25,1,AI28),IF(bracing!$AF$13=bracing!$AF$11,INDEX(bracing!$F$25:$O$25,1,AI28-1)+INDEX(bracing!$F$23:$O$23,1,AI28),INDEX(bracing!$F$25:$O$25,1,AI28-1)))),0)","v":0},null,null,{"$f":"$AN$10+$AN$11","v":-0.5},{"$f":"AO28","v":17},null,null,{"$f":"$AR$16+$AR$9","v":6.666666666666667},{"$f":"AS28","v":11},null,null,0,{"$f":"AW26-AR9","v":-3.6666666666666665}]
[1,2,"150 x 150 x 12",12,27.3,16,8,34.799999999999997,4.12,737,1170,303,4.5999999999999996,5.8,2.95,67.8,18.2,3.77,null,null,null,null,null,null,null,null,null,{"$f":"IF($AA29<=bracing!$AF$32,AB27,0)","v":3},{"$f":"AC29","v":11},null,null,null,null,null,null,null,null,null,null,null,null,null,null,null,null,null,null,0,{"$f":"AW26+AR9","v":-2.8333333333333335},null,6,{"$f":"IF(AY30<=bracing!$AF$32,INDEX(bracing!$F$21:$O$21,1,AY30)&\"m\",\"\")","v":"3m"},{"$f":"BA28","v":5.4333333333333336},{"$f":"IF(AY30<=bracing!$AF$32,INDEX(bracing!$F$25:$O$25,1,AY30)-INDEX(bracing!$F$21:$O$21,1,AY30)/2,0)","v":18.5}]
[1,2,"150 x 150 x 15",15,33.799999999999997,16,8,43,4.25,898,1430,370,4.57,5.76,2.93,83.5,34.6,3.01,null,null,null,null,null,null,null,null,null,null,null,null,6,{"$f":"IF($AE31<=bracing!$AF$32,IF(bracing!$AF$13=bracing!$AF$9,0,IF(bracing!$AF$13=bracing!$AF$10,0,IF(bracing!$AF$13=bracing!$AF$11,0,0))),0)","v":0},{"$f":"IF($AE31<=bracing!$AF$32,IF(bracing!$AF$13=bracing!$AF$9,INDEX(bracing!$F$25:$O$25,1,AE31),IF(bracing!$AF$13=bracing!$AF$10,INDEX(bracing!$F$25:$O$25,1,AE31),IF(bracing!$AF$13=bracing!$AF$11,INDEX(bracing!$F$25:$O$25,1,AE31),INDEX(bracing!$F$25:$O$25,1,AE31-1)))),0)","v":20},null,6,{"$f":"IF($AI31<=bracing!$AF$32,IF(bracing!$AF$13=bracing!$AF$9,0,IF(bracing!$AF$13=bracing!$AF$10,0,IF(bracing!$AF$13=bracing!$AF$11,0,INDEX(bracing!$F$23:$O$23,1,AI31)))),0)","v":0},{"$f":"IF($AI31<=bracing!$AF$32,IF(bracing!$AF$13=bracing!$AF$9,0,IF(bracing!$AF$13=bracing!$AF$10,INDEX(bracing!$F$25:$O$25,1,AI31-1),IF(bracing!$AF$13=bracing!$AF$11,INDEX(bracing!$F$25:$O$25,1,AI31-1),INDEX(bracing!$F$25:$O$25,1,AI31)))),0)","v":0},null,6,{"$f":"$AN$10","v":-1.5},{"$f":"IF(AM31<=bracing!$AF$32,INDEX(bracing!$F$25:$O$25,1,AM31),4)","v":20},null,4,{"$f":"$AR$16-$AR$9","v":5.833333333333333},{"$f":"IF(AQ31<=bracing!$AF$32,INDEX(bracing!$F$25:$O$25,1,AQ31),$AS$19)","v":14}]
[2,2,"150 x 150 x 18",18,40.1,16,8,51,4.37,1050,1680,440,4.54,5.73,2.92,98.8,58.6,2.48,null,null,null,null,null,null,null,null,4,{"$f":"IF($AA32<=bracing!$AF$32,AB29,0)","v":0},{"$f":"IF($AA32<=bracing!$AF$32,INDEX(bracing!$F$25:$O$25,1,AA32),0)","v":14},null,null,{"$f":"IF($AE31<=bracing!$AF$32,IF(bracing!$AF$13=bracing!$AF$9,3,IF(bracing!$AF$13=bracing!$AF$10,3,IF(bracing!$AF$13=bracing!$AF$11,3,INDEX(bracing!$F$23:$O$23,1,AE31)))),0)","v":3},{"$f":"IF($AE31<=bracing!$AF$32,IF(bracing!$AF$13=bracing!$AF$9,INDEX(bracing!$F$25:$O$25,1,AE31-1),IF(bracing!$AF$13=bracing!$AF$10,INDEX(bracing!$F$25:$O$25,1,AE31-1),IF(bracing!$AF$13=bracing!$AF$11,INDEX(bracing!$F$25:$O$25,1,AE31-1)+INDEX(bracing!$F$23:$O$23,1,AE31),INDEX(bracing!$F$25:$O$25,1,AE31)))),0)","v":17},null,null,{"$f":"IF($AI31<=bracing!$AF$32,IF(bracing!$AF$13=bracing!$AF$9,0,IF(bracing!$AF$13=bracing!$AF$10,3,IF(bracing!$AF$13=bracing!$AF$11,3,3))),0)","v":0},{"$f":"IF($AI31<=bracing!$AF$32,IF(bracing!$AF$13=bracing!$AF$9,0,IF(bracing!$AF$13=bracing!$AF$10,INDEX(bracing!$F$25:$O$25,1,AI31),IF(bracing!$AF$13=bracing!$AF$11,INDEX(bracing!$F$25:$O$25,1,AI31-1)+INDEX(bracing!$F$23:$O$23,1,AI31),INDEX(bracing!$F$25:$O$25,1,AI31-1)))),0)","v":0},null,null,{"$f":"$AN$10+$AN$11","v":-0.5},{"$f":"AO31","v":20},null,null,{"$f":"$AR$16+$AR$9","v":6.666666666666667},{"$f":"AS31","v":14},null,null,{"$f":"bracing!N14","v":3},{"$f":"AW29","v":-3.6666666666666665},null,7,{"$f":"IF(AY32<=bracing!$AF$32,INDEX(bracing!$F$21:$O$21,1,AY32)&\"m\",\"\")","v":""},{"$f":"BA30","v":5.4333333333333336},{"$f":"IF(AY32<=bracing!$AF$32,INDEX(bracing!$F$25:$O$25,1,AY32)-INDEX(bracing!$F$21:$O$21,1,AY32)/2,0)","v":0}]
[1,2,"200 x 200 x 16",16,48.5,18,9,61.8,5.52,2342,3720,960,6.16,7.76,3.94,162,56.1,3.85,null,null,null,null,null,null,null,null,null,{"$f":"IF($AA32<=bracing!$AF$32,AB30,0)","v":3},{"$f":"AC32","v":14},null,null,null,null,null,null,null,null,null,null,null,null,null,null,null,null,null,null,{"$f":"AV32","v":3},{"$f":"AW30","v":-2.8333333333333335}]
[2,2,"200 x 200 x 18",18,54.2,18,9,69.099999999999994,5.6,2600,4150,1050,6.13,7.75,3.9,181,78.900000000000006,3.43,null,null,null,null,null,null,null,null,null,null,null,null,7,{"$f":"IF($AE34<=bracing!$AF$32,IF(bracing!$AF$13=bracing!$AF$9,0,IF(bracing!$AF$13=bracing!$AF$10,0,IF(bracing!$AF$13=bracing!$AF$11,0,0))),0)","v":0},{"$f":"IF($AE34<=bracing!$AF$32,IF(bracing!$AF$13=bracing!$AF$9,INDEX(bracing!$F$25:$O$25,1,AE34),IF(bracing!$AF$13=bracing!$AF$10,INDEX(bracing!$F$25:$O$25,1,AE34),IF(bracing!$AF$13=bracing!$AF$11,INDEX(bracing!$F$25:$O$25,1,AE34),INDEX(bracing!$F$25:$O$25,1,AE34-1)))),0)","v":0},null,7,{"$f":"IF($AI34<=bracing!$AF$32,IF(bracing!$AF$13=bracing!$AF$9,0,IF(bracing!$AF$13=bracing!$AF$10,0,IF(bracing!$AF$13=bracing!$AF$11,0,INDEX(bracing!$F$23:$O$23,1,AI34)))),0)","v":0},{"$f":"IF($AI34<=bracing!$AF$32,IF(bracing!$AF$13=bracing!$AF$9,0,IF(bracing!$AF$13=bracing!$AF$10,INDEX(bracing!$F$25:$O$25,1,AI34-1),IF(bracing!$AF$13=bracing!$AF$11,INDEX(bracing!$F$25:$O$25,1,AI34-1),INDEX(bracing!$F$25:$O$25,1,AI34)))),0)","v":0},null,7,{"$f":"$AN$10","v":-1.5},{"$f":"IF(AM34<=bracing!$AF$32,INDEX(bracing!$F$25:$O$25,1,AM34),4)","v":4},null,5,{"$f":"$AR$16-$AR$9","v":5.833333333333333},{"$f":"IF(AQ34<=bracing!$AF$32,INDEX(bracing!$F$25:$O$25,1,AQ34),$AS$19)","v":17},null,null,null,null,null,8,{"$f":"IF(AY34<=bracing!$AF$32,INDEX(bracing!$F$21:$O$21,1,AY34)&\"m\",\"\")","v":""},{"$f":"BA32","v":5.4333333333333336},{"$f":"IF(AY34<=bracing!$AF$32,INDEX(bracing!$F$25:$O$25,1,AY34)-INDEX(bracing!$F$21:$O$21,1,AY34)/2,0)","v":0}]
[2,2,"200 x 200 x 20",20,59.9,18,9,76.3,5.68,2851,4530,1170,6.11,7.7,3.92,199,107,3.05,null,null,null,null,null,null,null,null,5,{"$f":"IF($AA35<=bracing!$AF$32,AB32,0)","v":0},{"$f":"IF($AA35<=bracing!$AF$32,INDEX(bracing!$F$25:$O$25,1,AA35),0)","v":17},null,null,{"$f":"IF($AE34<=bracing!$AF$32,IF(bracing!$AF$13=bracing!$AF$9,3,IF(bracing!$AF$13=bracing!$AF$10,3,IF(bracing!$AF$13=bracing!$AF$11,3,INDEX(bracing!$F$23:$O$23,1,AE34)))),0)","v":0},{"$f":"IF($AE34<=bracing!$AF$32,IF(bracing!$AF$13=bracing!$AF$9,INDEX(bracing!$F$25:$O$25,1,AE34-1),IF(bracing!$AF$13=bracing!$AF$10,INDEX(bracing!$F$25:$O$25,1,AE34-1),IF(bracing!$AF$13=bracing!$AF$11,INDEX(bracing!$F$25:$O$25,1,AE34-1)+INDEX(bracing!$F$23:$O$23,1,AE34),INDEX(bracing!$F$25:$O$25,1,AE34)))),0)","v":0},null,null,{"$f":"IF($AI34<=bracing!$AF$32,IF(bracing!$AF$13=bracing!$AF$9,0,IF(bracing!$AF$13=bracing!$AF$10,3,IF(bracing!$AF$13=bracing!$AF$11,3,3))),0)","v":0},{"$f":"IF($AI34<=bracing!$AF$32,IF(bracing!$AF$13=bracing!$AF$9,0,IF(bracing!$AF$13=bracing!$AF$10,INDEX(bracing!$F$25:$O$25,1,AI34),IF(bracing!$AF$13=bracing!$AF$11,INDEX(bracing!$F$25:$O$25,1,AI34-1)+INDEX(bracing!$F$23:$O$23,1,AI34),INDEX(bracing!$F$25:$O$25,1,AI34-1)))),0)","v":0},null,null,{"$f":"$AN$10+$AN$11","v":-0.5},{"$f":"AO34","v":4},null,null,{"$f":"$AR$16+$AR$9","v":6.666666666666667},{"$f":"AS34","v":17},null,"Reactions"]
[2,2,"200 x 200 x 24",24,71.099999999999994,18,9,90.6,5.84,3331,5280,1380,6.06,7.64,3.9,235,182,2.5,null,null,null,null,null,null,null,null,null,{"$f":"IF($AA35<=bracing!$AF$32,AB33,0)","v":3},{"$f":"AC35","v":17},null,null,null,null,null,null,null,null,null,null,null,null,null,null,null,null,null,"A",{"$f":"-AR10","v":-0.81666666666666665},{"$f":"-AR10","v":-0.81666666666666665},null,9,{"$f":"IF(AY36<=bracing!$AF$32,INDEX(bracing!$F$21:$O$21,1,AY36)&\"m\",\"\")","v":""},{"$f":"BA34","v":5.4333333333333336},{"$f":"IF(AY36<=bracing!$AF$32,INDEX(bracing!$F$25:$O$25,1,AY36)-INDEX(bracing!$F$21:$O$21,1,AY36)/2,0)","v":0}]
[null,null,null,null,null,null,null,null,null,null,null,null,null,null,null,null,null,null,null,null,null,null,null,null,null,null,null,null,null,null,8,{"$f":"IF($AE37<=bracing!$AF$32,IF(bracing!$AF$13=bracing!$AF$9,0,IF(bracing!$AF$13=bracing!$AF$10,0,IF(bracing!$AF$13=bracing!$AF$11,0,0))),0)","v":0},{"$f":"IF($AE37<=bracing!$AF$32,IF(bracing!$AF$13=bracing!$AF$9,INDEX(bracing!$F$25:$O$25,1,AE37),IF(bracing!$AF$13=bracing!$AF$10,INDEX(bracing!$F$25:$O$25,1,AE37),IF(bracing!$AF$13=bracing!$AF$11,INDEX(bracing!$F$25:$O$25,1,AE37),INDEX(bracing!$F$25:$O$25,1,AE37-1)))),0)","v":0},null,8,{"$f":"IF($AI37<=bracing!$AF$32,IF(bracing!$AF$13=bracing!$AF$9,0,IF(bracing!$AF$13=bracing!$AF$10,0,IF(bracing!$AF$13=bracing!$AF$11,0,INDEX(bracing!$F$23:$O$23,1,AI37)))),0)","v":0},{"$f":"IF($AI37<=bracing!$AF$32,IF(bracing!$AF$13=bracing!$AF$9,0,IF(bracing!$AF$13=bracing!$AF$10,INDEX(bracing!$F$25:$O$25,1,AI37-1),IF(bracing!$AF$13=bracing!$AF$11,INDEX(bracing!$F$25:$O$25,1,AI37-1),INDEX(bracing!$F$25:$O$25,1,AI37)))),0)","v":0},null,8,{"$f":"$AN$10","v":-1.5},{"$f":"IF(AM37<=bracing!$AF$32,INDEX(bracing!$F$25:$O$25,1,AM37),4)","v":4},null,6,{"$f":"$AR$16-$AR$9","v":5.833333333333333},{"$f":"IF(AQ37<=bracing!$AF$32,INDEX(bracing!$F$25:$O$25,1,AQ37),$AS$19)","v":20}]
[null,null,null,null,null,null,null,null,null,null,null,null,null,null,null,null,null,null,null,null,null,null,null,null,null,null,6,{"$f":"IF($AA38<=bracing!$AF$32,AB35,0)","v":0},{"$f":"IF($AA38<=bracing!$AF$32,INDEX(bracing!$F$25:$O$25,1,AA38),0)","v":20},null,null,{"$f":"IF($AE37<=bracing!$AF$32,IF(bracing!$AF$13=bracing!$AF$9,3,IF(bracing!$AF$13=bracing!$AF$10,3,IF(bracing!$AF$13=bracing!$AF$11,3,INDEX(bracing!$F$23:$O$23,1,AE37)))),0)","v":0},{"$f":"IF($AE37<=bracing!$AF$32,IF(bracing!$AF$13=bracing!$AF$9,INDEX(bracing!$F$25:$O$25,1,AE37-1),IF(bracing!$AF$13=bracing!$AF$10,INDEX(bracing!$F$25:$O$25,1,AE37-1),IF(bracing!$AF$13=bracing!$AF$11,INDEX(bracing!$F$25:$O$25,1,AE37-1)+INDEX(bracing!$F$23:$O$23,1,AE37),INDEX(bracing!$F$25:$O$25,1,AE37)))),0)","v":0},null,null,{"$f":"IF($AI37<=bracing!$AF$32,IF(bracing!$AF$13=bracing!$AF$9,0,IF(bracing!$AF$13=bracing!$AF$10,3,IF(bracing!$AF$13=bracing!$AF$11,3,3))),0)","v":0},{"$f":"IF($AI37<=bracing!$AF$32,IF(bracing!$AF$13=bracing!$AF$9,0,IF(bracing!$AF$13=bracing!$AF$10,INDEX(bracing!$F$25:$O$25,1,AI37),IF(bracing!$AF$13=bracing!$AF$11,INDEX(bracing!$F$25:$O$25,1,AI37-1)+INDEX(bracing!$F$23:$O$23,1,AI37),INDEX(bracing!$F$25:$O$25,1,AI37-1)))),0)","v":0},null,null,{"$f":"$AN$10+$AN$11","v":-0.5},{"$f":"AO37","v":4},null,null,{"$f":"$AR$16+$AR$9","v":6.666666666666667},{"$f":"AS37","v":20},null,"B",{"$f":"bracing!N14-AR10","v":2.1833333333333336},{"$f":"AW36","v":-0.81666666666666665},null,10,{"$f":"IF(AY38<=bracing!$AF$32,INDEX(bracing!$F$21:$O$21,1,AY38)&\"m\",\"\")","v":""},{"$f":"BA36","v":5.4333333333333336},{"$f":"IF(AY38<=bracing!$AF$32,INDEX(bracing!$F$25:$O$25,1,AY38)-INDEX(bracing!$F$21:$O$21,1,AY38)/2,0)","v":0}]
[null,null,null,null,null,null,null,null,null,null,null,null,null,null,null,null,null,null,null,null,null,null,null,null,null,null,null,{"$f":"IF($AA38<=bracing!$AF$32,AB36,0)","v":3},{"$f":"AC38","v":20}]
[null,null,null,null,null,null,null,null,null,null,null,null,null,null,null,null,null,null,null,null,null,null,null,null,null,null,null,null,null,null,9,{"$f":"IF($AE40<=bracing!$AF$32,IF(bracing!$AF$13=bracing!$AF$9,0,IF(bracing!$AF$13=bracing!$AF$10,0,IF(bracing!$AF$13=bracing!$AF$11,0,0))),0)","v":0},{"$f":"IF($AE40<=bracing!$AF$32,IF(bracing!$AF$13=bracing!$AF$9,INDEX(bracing!$F$25:$O$25,1,AE40),IF(bracing!$AF$13=bracing!$AF$10,INDEX(bracing!$F$25:$O$25,1,AE40),IF(bracing!$AF$13=bracing!$AF$11,INDEX(bracing!$F$25:$O$25,1,AE40),INDEX(bracing!$F$25:$O$25,1,AE40-1)))),0)","v":0},null,9,{"$f":"IF($AI40<=bracing!$AF$32,IF(bracing!$AF$13=bracing!$AF$9,0,IF(bracing!$AF$13=bracing!$AF$10,0,IF(bracing!$AF$13=bracing!$AF$11,0,INDEX(bracing!$F$23:$O$23,1,AI40)))),0)","v":0},{"$f":"IF($AI40<=bracing!$AF$32,IF(bracing!$AF$13=bracing!$AF$9,0,IF(bracing!$AF$13=bracing!$AF$10,INDEX(bracing!$F$25:$O$25,1,AI40-1),IF(bracing!$AF$13=bracing!$AF$11,INDEX(bracing!$F$25:$O$25,1,AI40-1),INDEX(bracing!$F$25:$O$25,1,AI40)))),0)","v":0},null,9,{"$f":"$AN$10","v":-1.5},{"$f":"IF(AM40<=bracing!$AF$32,INDEX(bracing!$F$25:$O$25,1,AM40),4)","v":4},null,7,{"$f":"$AR$16-$AR$9","v":5.833333333333333},{"$f":"IF(AQ40<=bracing!$AF$32,INDEX(bracing!$F$25:$O$25,1,AQ40),$AS$19)","v":0},null,null,null,null,null,null,"Bracing labels"]
[null,null,"Advance® UKA - Unequal",null,null,null,null,null,null,null,null,null,null,null,null,null,null,null,null,null,null,null,null,null,null,null,7,{"$f":"IF($AA41<=bracing!$AF$32,AB38,0)","v":0},{"$f":"IF($AA41<=bracing!$AF$32,INDEX(bracing!$F$25:$O$25,1,AA41),0)","v":0},null,null,{"$f":"IF($AE40<=bracing!$AF$32,IF(bracing!$AF$13=bracing!$AF$9,3,IF(bracing!$AF$13=bracing!$AF$10,3,IF(bracing!$AF$13=bracing!$AF$11,3,INDEX(bracing!$F$23:$O$23,1,AE40)))),0)","v":0},{"$f":"IF($AE40<=bracing!$AF$32,IF(bracing!$AF$13=bracing!$AF$9,INDEX(bracing!$F$25:$O$25,1,AE40-1),IF(bracing!$AF$13=bracing!$AF$10,INDEX(bracing!$F$25:$O$25,1,AE40-1),IF(bracing!$AF$13=bracing!$AF$11,INDEX(bracing!$F$25:$O$25,1,AE40-1)+INDEX(bracing!$F$23:$O$23,1,AE40),INDEX(bracing!$F$25:$O$25,1,AE40)))),0)","v":0},null,null,{"$f":"IF($AI40<=bracing!$AF$32,IF(bracing!$AF$13=bracing!$AF$9,0,IF(bracing!$AF$13=bracing!$AF$10,3,IF(bracing!$AF$13=bracing!$AF$11,3,3))),0)","v":0},{"$f":"IF($AI40<=bracing!$AF$32,IF(bracing!$AF$13=bracing!$AF$9,0,IF(bracing!$AF$13=bracing!$AF$10,INDEX(bracing!$F$25:$O$25,1,AI40),IF(bracing!$AF$13=bracing!$AF$11,INDEX(bracing!$F$25:$O$25,1,AI40-1)+INDEX(bracing!$F$23:$O$23,1,AI40),INDEX(bracing!$F$25:$O$25,1,AI40-1)))),0)","v":0},null,null,{"$f":"$AN$10+$AN$11","v":-0.5},{"$f":"AO40","v":4},null,null,{"$f":"$AR$16+$AR$9","v":6.666666666666667},{"$f":"AS40","v":0},null,null,null,null,null,1,{"$f":"IF(AY41<=bracing!$AF$32,IF(INDEX(bracing!$AB$44:$AB$53,AY41)<>bracing!$AH$22,\"(fails) \",\"\")&INDEX(bracing!$D$44:$D$53,AY41)&\" \"&bracing!$AK$18,\"\")","v":"101.6 x 10 CHS"},{"$f":"$AV$16+AR12","v":13.625},{"$f":"BB20","v":2}]
[null,null,null,"Table 1.1.6.1",null,null,null,null,null,null,null,null,null,null,null,null,null,null,null,null,null,null,null,null,null,null,null,{"$f":"IF($AA41<=bracing!$AF$32,AB39,0)","v":0},{"$f":"AC41","v":0},null,null,null,null,null,null,null,null,null,null,null,null,null,null,null,null,null,null,null,null,null,2,{"$f":"IF(AY42<=bracing!$AF$32,IF(INDEX(bracing!$AB$44:$AB$53,AY42)<>bracing!$AH$22,\"(fails) \",\"\")&INDEX(bracing!$D$44:$D$53,AY42)&\" \"&bracing!$AK$18,\"\")","v":"101.6 x 10 CHS"},{"$f":"$BA$41","v":13.625},{"$f":"BB22","v":6}]
[null,null,null,null,null,null,null,null,null,null,null,null,null,null,null,null,null,null,null,null,null,null,null,null,null,null,null,null,null,null,10,{"$f":"IF($AE43<=bracing!$AF$32,IF(bracing!$AF$13=bracing!$AF$9,0,IF(bracing!$AF$13=bracing!$AF$10,0,IF(bracing!$AF$13=bracing!$AF$11,0,0))),0)","v":0},{"$f":"IF($AE43<=bracing!$AF$32,IF(bracing!$AF$13=bracing!$AF$9,INDEX(bracing!$F$25:$O$25,1,AE43),IF(bracing!$AF$13=bracing!$AF$10,INDEX(bracing!$F$25:$O$25,1,AE43),IF(bracing!$AF$13=bracing!$AF$11,INDEX(bracing!$F$25:$O$25,1,AE43),INDEX(bracing!$F$25:$O$25,1,AE43-1)))),0)","v":0},null,10,{"$f":"IF($AI43<=bracing!$AF$32,IF(bracing!$AF$13=bracing!$AF$9,0,IF(bracing!$AF$13=bracing!$AF$10,0,IF(bracing!$AF$13=bracing!$AF$11,0,INDEX(bracing!$F$23:$O$23,1,AI43)))),0)","v":0},{"$f":"IF($AI43<=bracing!$AF$32,IF(bracing!$AF$13=bracing!$AF$9,0,IF(bracing!$AF$13=bracing!$AF$10,INDEX(bracing!$F$25:$O$25,1,AI43-1),IF(bracing!$AF$13=bracing!$AF$11,INDEX(bracing!$F$25:$O$25,1,AI43-1),INDEX(bracing!$F$25:$O$25,1,AI43)))),0)","v":0},null,10,{"$f":"$AN$10","v":-1.5},{"$f":"IF(AM43<=bracing!$AF$32,INDEX(bracing!$F$25:$O$25,1,AM43),4)","v":4},null,8,{"$f":"$AR$16-$AR$9","v":5.833333333333333},{"$f":"IF(AQ43<=bracing!$AF$32,INDEX(bracing!$F$25:$O$25,1,AQ43),$AS$19)","v":0},null,null,null,null,null,3,{"$f":"IF(AY43<=bracing!$AF$32,IF(INDEX(bracing!$AB$44:$AB$53,AY43)<>bracing!$AH$22,\"(fails) \",\"\")&INDEX(bracing!$D$44:$D$53,AY43)&\" \"&bracing!$AK$18,\"\")","v":"101.6 x 10 CHS"},13.625,{"$f":"BB24","v":9.5}]
[null,null,null,null,null,null,null,null,null,null,null,null,null,null,null,null,null,null,null,null,null,null,null,null,null,null,8,{"$f":"IF($AA44<=bracing!$AF$32,AB41,0)","v":0},{"$f":"IF($AA44<=bracing!$AF$32,INDEX(bracing!$F$25:$O$25,1,AA44),0)","v":0},null,null,{"$f":"IF($AE43<=bracing!$AF$32,IF(bracing!$AF$13=bracing!$AF$9,3,IF(bracing!$AF$13=bracing!$AF$10,3,IF(bracing!$AF$13=bracing!$AF$11,3,INDEX(bracing!$F$23:$O$23,1,AE43)))),0)","v":0},{"$f":"IF($AE43<=bracing!$AF$32,IF(bracing!$AF$13=bracing!$AF$9,INDEX(bracing!$F$25:$O$25,1,AE43-1),IF(bracing!$AF$13=bracing!$AF$10,INDEX(bracing!$F$25:$O$25,1,AE43-1),IF(bracing!$AF$13=bracing!$AF$11,INDEX(bracing!$F$25:$O$25,1,AE43-1)+INDEX(bracing!$F$23:$O$23,1,AE43),INDEX(bracing!$F$25:$O$25,1,AE43)))),0)","v":0},null,null,{"$f":"IF($AI43<=bracing!$AF$32,IF(bracing!$AF$13=bracing!$AF$9,0,IF(bracing!$AF$13=bracing!$AF$10,3,IF(bracing!$AF$13=bracing!$AF$11,3,3))),0)","v":0},{"$f":"IF($AI43<=bracing!$AF$32,IF(bracing!$AF$13=bracing!$AF$9,0,IF(bracing!$AF$13=bracing!$AF$10,INDEX(bracing!$F$25:$O$25,1,AI43),IF(bracing!$AF$13=bracing!$AF$11,INDEX(bracing!$F$25:$O$25,1,AI43-1)+INDEX(bracing!$F$23:$O$23,1,AI43),INDEX(bracing!$F$25:$O$25,1,AI43-1)))),0)","v":0},null,null,{"$f":"$AN$10+$AN$11","v":-0.5},{"$f":"AO43","v":4},null,null,{"$f":"$AR$16+$AR$9","v":6.666666666666667},{"$f":"AS43","v":0},null,null,null,null,null,4,{"$f":"IF(AY44<=bracing!$AF$32,IF(INDEX(bracing!$AB$44:$AB$53,AY44)<>bracing!$AH$22,\"(fails) \",\"\")&INDEX(bracing!$D$44:$D$53,AY44)&\" \"&bracing!$AK$18,\"\")","v":"101.6 x 10 CHS"},13.625,{"$f":"BB26","v":12.5}]
[null,null,"Section",null,"Mass","Radius",null,"Area","Dimension",null,"Second Moment",null,null,null,"Radius",null,null,null,"Elastic",null,"Angle","Torsional","Equivalent Slenderness",null,null,"Mono-",null,{"$f":"IF($AA44<=bracing!$AF$32,AB42,0)","v":0},{"$f":"AC44","v":0},null,null,null,null,null,null,null,null,null,null,null,null,null,null,null,null,null,null,null,null,null,5,{"$f":"IF(AY45<=bracing!$AF$32,IF(INDEX(bracing!$AB$44:$AB$53,AY45)<>bracing!$AH$22,\"(fails) \",\"\")&INDEX(bracing!$D$44:$D$53,AY45)&\" \"&bracing!$AK$18,\"\")","v":"101.6 x 10 CHS"},13.625,{"$f":"BB28","v":15.5}]
[null,null,"Designation",null,"per",null,null,"of",null,null,"of Area",null,null,null,"of Gyration",null,null,null,"Modulus",null,"Axis x-x","Constant","Coefficient",null,null,"symmetry",null,null,null,null,"Scale",null,null,null,"Bases",null,null,null,null,null,null,null,9,{"$f":"$AR$16-$AR$9","v":5.833333333333333},{"$f":"IF(AQ46<=bracing!$AF$32,INDEX(bracing!$F$25:$O$25,1,AQ46),$AS$19)","v":0},null,null,null,null,null,6,{"$f":"IF(AY46<=bracing!$AF$32,IF(INDEX(bracing!$AB$44:$AB$53,AY46)<>bracing!$AH$22,\"(fails) \",\"\")&INDEX(bracing!$D$44:$D$53,AY46)&\" \"&bracing!$AK$18,\"\")","v":"101.6 x 10 CHS"},13.625,{"$f":"BB30","v":18.5}]
[null,null,"Size","Thickness","Metre","Root","Toe","Section",null,null,"Axis","Axis","Axis","Axis","Axis","Axis","Axis","Axis","Axis","Axis","to",null,null,null,null,"Index",9,{"$f":"IF($AA47<=bracing!$AF$32,AB44,0)","v":0},{"$f":"IF($AA47<=bracing!$AF$32,INDEX(bracing!$F$25:$O$25,1,AA47),0)","v":0},null,null,{"$f":"$AF$53-INDEX($AF$52:$AG$52,1,$AF$54)/2","v":-6.7291666666666679},{"$f":"($AG$53-INDEX($AF$52:$AG$52,1,$AF$54)/2)*1.25","v":-4.5833333333333321},null,null,0,0,null,null,null,null,null,null,{"$f":"$AR$16+$AR$9","v":6.666666666666667},{"$f":"AS46","v":0},null,null,null,null,null,7,{"$f":"IF(AY47<=bracing!$AF$32,IF(INDEX(bracing!$AB$44:$AB$53,AY47)<>bracing!$AH$22,\"(fails) \",\"\")&INDEX(bracing!$D$44:$D$53,AY47)&\" \"&bracing!$AK$18,\"\")","v":""},13.625,{"$f":"BB32","v":0}]
[null,null,null,null,null,null,null,null,null,null,"x-x","y-y","u-u","v-v","x-x","y-y","u-u","v-v","x-x","y-y","Axis u-u",null,"Min",null,"Max",null,null,{"$f":"IF($AA47<=bracing!$AF$32,AB45,0)","v":0},{"$f":"AC47","v":0},null,null,{"$f":"$AF$53+INDEX($AF$52:$AG$52,1,$AF$54)/2","v":17.354166666666668},{"$f":"($AG$53+INDEX($AF$52:$AG$52,1,$AF$54)/2)*1.25","v":25.520833333333339},null,null,{"$f":"bracing!N14","v":3},0,null,null,null,null,null,null,null,null,null,null,null,null,null,8,{"$f":"IF(AY48<=bracing!$AF$32,IF(INDEX(bracing!$AB$44:$AB$53,AY48)<>bracing!$AH$22,\"(fails) \",\"\")&INDEX(bracing!$D$44:$D$53,AY48)&\" \"&bracing!$AK$18,\"\")","v":""},13.625,{"$f":"BB34","v":0}]
[null,null,"A x B","t",null,"r1","r2",null,"cx","cy",null,null,null,null,null,null,null,null,null,null,"tan α","J","Φa",null,"Φa","Ψa",null,null,null,null,null,null,null,null,null,null,null,null,null,null,null,null,10,{"$f":"$AR$16-$AR$9","v":5.833333333333333},{"$f":"IF(AQ49<=bracing!$AF$32,INDEX(bracing!$F$25:$O$25,1,AQ49),$AS$19)","v":0},null,null,null,null,null,9,{"$f":"IF(AY49<=bracing!$AF$32,IF(INDEX(bracing!$AB$44:$AB$53,AY49)<>bracing!$AH$22,\"(fails) \",\"\")&INDEX(bracing!$D$44:$D$53,AY49)&\" \"&bracing!$AK$18,\"\")","v":""},13.625,{"$f":"BB36","v":0}]
[null,null,"mm","mm","kg/m","mm","mm","cm2","cm","cm","cm4","cm4","cm4","cm4","cm","cm","cm","cm","cm3","cm3",null,"cm4",null,null,null,null,10,{"$f":"IF($AA50<=bracing!$AF$32,AB47,0)","v":0},{"$f":"IF($AA50<=bracing!$AF$32,INDEX(bracing!$F$25:$O$25,1,AA50),0)","v":0},null,"Max",{"$f":"MAX(AB16:AB51,AF16:AF44,AJ16:AJ55,AN16:AN49,AR16:AR50,AV16:AV33,BA16:BA58)","v":13.625},{"$f":"MAX(AC16:AC51,AG16:AG44,AK16:AK55,AO16:AO49,AS16:AS50,AW16:AW33,BB16:BB58)","v":20.416666666666668},null,"Base line",null,null,null,null,null,null,null,null,{"$f":"$AR$16+$AR$9","v":6.666666666666667},{"$f":"AS49","v":0},null,null,null,null,null,10,{"$f":"IF(AY50<=bracing!$AF$32,IF(INDEX(bracing!$AB$44:$AB$53,AY50)<>bracing!$AH$22,\"(fails) \",\"\")&INDEX(bracing!$D$44:$D$53,AY50)&\" \"&bracing!$AK$18,\"\")","v":""},13.625,{"$f":"BB38","v":0}]
[1,2,"100 x 65 x 7",7,8.77,10,5,11.2,3.23,1.51,113,37.6,128,22,3.17,1.83,3.39,1.4,16.600000000000001,7.53,0.41499999999999998,2.02,3.58,null,5,7.85,null,{"$f":"IF($AA50<=bracing!$AF$32,AB48,0)","v":0},{"$f":"AC50","v":0},null,"Min",{"$f":"MIN(AB16:AB51,AF16:AF44,AJ16:AJ55,AN16:AN49,AR16:AR50,AV16:AV33,BA16:BA58)+AN10","v":-3},{"$f":"MIN(AC16:AC51,AG16:AG44,AK16:AK55,AO16:AO49,AS16:AS50,AW16:AW33,BB16:BB58)","v":-3.6666666666666665},null,null,-0.5,0]
[1,2,"100 x 65 x 8",8,9.94,10,5,12.7,3.27,1.55,127,42.2,144,24.8,3.16,1.83,3.37,1.4,18.899999999999999,8.5399999999999991,0.41299999999999998,2.96,3.14,null,4.3499999999999996,6.86,null,null,null,null,"length",{"$f":"AF50-AF51","v":16.625},{"$f":"AG50-AG51","v":24.083333333333336},null,null,0.5,0,null,null,null,null,null,null,null,null,null,null,null,null,null,null,"Load labels"]
[1,2,"100 x 65 x 10",10,12.3,10,5,15.6,3.36,1.63,154,51,175,30.1,3.14,1.81,3.35,1.39,23.2,10.5,0.41,5.61,2.52,null,3.43,5.45,null,null,null,null,"center point",{"$f":"AF51+(AF50-AF51)/2","v":5.3125},{"$f":"AG51+(AG50-AG51)/2","v":8.3750000000000018},null,null,null,null,null,null,null,null,null,null,null,null,null,null,null,null,null,1,{"$f":"IF(AY53<=bracing!$AF$32,INDEX(bracing!$F$22:$O$22,1,AY53)&\"kN\",\"\")","v":"30kN"},{"$f":"AN12","v":-1.3333333333333333},{"$f":"IF(AY53<=bracing!$AF$32,INDEX(bracing!$F$25:$O$25,1,AY53),0)","v":4}]
[1,2,"100 x 75 x 8",8,10.6,10,5,13.5,3.1,1.87,133,64.099999999999994,162,34.6,3.14,2.1800000000000002,3.47,1.6,19.3,11.4,0.54700000000000004,3.13,3.18,null,4.08,5.24,null,null,null,null,"worst case",{"$f":"IF(AF52>AG52,1,2)","v":2},null,{"$f":"AG50-AG51","v":24.083333333333336},null,{"$f":"bracing!N14-0.5","v":2.5},0,null,null,null,null,null,null,null,null,null,null,null,null,null,2,{"$f":"IF(AY54<=bracing!$AF$32,INDEX(bracing!$F$22:$O$22,1,AY54)&\"kN\",\"\")","v":"20kN"},{"$f":"BA53","v":-1.3333333333333333},{"$f":"IF(AY54<=bracing!$AF$32,INDEX(bracing!$F$25:$O$25,1,AY54),0)","v":8}]
[1,2,"100 x 75 x 10",10,13,10,5,16.600000000000001,3.19,1.95,162,77.599999999999994,197,42.2,3.12,2.16,3.45,1.59,23.8,14,0.54400000000000004,5.95,2.54,null,3.22,4.17,null,null,null,null,null,null,{"$f":"AG53*2","v":16.750000000000004},{"$f":"AH54/2","v":12.041666666666668},null,{"$f":"AJ54+1","v":3.5},0,null,null,null,null,null,null,null,null,null,null,null,null,null,3,{"$f":"IF(AY55<=bracing!$AF$32,INDEX(bracing!$F$22:$O$22,1,AY55)&\"kN\",\"\")","v":"20kN"},-1.3333333333333333,{"$f":"IF(AY55<=bracing!$AF$32,INDEX(bracing!$F$25:$O$25,1,AY55),0)","v":11}]
[1,2,"100 x 75 x 12",12,15.4,10,5,19.7,3.27,2.0299999999999998,189,90.2,230,49.5,3.1,2.14,3.42,1.59,28.1,16.5,0.54,10,2.1,null,2.64,3.46,null,null,null,null,null,null,{"$f":"AG53+AH55","v":20.416666666666671},null,null,null,null,null,null,null,null,null,null,null,null,null,null,null,null,null,4,{"$f":"IF(AY56<=bracing!$AF$32,INDEX(bracing!$F$22:$O$22,1,AY56)&\"kN\",\"\")","v":"20kN"},-1.3333333333333333,{"$f":"IF(AY56<=bracing!$AF$32,INDEX(bracing!$F$25:$O$25,1,AY56),0)","v":14}]
[1,2,"125 x 75 x 8",8,12.2,11,5.5,15.5,4.1399999999999997,1.68,247,67.599999999999994,274,40.9,4,2.09,4.21,1.63,29.6,11.6,0.36,3.62,4,null,5.75,9.43,null,null,null,null,null,null,null,null,null,null,null,null,null,null,null,null,null,null,null,null,null,null,null,null,5,{"$f":"IF(AY57<=bracing!$AF$32,INDEX(bracing!$F$22:$O$22,1,AY57)&\"kN\",\"\")","v":"20kN"},-1.3333333333333333,{"$f":"IF(AY57<=bracing!$AF$32,INDEX(bracing!$F$25:$O$25,1,AY57),0)","v":17}]
[1,2,"125 x 75 x 10",10,15,11,5.5,19.100000000000001,4.2300000000000004,1.76,302,82.1,334,49.9,3.97,2.0699999999999998,4.18,1.61,36.5,14.3,0.35699999999999998,6.87,3.21,null,4.55,7.5,null,null,null,null,null,null,null,null,null,null,null,null,null,null,null,null,null,null,null,null,null,null,null,null,6,{"$f":"IF(AY58<=bracing!$AF$32,INDEX(bracing!$F$22:$O$22,1,AY58)&\"kN\",\"\")","v":"20kN"},-1.3333333333333333,{"$f":"IF(AY58<=bracing!$AF$32,INDEX(bracing!$F$25:$O$25,1,AY58),0)","v":20}]
[1,2,"125 x 75 x 12",12,17.8,11,5.5,22.7,4.3099999999999996,1.84,354,95.5,391,58.5,3.95,2.0499999999999998,4.1500000000000004,1.61,43.2,16.899999999999999,0.35399999999999998,11.6,2.66,null,3.73,6.23,null,null,null,null,null,null,null,null,null,null,null,null,null,null,null,null,null,null,null,null,null,null,null,null,7,{"$f":"IF(AY59<=bracing!$AF$32,INDEX(bracing!$F$22:$O$22,1,AY59)&\"kN\",\"\")","v":""},-1.3333333333333333,{"$f":"IF(AY59<=bracing!$AF$32,INDEX(bracing!$F$25:$O$25,1,AY59),0)","v":0}]
[1,2,"150 x 75 x 10",10,17,12,6,21.7,5.31,1.61,501,85.4,531,55.1,4.8099999999999996,1.99,4.95,1.6,51.7,14.5,0.26100000000000001,7.8,3.95,null,5.83,10.4,null,null,null,null,null,null,null,null,null,null,null,null,null,null,null,null,null,null,null,null,null,null,null,null,8,{"$f":"IF(AY60<=bracing!$AF$32,INDEX(bracing!$F$22:$O$22,1,AY60)&\"kN\",\"\")","v":""},-1.3333333333333333,{"$f":"IF(AY60<=bracing!$AF$32,INDEX(bracing!$F$25:$O$25,1,AY60),0)","v":0}]
[1,2,"150 x 75 x 12",12,20.2,12,6,25.7,5.4,1.69,589,99.6,623,64.7,4.78,1.97,4.92,1.59,61.3,17.100000000000001,0.25800000000000001,13.2,3.3,null,4.79,8.6,null,null,null,null,null,null,null,null,null,null,null,null,null,null,null,null,null,null,null,null,null,null,null,null,9,{"$f":"IF(AY61<=bracing!$AF$32,INDEX(bracing!$F$22:$O$22,1,AY61)&\"kN\",\"\")","v":""},-1.3333333333333333,{"$f":"IF(AY61<=bracing!$AF$32,INDEX(bracing!$F$25:$O$25,1,AY61),0)","v":0}]
[1,2,"150 x 75 x 15",15,24.8,12,6,31.7,5.52,1.81,713,119,753,78.599999999999994,4.75,1.94,4.88,1.58,75.2,21,0.253,25.1,2.62,null,3.74,6.84,null,null,null,null,null,null,null,null,null,null,null,null,null,null,null,null,null,null,null,null,null,null,null,null,10,{"$f":"IF(AY62<=bracing!$AF$32,INDEX(bracing!$F$22:$O$22,1,AY62)&\"kN\",\"\")","v":""},-1.3333333333333333,{"$f":"IF(AY62<=bracing!$AF$32,INDEX(bracing!$F$25:$O$25,1,AY62),0)","v":0}]
[1,2,"150 x 90 x 10",10,18.2,12,6,23.2,5,2.04,533,146,591,88.3,4.8,2.5099999999999998,5.05,1.95,53.3,21,0.36,8.3000000000000007,3.89,null,5.56,9.0299999999999994]
[1,2,"150 x 90 x 12",12,21.6,12,6,27.5,5.08,2.12,627,171,694,104,4.78,2.4900000000000002,5.0199999999999996,1.94,63.3,24.8,0.35799999999999998,14.1,3.24,null,4.58,7.5]
[1,2,"150 x 90 x 15",15,26.6,12,6,33.9,5.21,2.23,761,205,841,126,4.74,2.46,4.9800000000000004,1.93,77.7,30.4,0.35399999999999998,26.8,2.58,null,3.59,5.96]
[1,2,"200 x 100 x 10",10,23,15,7.5,29.2,6.93,2.0099999999999998,1219,210,1290,135,6.46,2.68,6.65,2.15,93.3,26.3,0.26300000000000001,10.66,5.26,null,7.92,13.9]
[1,2,"200 x 100 x 12",12,27.3,15,7.5,34.799999999999997,7.03,2.1,1441,247,1530,159,6.43,2.67,6.63,2.14,111,31.3,0.26200000000000001,18,4.42,null,6.57,11.5]
[1,2,"200 x 100 x 15",15,33.700000000000003,15,7.5,43,7.16,2.2200000000000002,1759,299,1860,193,6.4,2.64,6.59,2.12,137,38.4,0.26,34.299999999999997,3.54,null,5.17,9.19]
[1,2,"200 x 150 x 12",12,32,15,7.5,40.799999999999997,6.08,3.61,1653,803,2030,430,6.36,4.4400000000000004,7.04,3.25,119,70.5,0.55200000000000005,20.9,4.43,null,5.7,6.97]
[1,2,"200 x 150 x 15",15,39.6,15,7.5,50.5,6.21,3.73,2023,979,2480,526,6.33,4.4000000000000004,7,3.23,147,86.9,0.55100000000000005,39.9,3.53,null,4.5,5.55]
[2,2,"200 x 150 x 18",18,47.1,15,7.5,60,6.33,3.85,2376,1146,2920,623,6.29,4.37,6.97,3.22,174,103,0.54900000000000004,67.900000000000006,2.93,null,3.72,4.5999999999999996]
[]
[]
[]
[]
[null,null,null,"HOT FINISHED"]
[null,null,null,"RECTANGULAR HOLLOW SECTIONS"]
[]
[null,null,null,"Dimensions and properties"]
[]
[null,null,"Section",null,null,null,"Mass","Area","Ratios for",null,"Second Moment",null,"Radius of",null,"Elastic",null,"Plastic",null,"Torsional",null,"Surface"]
[null,null,"Designation",null,null,null,"per","of","Local Buckling",null,"of Area",null,"Gyration",null,"Modulus",null,"Modulus",null,"Constants",null,"Area"]
[null,null,"Size","Thickness",null,null,"Metre","Section",null,null,"Axis","Axis","Axis","Axis","Axis","Axis","Axis","Axis",null,null,"Per","Per"]
[null,null,null,null,null,null,null,null,null,null,"x-x","y-y","x-x","y-y","x-x","y-y","x-x","y-y",null,null,"Metre","Tonne"]
[null,null,"D x B","t",null,null,null,"A","cw/t (1)","cf/t (1)",null,null,null,null,null,null,null,null,"J","C"]
[null,null,"mm","mm",null,null,"kg/m","cm2",null,null,"cm4","cm4","cm","cm","cm3","cm3","cm3","cm3","cm4","cm3","m2","m2"]
[1,2,"50 x 30 x 3",null,3,"#",3.41,4.34,13.7,7,13.6,5.94,1.77,1.17,5.43,3.96,6.88,4.76,13.5,6.51,0.152,44.5]
[1,2,"50 x 30 x 3.2",null,3.2,null,3.61,4.5999999999999996,12.6,6.38,14.2,6.2,1.76,1.1599999999999999,5.68,4.13,7.25,5,14.2,6.8,0.152,42.1]
[1,2,"50 x 30 x 3.6",null,3.6,"#",4.01,5.0999999999999996,10.9,5.33,15.4,6.67,1.74,1.1399999999999999,6.16,4.45,7.94,5.46,15.4,7.31,0.151,37.799999999999997]
[1,2,"50 x 30 x 4",null,4,null,4.3899999999999997,5.59,9.5,4.5,16.5,7.08,1.72,1.1299999999999999,6.6,4.72,8.59,5.88,16.600000000000001,7.77,0.15,34.200000000000003]
[1,2,"50 x 30 x 5",null,5,null,5.28,6.73,7,3,18.7,7.89,1.67,1.08,7.49,5.26,10,6.8,19,8.67,0.14699999999999999,27.8]
[1,2,"60 x 40 x 3",null,3,"#",4.3499999999999996,5.54,17,10.3,26.5,13.9,2.1800000000000002,1.58,8.82,6.95,10.9,8.19,29.2,11.2,0.192,44.2]
[1,2,"60 x 40 x 3.2",null,3.2,null,4.62,5.88,15.8,9.5,27.8,14.6,2.1800000000000002,1.57,9.27,7.29,11.5,8.64,30.8,11.7,0.192,41.7]
[1,2,"60 x 40 x 3.6",null,3.6,"#",5.14,6.54,13.7,8.11,30.4,15.9,2.16,1.56,10.1,7.93,12.7,9.5,33.799999999999997,12.8,0.191,37.200000000000003]
[1,2,"60 x 40 x 4",null,4,null,5.64,7.19,12,7,32.799999999999997,17,2.14,1.54,10.9,8.52,13.8,10.3,36.700000000000003,13.7,0.19,33.6]
[1,2,"60 x 40 x 5",null,5,null,6.85,8.73,9,5,38.1,19.5,2.09,1.5,12.7,9.77,16.399999999999999,12.2,43,15.7,0.187,27.3]
[1,2,"60 x 40 x 6.3",null,6.3,null,8.31,10.6,6.52,3.35,43.4,21.9,2.02,1.44,14.5,11,19.2,14.2,49.5,17.600000000000001,0.184,22.1]
[1,2,"80 x 40 x 3",null,3,"#",5.29,6.74,23.7,10.3,54.2,18,2.84,1.63,13.6,9,17.100000000000001,10.4,43.8,15.3,0.23200000000000001,43.8]
[1,2,"80 x 40 x 3.2",null,3.2,null,5.62,7.16,22,9.5,57.2,18.899999999999999,2.83,1.63,14.3,9.4600000000000009,18,11,46.2,16.100000000000001,0.23200000000000001,41.3]
[1,2,"80 x 40 x 3.6",null,3.6,"#",6.27,7.98,19.2,8.11,62.8,20.6,2.81,1.61,15.7,10.3,20,12.1,50.8,17.5,0.23100000000000001,37]
[1,2,"80 x 40 x  4",null,4,null,6.9,8.7899999999999991,17,7,68.2,22.2,2.79,1.59,17.100000000000001,11.1,21.8,13.2,55.2,18.899999999999999,0.23,33.4]
[1,2,"80 x 40 x 5",null,5,null,8.42,10.7,13,5,80.3,25.7,2.74,1.55,20.100000000000001,12.9,26.1,15.7,65.099999999999994,21.9,0.22700000000000001,27]
[1,2,"80 x 40 x 6.3",null,6.3,null,10.3,13.1,9.6999999999999993,3.35,93.3,29.2,2.67,1.49,23.3,14.6,31.1,18.399999999999999,75.599999999999994,24.8,0.224,21.8]
[1,2,"80 x 40 x 7.1",null,7.1,"#",11.4,14.5,8.27,2.63,99.8,30.7,2.63,1.46,25,15.4,33.799999999999997,19.8,80.900000000000006,26.2,0.222,19.5]
[1,2,"80 x 40 x 8",null,8,null,12.5,16,7,2,106,32.1,2.58,1.42,26.5,16.100000000000001,36.5,21.2,85.8,27.4,0.219,17.5]
[1,2,"90 x 50 x 3",null,3,"#",6.24,7.94,27,13.7,84.4,33.5,3.26,2.0499999999999998,18.8,13.4,23.2,15.3,76.5,22.4,0.27200000000000002,43.5]
[1,2,"90 x 50 x 3.2",null,3.2,null,6.63,8.44,25.1,12.6,89.1,35.299999999999997,3.25,2.04,19.8,14.1,24.6,16.2,80.900000000000006,23.6,0.27200000000000002,41.1]
[1,2,"90 x 50 x 3.6",null,3.6,"#",7.4,9.42,22,10.9,98.3,38.700000000000003,3.23,2.0299999999999998,21.8,15.5,27.2,18,89.4,25.9,0.27100000000000002,36.6]
[1,2,"90 x 50 x 4",null,4,null,8.15,10.4,19.5,9.5,107,41.9,3.21,2.0099999999999998,23.8,16.8,29.8,19.600000000000001,97.5,28,0.27,33.200000000000003]
[1,2,"90 x 50 x 5",null,5,null,9.99,12.7,15,7,127,49.2,3.16,1.97,28.3,19.7,36,23.5,116,32.9,0.26700000000000002,26.7]
[1,2,"90 x 50 x 6.3",null,6.3,null,12.3,15.6,11.3,4.9400000000000004,150,57,3.1,1.91,33.299999999999997,22.8,43.2,28,138,38.1,0.26400000000000001,21.5]
[1,2,"90 x 50 x 7.1",null,7.1,"#",13.6,17.3,9.68,4.04,162,60.9,3.06,1.88,36,24.4,47.2,30.5,149,40.700000000000003,0.26200000000000001,19.3]
[1,2,"90 x 50 x 8",null,8,null,15,19.2,8.25,3.25,174,64.599999999999994,3.01,1.84,38.6,25.8,51.4,32.9,160,43.2,0.25900000000000001,17.2]
[1,2,"100 x 50 x 3",null,3,"#",6.71,8.5399999999999991,30.3,13.7,110,36.799999999999997,3.58,2.08,21.9,14.7,27.3,16.8,88.4,25,0.29199999999999998,43.5]
[1,2,"100 x 50 x 3.2",null,3.2,null,7.13,9.08,28.3,12.6,116,38.799999999999997,3.57,2.0699999999999998,23.2,15.5,28.9,17.7,93.4,26.4,0.29199999999999998,40.9]
[1,2,"100 x 50 x 3.6",null,3.6,"#",7.96,10.1,24.8,10.9,128,42.6,3.55,2.0499999999999998,25.6,17,32.1,19.600000000000001,103,29,0.29099999999999998,36.700000000000003]
[1,2,"100 x 50 x 4",null,4,null,8.7799999999999994,11.2,22,9.5,140,46.2,3.53,2.0299999999999998,27.9,18.5,35.200000000000003,21.5,113,31.4,0.28999999999999998,33.1]
[1,2,"100 x 50 x 5",null,5,null,10.8,13.7,17,7,167,54.3,3.48,1.99,33.299999999999997,21.7,42.6,25.8,135,36.9,0.28699999999999998,26.6]
[1,2,"100 x 50 x 6.3",null,6.3,null,13.3,16.899999999999999,12.9,4.9400000000000004,197,63,3.42,1.93,39.4,25.2,51.3,30.8,160,42.9,0.28399999999999997,21.4]
[1,2,"100 x 50 x 7.1",null,7.1,"#",14.7,18.7,11.1,4.04,214,67.5,3.38,1.9,42.7,27,56.3,33.5,173,46,0.28199999999999997,19.2]
[1,2,"100 x 50 x 8",null,8,null,16.3,20.8,9.5,3.25,230,71.7,3.33,1.86,46,28.7,61.4,36.299999999999997,186,48.9,0.27900000000000003,17.100000000000001]
[1,2,"100 x 50 x 8.8",null,8.8000000000000007,"#",17.600000000000001,22.5,8.36,2.68,243,74.8,3.29,1.82,48.5,29.9,65.599999999999994,38.5,197,51.1,0.27700000000000002,15.7]
[1,2,"100 x 50 x 10",null,10,"#",19.600000000000001,24.9,7,2,259,78.400000000000006,3.22,1.77,51.8,31.4,71.2,41.4,209,53.6,0.27400000000000002,14]
[1,2,"100 x 60 x 3",null,3,"#",7.18,9.14,30.3,17,124,55.7,3.68,2.4700000000000002,24.7,18.600000000000001,30.2,21.2,121,30.7,0.312,43.4]
[1,2,"100 x 60 x 3.2",null,3.2,null,7.63,9.7200000000000006,28.3,15.8,131,58.8,3.67,2.46,26.2,19.600000000000001,32,22.4,129,32.4,0.312,40.9]
[1,2,"100 x 60 x 3.6",null,3.6,"#",8.5299999999999994,10.9,24.8,13.7,145,64.8,3.65,2.44,28.9,21.6,35.6,24.9,142,35.6,0.311,36.4]
[1,2,"100 x 60 x 4",null,4,null,9.41,12,22,12,158,70.5,3.63,2.4300000000000002,31.6,23.5,39.1,27.3,156,38.700000000000003,0.31,32.9]
[1,2,"100 x 60 x 5",null,5,null,11.6,14.7,17,9,189,83.6,3.58,2.38,37.799999999999997,27.9,47.4,32.9,188,45.9,0.307,26.6]
[1,2,"100 x 60 x 6.3",null,6.3,null,14.2,18.100000000000001,12.9,6.52,225,98.1,3.52,2.33,45,32.700000000000003,57.3,39.5,224,53.8,0.30399999999999999,21.3]
[1,2,"100 x 60 x 7.1",null,7.1,"#",15.8,20.2,11.1,5.45,244,106,3.48,2.29,48.8,35.299999999999997,62.9,43.2,245,58,0.30199999999999999,19.100000000000001]
[1,2,"100 x 60 x 8",null,8,null,17.5,22.4,9.5,4.5,264,113,3.44,2.25,52.8,37.799999999999997,68.7,47.1,265,62.2,0.29899999999999999,17]
[1,2,"100 x 60 x 8.8",null,8.8000000000000007,"#",19,24.2,8.36,3.82,279,119,3.4,2.2200000000000002,55.9,39.700000000000003,73.599999999999994,50.2,282,65.400000000000006,0.29699999999999999,15.6]
[1,2,"100 x 60 x 10",null,10,"#",21.1,26.9,7,3,299,126,3.33,2.16,59.9,42.1,80.2,54.4,304,69.3,0.29399999999999998,13.9]
[1,2,"120 x 60 x 3",null,3,"#",8.1199999999999992,10.3,37,17,194,65.5,4.33,2.52,32.299999999999997,21.8,40,24.6,156,37.200000000000003,0.35199999999999998,43.3]
[1,2,"120 x 60 x 3.2",null,3.2,"#",8.64,11,34.5,15.8,205,69.2,4.32,2.5099999999999998,34.200000000000003,23.1,42.4,26.1,165,39.200000000000003,0.35199999999999998,40.799999999999997]
[1,2,"120 x 60 x 3.6",null,3.6,"#",9.66,12.3,30.3,13.7,227,76.3,4.3,2.4900000000000002,37.9,25.4,47.2,28.9,183,43.3,0.35099999999999998,36.5]
[1,2,"120 x 60 x 4",null,4,null,10.7,13.6,27,12,249,83.1,4.28,2.4700000000000002,41.5,27.7,51.9,31.7,201,47.1,0.35,32.799999999999997]
[1,2,"120 x 60 x 5",null,5,null,13.1,16.7,21,9,299,98.8,4.2300000000000004,2.4300000000000002,49.9,32.9,63.1,38.4,242,56,0.34699999999999998,26.4]
[1,2,"120 x 60 x 6.3",null,6.3,null,16.2,20.7,16,6.52,358,116,4.16,2.37,59.7,38.799999999999997,76.7,46.3,290,65.900000000000006,0.34399999999999997,21.2]
[1,2,"120 x 60 x 7.1",null,7.1,"#",18.100000000000001,23,13.9,5.45,391,126,4.12,2.34,65.2,41.9,84.4,50.8,317,71.3,0.34200000000000003,18.899999999999999]
[1,2,"120 x 60 x 8",null,8,null,20.100000000000001,25.6,12,4.5,425,135,4.08,2.2999999999999998,70.8,45,92.7,55.4,344,76.599999999999994,0.33900000000000002,16.899999999999999]
[1,2,"120 x 60 x 8.8",null,8.8000000000000007,"#",21.8,27.8,10.6,3.82,452,142,4.04,2.27,75.3,47.5,99.6,59.2,366,80.8,0.33700000000000002,15.5]
[1,2,"120 x 60 x 10",null,10,"#",24.3,30.9,9,3,488,152,3.97,2.21,81.400000000000006,50.5,109,64.400000000000006,396,86.1,0.33400000000000002,13.8]
[1,2,"120 x 60 x 12.5",null,12.5,"#",29.1,37.1,6.6,1.8,546,165,3.84,2.11,91.1,54.9,126,73.099999999999994,442,93.8,0.32800000000000001,11.3]
[1,2,"120 x 80 x 3.6",null,3.6,"#",10.8,13.7,30.3,19.2,276,147,4.4800000000000004,3.27,46,36.700000000000003,55.6,42,301,59.5,0.39100000000000001,36.200000000000003]
[1,2,"120 x 80 x 4",null,4,null,11.9,15.2,27,17,303,161,4.46,3.25,50.4,40.200000000000003,61.2,46.1,330,65,0.39,32.700000000000003]
[1,2,"120 x 80 x 5",null,5,null,14.7,18.7,21,13,365,193,4.42,3.21,60.9,48.2,74.599999999999994,56.1,401,77.900000000000006,0.38700000000000001,26.3]
[1,2,"120 x 80 x 6.3",null,6.3,null,18.2,23.2,16,9.6999999999999993,440,230,4.3600000000000003,3.15,73.3,57.6,91,68.2,487,92.9,0.38400000000000001,21.1]
[1,2,"120 x 80 x 7.1",null,7.1,"#",20.3,25.8,13.9,8.27,482,251,4.32,3.12,80.3,62.8,100,75.2,535,101,0.38200000000000001,18.8]
[1,2,"120 x 80 x 8",null,8,null,22.6,28.8,12,7,525,273,4.2699999999999996,3.08,87.5,68.099999999999994,111,82.6,587,110,0.379,16.8]
[1,2,"120 x 80 x 8.8",null,8.8000000000000007,"#",24.5,31.3,10.6,6.09,561,290,4.24,3.04,93.5,72.400000000000006,119,88.7,629,117,0.377,15.3]
[1,2,"120 x 80 x 10",null,10,null,27.4,34.9,9,5,609,313,4.18,2.99,102,78.099999999999994,131,97.3,688,126,0.374,13.7]
[1,2,"120 x 80 x 12.5",null,12.5,"#",33,42.1,6.6,3.4,692,349,4.05,2.88,115,87.4,153,113,789,141,0.36799999999999999,11.2]
[1,2,"150 x 100 x 4",null,4,"#",15.1,19.2,34.5,22,607,324,5.63,4.1100000000000003,81,64.8,97.4,73.599999999999994,660,105,0.49,32.5]
[1,2,"150 x 100 x 5",null,5,null,18.600000000000001,23.7,27,17,739,392,5.58,4.07,98.5,78.5,119,90.1,807,127,0.48699999999999999,26.2]
[1,2,"150 x 100 x 6.3",null,6.3,null,23.1,29.5,20.8,12.9,898,474,5.52,4.01,120,94.8,147,110,986,153,0.48399999999999999,20.9]
[1,2,"150 x 100 x 7.1",null,7.1,"#",25.9,32.9,18.100000000000001,11.1,990,520,5.48,3.97,132,104,163,122,1090,168,0.48199999999999998,18.7]
[1,2,"150 x 100 x 8",null,8,null,28.9,36.799999999999997,15.8,9.5,1090,569,5.44,3.94,145,114,180,135,1200,183,0.47899999999999998,16.600000000000001]
[1,2,"150 x 100 x 8.8",null,8.8000000000000007,"#",31.5,40.1,14,8.36,1170,610,5.4,3.9,156,122,195,146,1300,196,0.47699999999999998,15.2]
[1,2,"150 x 100 x 10",null,10,null,35.299999999999997,44.9,12,7,1280,665,5.34,3.85,171,133,216,161,1430,214,0.47399999999999998,13.5]
[1,2,"150 x 100 x 12.5",null,12.5,null,42.8,54.6,9,5,1490,763,5.22,3.74,198,153,256,190,1680,246,0.46800000000000003,10.9]
[1,2,"160 x 80 x 4",null,4,"#",14.4,18.399999999999999,37,17,612,207,5.77,3.35,76.5,51.7,94.7,58.3,493,88.1,0.47,32.6]
[1,2,"160 x 80 x 5",null,5,null,17.8,22.7,29,13,744,249,5.72,3.31,93,62.3,116,71.099999999999994,600,106,0.46700000000000003,26.2]
[1,2,"160 x 80 x 6.3",null,6.3,null,22.2,28.2,22.4,9.6999999999999993,903,299,5.66,3.26,113,74.8,142,86.8,730,127,0.46400000000000002,20.9]
[1,2,"160 x 80 x 7.1",null,7.1,"#",24.7,31.5,19.5,8.27,994,327,5.62,3.22,124,81.7,158,95.9,804,139,0.46200000000000002,18.7]
[1,2,"160 x 80 x 8",null,8,null,27.6,35.200000000000003,17,7,1090,356,5.57,3.18,136,89,175,106,883,151,0.45900000000000002,16.600000000000001]
[1,2,"160 x 80 x 8.8",null,8.8000000000000007,"#",30.1,38.299999999999997,15.2,6.09,1170,379,5.53,3.15,147,94.9,189,114,949,161,0.45700000000000002,15.2]
[1,2,"160 x 80 x 10",null,10,null,33.700000000000003,42.9,13,5,1280,411,5.47,3.1,161,103,209,125,1040,175,0.45400000000000001,13.5]
[1,2,"160 x 80 x 12.5",null,12.5,null,40.9,52.1,9.8000000000000007,3.4,1490,465,5.34,2.99,186,116,247,146,1200,198,0.44800000000000001,11]
[1,2,"180 x 60 x 4",null,4,"#",14.4,18.399999999999999,42,12,697,121,6.16,2.56,77.400000000000006,40.299999999999997,99.8,45.2,341,72.2,0.47,32.6]
[1,2,"180 x 60 x 5",null,5,"#",17.8,22.7,33,9,846,144,6.1,2.52,94,48.1,122,54.9,411,86.3,0.46700000000000003,26.2]
[1,2,"180 x 60 x 6.3",null,6.3,"#",22.2,28.2,25.6,6.52,1030,171,6.03,2.46,114,57,150,66.599999999999994,495,102,0.46400000000000002,20.9]
[1,2,"180 x 60 x 7.1",null,7.1,"#",24.7,31.5,22.4,5.45,1130,186,5.99,2.4300000000000002,126,61.9,166,73.3,542,111,0.46200000000000002,18.7]
[1,2,"180 x 60 x 8",null,8,"#",27.6,35.200000000000003,19.5,4.5,1240,201,5.94,2.39,138,66.900000000000006,184,80.400000000000006,590,120,0.45900000000000002,16.600000000000001]
[1,2,"180 x 60 x 8.8",null,8.8000000000000007,"#",30.1,38.299999999999997,17.5,3.82,1330,212,5.89,2.35,148,70.8,199,86.2,630,127,0.45700000000000002,15.2]
[1,2,"180 x 60 x 10",null,10,"#",33.700000000000003,42.9,15,3,1460,228,5.83,2.2999999999999998,162,75.8,220,94.4,683,137,0.45400000000000001,13.5]
[1,2,"180 x 60 x 12.5",null,12.5,"#",40.9,52.1,11.4,1.8,1680,251,5.68,2.2000000000000002,187,83.7,260,109,770,151,0.44800000000000001,11]
[1,2,"180 x 100 x 4",null,4,"#",16.899999999999999,21.6,42,22,945,379,6.61,4.1900000000000004,105,75.900000000000006,128,85.2,852,127,0.55000000000000004,32.5]
[1,2,"180 x 100 x 5",null,5,"#",21,26.7,33,17,1150,460,6.57,4.1500000000000004,128,92,157,104,1040,154,0.54700000000000004,26.1]
[1,2,"180 x 100 x 6.3",null,6.3,"#",26.1,33.299999999999997,25.6,12.9,1410,557,6.5,4.09,156,111,194,128,1280,186,0.54400000000000004,20.8]
[1,2,"180 x 100 x 7.1",null,7.1,"#",29.2,37.200000000000003,22.4,11.1,1560,613,6.47,4.0599999999999996,173,123,215,142,1410,205,0.54200000000000004,18.5]
[1,2,"180 x 100 x 8",null,8,"#",32.6,41.6,19.5,9.5,1710,671,6.42,4.0199999999999996,190,134,239,157,1560,224,0.53900000000000003,16.5]
[1,2,"180 x 100 x 8.8",null,8.8000000000000007,"#",35.6,45.4,17.5,8.36,1850,720,6.38,3.98,205,144,259,170,1690,240,0.53700000000000003,15.1]
[1,2,"180 x 100 x 10",null,10,"#",40,50.9,15,7,2040,787,6.32,3.93,226,157,288,188,1860,263,0.53400000000000003,13.4]
[1,2,"180 x 100 x 12.5",null,12.5,"#",48.7,62.1,11.4,5,2390,908,6.2,3.82,265,182,344,223,2190,303,0.52800000000000002,10.8]
[1,2,"200 x 100 x 4",null,4,"#",18.2,23.2,47,22,1220,416,7.26,4.24,122,83.2,150,92.8,983,142,0.59,32.4]
[1,2,"200 x 100 x 5",null,5,null,22.6,28.7,37,17,1500,505,7.21,4.1900000000000004,149,101,185,114,1200,172,0.58699999999999997,26]
[1,2,"200 x 100 x 6.3",null,6.3,null,28.1,35.799999999999997,28.7,12.9,1830,613,7.15,4.1399999999999997,183,123,228,140,1480,208,0.58399999999999996,20.8]
[1,2,"200 x 100 x 7.1",null,7.1,"#",31.4,40,25.2,11.1,2020,674,7.11,4.0999999999999996,202,135,254,155,1630,229,0.58199999999999996,18.5]
[1,2,"200 x 100 x 8",null,8,null,35.1,44.8,22,9.5,2230,739,7.06,4.0599999999999996,223,148,282,172,1800,251,0.57899999999999996,16.5]
[1,2,"200 x 100 x 8.8",null,8.8000000000000007,"#",38.4,48.9,19.7,8.36,2410,793,7.02,4.03,241,159,306,186,1950,270,0.57699999999999996,15.1]
[1,2,"200 x 100 x 10",null,10,null,43.1,54.9,17,7,2660,869,6.96,3.98,266,174,341,206,2160,295,0.57399999999999995,13.3]
[1,2,"200 x 100 x 12.5",null,12.5,null,52.7,67.099999999999994,13,5,3140,1000,6.84,3.87,314,201,408,245,2540,341,0.56799999999999995,10.8]
[1,2,"200 x 100 x 14.2",null,14.2,"#",58.9,75,11.1,4.04,3420,1080,6.75,3.8,342,216,450,268,2770,368,0.56299999999999994,9.57]
[1,2,"200 x 100 x 16",null,16,"# r",65.2,83,9.5,3.25,3680,1150,6.66,3.72,368,229,491,290,2980,391,0.55900000000000005,8.5500000000000007]
[1,2,"200 x 120 x 5",null,5,"#",24.1,30.7,37,21,1690,762,7.4,4.9800000000000004,168,127,205,144,1650,210,0.627,26]
[1,2,"200 x 120 x 6.3",null,6.3,null,30.1,38.299999999999997,28.7,16,2070,929,7.34,4.92,207,155,253,177,2030,255,0.624,20.8]
[1,2,"200 x 120 x 7.1",null,7.1,"#",33.700000000000003,42.9,25.2,13.9,2290,1030,7.3,4.8899999999999997,229,171,281,197,2250,282,0.622,18.5]
[1,2,"200 x 120 x 8",null,8,null,37.6,48,22,12,2530,1130,7.26,4.8499999999999996,253,188,313,218,2500,310,0.61899999999999999,16.5]
[1,2,"200 x 120 x 8.8",null,8.8000000000000007,"#",41.1,52.4,19.7,10.6,2730,1220,7.22,4.82,273,203,340,237,2700,334,0.61699999999999999,15]
[1,2,"200 x 120 x 10",null,10,null,46.3,58.9,17,9,3030,1340,7.17,4.76,303,223,379,263,3000,367,0.61399999999999999,13.3]
[1,2,"200 x 120 x 12.5",null,12.5,"#",56.6,72.099999999999994,13,6.6,3580,1560,7.04,4.66,358,260,455,314,3570,428,0.60799999999999998,10.8]
[1,2,"200 x 120 x 14.2",null,14.2,"#",63.3,80.7,11.1,5.45,3910,1690,6.96,4.58,391,282,503,346,3920,464,0.60299999999999998,9.5299999999999994]
[1,2,"200 x 120 x 16",null,16,"#",70.2,89.4,9.5,4.5,4220,1810,6.87,4.5,422,302,550,377,4250,497,0.59899999999999998,8.51]
[1,2,"200 x 150 x 5",null,5,"#",26.5,33.700000000000003,37,27,1970,1270,7.64,6.12,197,169,234,192,2390,267,0.68700000000000006,26]
[1,2,"200 x 150 x 6.3",null,6.3,"#",33,42.1,28.7,20.8,2420,1550,7.58,6.07,242,207,289,237,2950,326,0.68400000000000005,20.7]
[1,2,"200 x 150 x 7.1",null,7.1,"#",37,47.1,25.2,18.100000000000001,2690,1720,7.55,6.03,268,229,322,264,3280,361,0.68200000000000005,18.399999999999999]
[1,2,"200 x 150 x 8",null,8,null,41.4,52.8,22,15.8,2970,1890,7.5,5.99,297,253,359,294,3640,398,0.67900000000000005,16.399999999999999]
[1,2,"200 x 150 x 8.8",null,8.8000000000000007,"#",45.3,57.7,19.7,14,3220,2050,7.47,5.96,322,273,390,319,3960,430,0.67700000000000005,15]
[1,2,"200 x 150 x 10",null,10,null,51,64.900000000000006,17,12,3570,2260,7.41,5.91,357,302,436,356,4410,475,0.67400000000000004,13.2]
[1,2,"200 x 150 x 12.5",null,12.5,"#",62.5,79.599999999999994,13,9,4240,2670,7.3,5.8,424,356,525,428,5290,559,0.66800000000000004,10.7]
[1,2,"200 x 150 x 14.2",null,14.2,"#",70,89.2,11.1,7.56,4640,2920,7.22,5.72,464,389,582,473,5830,610,0.66300000000000003,9.48]
[1,2,"200 x 150 x 16",null,16,"#",77.7,99,9.5,6.38,5040,3150,7.13,5.64,504,420,638,518,6370,658,0.65900000000000003,8.5]
[1,2,"220 x 120 x 5",null,5,"#",25.7,32.700000000000003,41,21,2130,829,8.06,5.03,193,138,236,155,1880,232,0.66700000000000004,25.9]
[1,2,"220 x 120 x 6.3",null,6.3,"#",32,40.799999999999997,31.9,16,2610,1010,8,4.9800000000000004,237,168,292,191,2320,283,0.66400000000000003,20.7]
[1,2,"220 x 120 x 7.1",null,7.1,"#",35.9,45.7,28,13.9,2900,1120,7.96,4.9400000000000004,263,186,326,213,2570,312,0.66200000000000003,18.5]
[1,2,"220 x 120 x 8",null,8,"#",40.200000000000003,51.2,24.5,12,3200,1230,7.91,4.9000000000000004,291,205,362,236,2850,343,0.65900000000000003,16.399999999999999]
[1,2,"220 x 120 x 8.8",null,8.8000000000000007,"#",43.9,55.9,22,10.6,3470,1320,7.87,4.87,315,221,394,256,3090,370,0.65700000000000003,15]
[1,2,"220 x 120 x 10",null,10,"#",49.4,62.9,19,9,3840,1460,7.82,4.8099999999999996,349,243,440,285,3430,407,0.65400000000000003,13.2]
[1,2,"220 x 120 x 12.5",null,12.5,"#",60.5,77.099999999999994,14.6,6.6,4560,1710,7.69,4.71,415,285,530,341,4090,476,0.64800000000000002,10.7]
[1,2,"220 x 120 x 14.2",null,14.2,"#",67.8,86.3,12.5,5.45,5000,1850,7.61,4.63,454,309,586,376,4490,517,0.64300000000000002,9.52]
[1,2,"220 x 120 x 16",null,16,"#",75.2,95.8,10.8,4.5,5410,1990,7.52,4.55,492,331,643,410,4870,555,0.63900000000000001,8.5]
[1,2,"250 x 100 x 5",null,5,"#",26.5,33.700000000000003,47,17,2610,618,8.8000000000000007,4.28,209,124,263,138,1620,217,0.68700000000000006,26]
[1,2,"250 x 100 x 6.3",null,6.3,"#",33,42.1,36.700000000000003,12.9,3210,751,8.73,4.22,257,150,326,169,1980,264,0.68400000000000005,20.7]
[1,2,"250 x 100 x 7.1",null,7.1,"#",37,47.1,32.200000000000003,11.1,3560,827,8.69,4.1900000000000004,285,165,363,188,2200,291,0.68200000000000005,18.399999999999999]
[1,2,"250 x 100 x 8",null,8,"#",41.4,52.8,28.3,9.5,3940,909,8.64,4.1500000000000004,315,182,404,209,2430,319,0.67900000000000005,16.399999999999999]
[1,2,"250 x 100 x 8.8",null,8.8000000000000007,"#",45.3,57.7,25.4,8.36,4270,977,8.6,4.12,341,195,439,226,2630,343,0.67700000000000005,15]
[1,2,"250 x 100 x 10",null,10,"#",51,64.900000000000006,22,7,4730,1070,8.5399999999999991,4.0599999999999996,379,214,491,251,2910,376,0.67400000000000004,13.2]
[1,2,"250 x 100 x 12.5",null,12.5,"#",62.5,79.599999999999994,17,5,5620,1250,8.41,3.96,450,249,592,299,3440,438,0.66800000000000004,10.7]
[1,2,"250 x 100 x 14.2",null,14.2,"#",70,89.2,14.6,4.04,6170,1340,8.31,3.88,493,269,655,329,3750,473,0.66300000000000003,9.48]
[1,2,"250 x 100 x 16",null,16,"#",77.7,99,12.6,3.25,6690,1430,8.2200000000000006,3.8,535,287,719,358,4050,505,0.65900000000000003,8.5]
[1,2,"250 x 150 x 5",null,5,"#",30.4,38.700000000000003,47,27,3360,1530,9.31,6.28,269,204,324,228,3280,337,0.78700000000000003,25.9]
[1,2,"250 x 150 x 6.3",null,6.3,null,38,48.4,36.700000000000003,20.8,4140,1870,9.25,6.22,331,250,402,283,4050,413,0.78400000000000003,20.6]
[1,2,"250 x 150 x 7.1",null,7.1,"#",42.6,54.2,32.200000000000003,18.100000000000001,4610,2080,9.2200000000000006,6.19,368,277,449,315,4520,457,0.78200000000000003,18.399999999999999]
[1,2,"250 x 150 x 8",null,8,null,47.7,60.8,28.3,15.8,5110,2300,9.17,6.15,409,306,501,350,5020,506,0.77900000000000003,16.399999999999999]
[1,2,"250 x 150 x 8.8",null,8.8000000000000007,"#",52.2,66.5,25.4,14,5550,2490,9.1300000000000008,6.12,444,331,545,381,5460,547,0.77700000000000002,14.9]
[1,2,"250 x 150 x 10",null,10,null,58.8,74.900000000000006,22,12,6170,2760,9.08,6.06,494,367,611,426,6090,605,0.77400000000000002,13.2]
[1,2,"250 x 150 x 12.5",null,12.5,null,72.3,92.1,17,9,7390,3270,8.9600000000000009,5.96,591,435,740,514,7330,717,0.76800000000000002,10.6]
[1,2,"250 x 150 x 14.2",null,14.2,"#",81.099999999999994,103,14.6,7.56,8140,3580,8.8699999999999992,5.88,651,477,823,570,8100,784,0.76300000000000001,9.3800000000000008]
[1,2,"250 x 150 x 16",null,16,null,90.3,115,12.6,6.38,8880,3870,8.7899999999999991,5.8,710,516,906,625,8870,849,0.75900000000000001,8.42]
[1,2,"260 x 140 x 5",null,5,"#",30.4,38.700000000000003,49,25,3530,1350,9.5500000000000007,5.91,272,193,331,216,3080,326,0.78700000000000003,25.9]
[1,2,"260 x 140 x 6.3",null,6.3,"#",38,48.4,38.299999999999997,19.2,4360,1660,9.49,5.86,335,237,411,267,3800,399,0.78400000000000003,20.6]
[1,2,"260 x 140 x 7.1",null,7.1,"#",42.6,54.2,33.6,16.7,4840,1840,9.4499999999999993,5.82,372,263,459,298,4230,442,0.78200000000000003,18.399999999999999]
[1,2,"260 x 140 x 8",null,8,"#",47.7,60.8,29.5,14.5,5370,2030,9.4,5.78,413,290,511,331,4700,488,0.77900000000000003,16.399999999999999]
[1,2,"260 x 140 x 8.8",null,8.8000000000000007,"#",52.2,66.5,26.5,12.9,5830,2200,9.3699999999999992,5.75,449,314,557,360,5110,527,0.77700000000000002,14.9]
[1,2,"260 x 140 x 10",null,10,"#",58.8,74.900000000000006,23,11,6490,2430,9.31,5.7,499,347,624,402,5700,584,0.77400000000000002,13.2]
[1,2,"260 x 140 x 12.5",null,12.5,"#",72.3,92.1,17.8,8.1999999999999993,7770,2880,9.18,5.59,597,411,756,485,6840,690,0.76800000000000002,10.6]
[1,2,"260 x 140 x 14.2",null,14.2,"#",81.099999999999994,103,15.3,6.86,8560,3140,9.1,5.52,658,449,840,537,7560,754,0.76300000000000001,9.3800000000000008]
[1,2,"260 x 140 x 16",null,16,"#",90.3,115,13.3,5.75,9340,3400,9.01,5.44,718,486,925,588,8260,815,0.75900000000000001,8.42]
[1,2,"300 x 100 x 5",null,5,"#",30.4,38.700000000000003,57,17,4150,731,10.3,4.34,276,146,354,161,2040,262,0.78700000000000003,25.9]
[1,2,"300 x 100 x 6.3",null,6.3,"#",38,48.4,44.6,12.9,5110,890,10.3,4.29,341,178,439,199,2500,319,0.78400000000000003,20.6]
[1,2,"300 x 100 x 7.1",null,7.1,"#",42.6,54.2,39.299999999999997,11.1,5680,981,10.199999999999999,4.25,379,196,490,221,2780,352,0.78200000000000003,18.399999999999999]
[1,2,"300 x 100 x 8",null,8,null,47.7,60.8,34.5,9.5,6310,1080,10.199999999999999,4.21,420,216,546,245,3070,387,0.77900000000000003,16.399999999999999]
[1,2,"300 x 100 x 8.8",null,8.8000000000000007,"#",52.2,66.5,31.1,8.36,6840,1160,10.1,4.18,456,232,594,266,3320,416,0.77700000000000002,14.9]
[1,2,"300 x 100 x 10",null,10,null,58.8,74.900000000000006,27,7,7610,1280,10.1,4.13,508,255,666,296,3680,458,0.77400000000000002,13.2]
[1,2,"300 x 100 x 12.5",null,12.5,"#",72.3,92.1,21,5,9100,1490,9.94,4.0199999999999996,607,297,806,354,4350,534,0.76800000000000002,10.6]
[1,2,"300 x 100 x 14.2",null,14.2,"#",81.099999999999994,103,18.100000000000001,4.04,10000,1610,9.85,3.94,669,321,896,390,4760,578,0.76300000000000001,9.3800000000000008]
[1,2,"300 x 100 x 16",null,16,"#",90.3,115,15.8,3.25,10900,1720,9.75,3.87,729,344,986,425,5140,619,0.75900000000000001,8.42]
[1,2,"300 x 150 x 8",null,8,"# rr",54,68.8,34.5,15.8,8010,2700,10.8,6.27,534,360,663,407,6450,613,0.879,16.3]
[1,2,"300 x 150 x 8.8",null,8.8000000000000007,"# rr",59.1,75.3,31.1,14,8710,2930,10.8,6.23,580,390,723,443,7020,664,0.877,14.8]
[1,2,"300 x 150 x 10",null,10,"# rr",66.7,84.9,27,12,9720,3250,10.7,6.18,648,433,811,496,7840,736,0.874,13.1]
[1,2,"300 x 150 x 12.5",null,12.5,"# rr",82.1,105,21,9,11700,3860,10.6,6.07,779,514,986,600,9450,874,0.86799999999999999,10.6]
[1,2,"300 x 150 x 14.2",null,14.2,"# rr",92.3,118,18.100000000000001,7.56,12900,4230,10.5,6,862,564,1100,666,10500,959,0.86299999999999999,9.32]
[1,2,"300 x 150 x 16",null,16,"# rr",103,131,15.8,6.38,14200,4600,10.4,5.92,944,613,1210,732,11500,1040,0.85899999999999999,8.35]
[1,2,"300 x 200 x 5",null,5,"#",38.299999999999997,48.7,57,37,6320,3400,11.4,8.35,421,340,501,380,6820,552,0.98699999999999999,25.8]
[1,2,"300 x 200 x 6.3",null,6.3,null,47.9,61,44.6,28.7,7830,4190,11.3,8.2899999999999991,522,419,624,472,8480,681,0.98399999999999999,20.6]
[1,2,"300 x 200 x 7.1",null,7.1,"#",53.7,68.400000000000006,39.299999999999997,25.2,8730,4670,11.3,8.26,582,467,698,528,9470,757,0.98199999999999998,18.3]
[1,2,"300 x 200 x 8",null,8,null,60.3,76.8,34.5,22,9720,5180,11.3,8.2200000000000006,648,518,779,589,10600,840,0.97899999999999998,16.3]
[1,2,"300 x 200 x 8.8",null,8.8000000000000007,"#",66,84.1,31.1,19.7,10600,5630,11.2,8.18,705,563,851,643,11500,912,0.97699999999999998,14.9]
[1,2,"300 x 200 x 10",null,10,null,74.5,94.9,27,17,11800,6280,11.2,8.1300000000000008,788,628,956,721,12900,1020,0.97399999999999998,13.1]
[1,2,"300 x 200 x 12.5",null,12.5,null,91.9,117,21,13,14300,7540,11,8.02,952,754,1170,877,15700,1220,0.96799999999999997,10.6]
[1,2,"300 x 200 x 14.2",null,14.2,"#",103,132,18.100000000000001,11.1,15800,8330,11,7.95,1060,833,1300,978,17500,1340,0.96299999999999997,9.31]
[1,2,"300 x 200 x 16",null,16,null,115,147,15.8,9.5,17400,9110,10.9,7.87,1160,911,1440,1080,19300,1470,0.95899999999999996,8.31]
[1,2,"300 x 250 x 5",null,5,"#",42.2,53.7,57,47,7410,5610,11.7,10.199999999999999,494,449,575,508,9770,697,1.0900000000000001,25.8]
[1,2,"300 x 250 x 6.3",null,6.3,"#",52.8,67.3,44.6,36.700000000000003,9190,6950,11.7,10.199999999999999,613,556,716,633,12200,862,1.08,20.399999999999999]
[1,2,"300 x 250 x 7.1",null,7.1,"#",59.3,75.5,39.299999999999997,32.200000000000003,10300,7750,11.6,10.1,683,620,802,708,13600,960,1.08,18.3]
[1,2,"300 x 250 x 8",null,8,null,66.5,84.8,34.5,28.3,11400,8630,11.6,10.1,761,690,896,791,15200,1070,1.08,16.2]
[1,2,"300 x 250 x 8.8",null,8.8000000000000007,"#",72.900000000000006,92.9,31.1,25.4,12400,9390,11.6,10.1,829,751,979,864,16600,1160,1.08,14.8]
[1,2,"300 x 250 x 10",null,10,"#",82.4,105,27,22,13900,10500,11.5,10,928,840,1100,971,18600,1300,1.07,12.9]
[1,2,"300 x 250 x 12.5",null,12.5,"#",102,130,21,17,16900,12700,11.4,9.89,1120,1010,1350,1190,22700,1560,1.07,10.5]
[1,2,"300 x 250 x 14.2",null,14.2,"#",115,146,18.100000000000001,14.6,18700,14100,11.3,9.82,1250,1130,1510,1330,25400,1730,1.06,9.25]
[1,2,"300 x 250 x 16",null,16,"#",128,163,15.8,12.6,20600,15500,11.2,9.74,1380,1240,1670,1470,28100,1900,1.06,8.2799999999999994]
[1,2,"340 x 100 x 10",null,10,null,65.099999999999994,82.9,31,7,10600,1440,11.3,4.16,623,288,823,332,4300,523,0.85399999999999998,13.2]
[1,2,"350 x 150 x 5",null,5,"#",38.299999999999997,48.7,67,27,7660,2050,12.5,6.49,437,274,543,301,5160,477,0.98699999999999999,25.8]
[1,2,"350 x 150 x 6.3",null,6.3,"#",47.9,61,52.6,20.8,9480,2530,12.5,6.43,542,337,676,373,6390,586,0.98399999999999999,20.6]
[1,2,"350 x 150 x 7.1",null,7.1,"#",53.7,68.400000000000006,46.3,18.100000000000001,10600,2800,12.4,6.4,604,374,756,416,7120,651,0.98199999999999998,18.3]
[1,2,"350 x 150 x 8",null,8,"#",60.3,76.8,40.799999999999997,15.8,11800,3110,12.4,6.36,673,414,844,464,7930,721,0.97899999999999998,16.3]
[1,2,"350 x 150 x 8.8",null,8.8000000000000007,"#",66,84.1,36.799999999999997,14,12800,3360,12.3,6.33,732,449,922,506,8620,781,0.97699999999999998,14.9]
[1,2,"350 x 150 x 10",null,10,"#",74.5,94.9,32,12,14300,3740,12.3,6.27,818,498,1040,566,9630,867,0.97399999999999998,13.1]
[1,2,"350 x 150 x 12.5",null,12.5,"#",91.9,117,25,9,17300,4450,12.2,6.17,988,593,1260,686,11600,1030,0.96799999999999997,10.6]
[1,2,"350 x 150 x 14.2",null,14.2,"#",103,132,21.6,7.56,19200,4890,12.1,6.09,1100,652,1410,763,12900,1130,0.96299999999999997,9.31]
[1,2,"350 x 150 x 16",null,16,"#",115,147,18.899999999999999,6.38,21100,5320,12,6.01,1210,709,1560,840,14100,1230,0.95899999999999996,8.31]
[1,2,"350 x 250 x 6.3",null,6.3,"#",57.8,73.599999999999994,52.6,36.700000000000003,13200,7890,13.4,10.4,754,631,892,709,15200,1010,1.18,20.399999999999999]
[1,2,"350 x 250 x 7.1",null,7.1,"#",64.900000000000006,82.6,46.3,32.200000000000003,14700,8800,13.4,10.3,843,704,999,794,17000,1130,1.18,18.2]
[1,2,"350 x 250 x 8",null,8,"#",72.8,92.8,40.799999999999997,28.3,16400,9800,13.3,10.3,940,784,1120,888,19000,1250,1.18,16.2]
[1,2,"350 x 250 x 8.8",null,8.8000000000000007,"#",79.8,102,36.799999999999997,25.4,17900,10700,13.3,10.199999999999999,1030,853,1220,970,20800,1370,1.18,14.8]
[1,2,"350 x 250 x 10",null,10,"#",90.2,115,32,22,20100,11900,13.2,10.199999999999999,1150,955,1380,1090,23400,1530,1.17,13]
[1,2,"350 x 250 x 12.5",null,12.5,"#",112,142,25,17,24400,14400,13.1,10.1,1400,1160,1690,1330,28500,1840,1.17,10.5]
[1,2,"350 x 250 x 14.2",null,14.2,"#",126,160,21.6,14.6,27200,16000,13,10,1550,1280,1890,1490,31900,2040,1.1599999999999999,9.2200000000000006]
[1,2,"350 x 250 x 16",null,16,"#",141,179,18.899999999999999,12.6,30000,17700,12.9,9.93,1720,1410,2100,1660,35300,2250,1.1599999999999999,8.26]
[1,2,"400 x 150 x 6.3",null,6.3,"#",52.8,67.3,60.5,20.8,13300,2850,14,6.51,663,380,836,418,7600,673,1.08,20.399999999999999]
[1,2,"400 x 150 x 7.1",null,7.1,"#",59.3,75.5,53.3,18.100000000000001,14800,3170,14,6.47,740,422,936,467,8470,748,1.08,18.3]
[1,2,"400 x 150 x 8",null,8,"#",66.5,84.8,47,15.8,16500,3510,13.9,6.43,824,468,1050,521,9420,828,1.08,16.2]
[1,2,"400 x 150 x 8.8",null,8.8000000000000007,"#",72.900000000000006,92.9,42.5,14,18000,3800,13.9,6.4,898,507,1140,568,10300,898,1.08,14.8]
[1,2,"400 x 150 x 10",null,10,"#",82.4,105,37,12,20100,4230,13.8,6.35,1010,564,1290,636,11500,998,1.07,12.9]
[1,2,"400 x 150 x 12.5",null,12.5,"#",102,130,29,9,24400,5040,13.7,6.24,1220,672,1570,772,13800,1190,1.07,10.5]
[1,2,"400 x 150 x 14.2",null,14.2,"#",115,146,25.2,7.56,27100,5550,13.6,6.16,1360,740,1760,859,15300,1310,1.06,9.25]
[1,2,"400 x 150 x 16",null,16,null,128,163,22,6.38,29800,6040,13.5,6.09,1490,805,1950,947,16800,1430,1.06,8.2799999999999994]
[1,2,"400 x 200 x 6.3",null,6.3,"#",57.8,73.599999999999994,60.5,28.7,15700,5380,14.6,8.5500000000000007,785,538,960,594,12600,917,1.18,20.399999999999999]
[1,2,"400 x 200 x 7.1",null,7.1,"#",64.900000000000006,82.6,53.3,25.2,17500,5990,14.6,8.51,877,599,1080,665,14100,1020,1.18,18.2]
[1,2,"400 x 200 x 8",null,8,null,72.8,92.8,47,22,19600,6660,14.5,8.4700000000000006,978,666,1200,743,15700,1140,1.18,16.2]
[1,2,"400 x 200 x 8.8",null,8.8000000000000007,"#",79.8,102,42.5,19.7,21300,7240,14.5,8.44,1070,724,1320,811,17200,1230,1.18,14.8]
[1,2,"400 x 200 x 10",null,10,null,90.2,115,37,17,23900,8080,14.4,8.39,1200,808,1480,911,19300,1380,1.17,13]
[1,2,"400 x 200 x 12.5",null,12.5,null,112,142,29,13,29100,9740,14.3,8.2799999999999994,1450,974,1810,1110,23400,1660,1.17,10.5]
[1,2,"400 x 200 x 14.2",null,14.2,"#",126,160,25.2,11.1,32400,10800,14.2,8.2100000000000009,1620,1080,2030,1240,26100,1830,1.1599999999999999,9.2200000000000006]
[1,2,"400 x 200 x 16",null,16,null,141,179,22,9.5,35700,11800,14.1,8.1300000000000008,1790,1180,2260,1370,28900,2010,1.1599999999999999,8.26]
[1,2,"400 x 300 x 8",null,8,"#",85.4,109,47,34.5,25700,16500,15.4,12.3,1290,1100,1520,1250,31000,1750,1.38,16.100000000000001]
[1,2,"400 x 300 x 8.8",null,8.8000000000000007,"#",93.6,119,42.5,31.1,28100,18000,15.3,12.3,1400,1200,1660,1360,33900,1910,1.38,14.8]
[1,2,"400 x 300 x 10",null,10,"#",106,135,37,27,31500,20200,15.3,12.2,1580,1350,1870,1540,38200,2140,1.37,12.9]
[1,2,"400 x 300 x 12.5",null,12.5,"#",131,167,29,21,38500,24600,15.2,12.1,1920,1640,2300,1880,46800,2590,1.37,10.4]
[1,2,"400 x 300 x 14.2",null,14.2,"#",148,189,25.2,18.100000000000001,43000,27400,15.1,12.1,2150,1830,2580,2110,52500,2890,1.36,9.19]
[1,2,"400 x 300 x 16",null,16,"#",166,211,22,15.8,47500,30300,15,12,2380,2020,2870,2350,58300,3180,1.36,8.2100000000000009]
[1,2,"450 x 250 x 8",null,8,null,85.4,109,53.3,28.3,30100,12100,16.600000000000001,10.6,1340,971,1620,1080,27100,1630,1.38,16.100000000000001]
[1,2,"450 x 250 x 8.8",null,8.8000000000000007,"#",93.6,119,48.1,25.4,32800,13200,16.600000000000001,10.5,1460,1060,1770,1180,29600,1770,1.38,14.8]
[1,2,"450 x 250 x 10",null,10,null,106,135,42,22,36900,14800,16.5,10.5,1640,1190,2000,1330,33300,1990,1.37,12.9]
[1,2,"450 x 250 x 12.5",null,12.5,null,131,167,33,17,45000,18000,16.399999999999999,10.4,2000,1440,2460,1630,40700,2410,1.37,10.4]
[1,2,"450 x 250 x 14.2",null,14.2,"#",148,189,28.7,14.6,50300,20000,16.3,10.3,2240,1600,2760,1830,45600,2680,1.36,9.19]
[1,2,"450 x 250 x 16",null,16,null,166,211,25.1,12.6,55700,22000,16.2,10.199999999999999,2480,1760,3070,2030,50500,2950,1.36,8.2100000000000009]
[1,2,"500 x 200 x 8",null,8,"#",85.4,109,59.5,22,34000,8140,17.7,8.65,1360,814,1710,896,21100,1430,1.38,16.100000000000001]
[1,2,"500 x 200 x 8.8",null,8.8000000000000007,"#",93.6,119,53.8,19.7,37200,8850,17.7,8.61,1490,885,1870,979,23000,1560,1.38,14.8]
[1,2,"500 x 200 x 10",null,10,"#",106,135,47,17,41800,9890,17.600000000000001,8.56,1670,989,2110,1100,25900,1740,1.37,12.9]
[1,2,"500 x 200 x 12.5",null,12.5,"#",131,167,37,13,51000,11900,17.5,8.4499999999999993,2040,1190,2590,1350,31500,2100,1.37,10.4]
[1,2,"500 x 200 x 14.2",null,14.2,"#",148,189,32.200000000000003,11.1,56900,13200,17.399999999999999,8.3800000000000008,2280,1320,2900,1510,35200,2320,1.36,9.19]
[1,2,"500 x 200 x 16",null,16,"#",166,211,28.3,9.5,63000,14500,17.3,8.3000000000000007,2520,1450,3230,1670,38900,2550,1.36,8.2100000000000009]
[1,2,"500 x 300 x 8",null,8,"#",97.9,125,59.5,34.5,43700,20000,18.7,12.6,1750,1330,2100,1480,42600,2200,1.58,16.100000000000001]
[1,2,"500 x 300 x 8.8",null,8.8000000000000007,"#",107,137,53.8,31.1,47800,21800,18.7,12.6,1910,1450,2300,1620,46600,2400,1.58,14.7]
[1,2,"500 x 300 x 10",null,10,null,122,155,47,27,53800,24400,18.600000000000001,12.6,2150,1630,2600,1830,52500,2700,1.57,12.9]
[1,2,"500 x 300 x 12.5",null,12.5,"#",151,192,37,21,65800,29800,18.5,12.5,2630,1990,3200,2240,64400,3280,1.57,10.4]
[1,2,"500 x 300 x 14.2",null,14.2,"#",170,217,32.200000000000003,18.100000000000001,73700,33200,18.399999999999999,12.4,2950,2220,3590,2520,72200,3660,1.56,9.16]
[1,2,"500 x 300 x 16",null,16,null,191,243,28.3,15.8,81800,36800,18.3,12.3,3270,2450,4010,2800,80300,4040,1.56,8.17]
[2,2,"500 x 300 x 20",null,20,"^",235,300,22,12,98800,44100,18.2,12.1,3950,2940,4890,3410,97400,4840,1.55,6.59]
[]
[]
[]
[]
[null,null,null,"Table 1.8.2.1"]
[null,null,null,"HOT FINISHED"]
[null,null,null,"SQUARE HOLLOW SECTIONS"]
[]
[null,null,null,"Dimensions and properties"]
[]
[null,null,"Section",null,null,null,"Mass","Area","Ratio","Second","Radius","Elastic","Plastic","Torsional",null,"Surface"]
[null,null,"Designation",null,null,null,"per","of","for","Moment","of","Modulus","Modulus","Constants",null,"Area"]
[null,null,"Size","Thickness",null,null,"Metre","Section","Local","of Area","Gyration",null,null,null,null,"Per","Per"]
[null,null,null,null,null,null,null,null,"Buckling",null,null,null,null,null,null,"Metre","Tonne"]
[null,null,"D x D","t",null,null,null,"A","c/t (1)","I","r","Z","S","J","C"]
[null,null,"mm","mm",null,null,"kg/m","cm2",null,"cm4","cm","cm3","cm3","cm4","cm3","m2","m2"]
[1,2,"40 x 40 x 3",null,3,"#",3.41,4.34,10.3,9.7799999999999994,1.5,4.8899999999999997,5.97,15.7,7.1,0.152,44.5]
[1,2,"40 x 40 x 3.2",null,3.2,null,3.61,4.5999999999999996,9.5,10.199999999999999,1.49,5.1100000000000003,6.28,16.5,7.42,0.152,42.1]
[1,2,"40 x 40 x 3.6",null,3.6,"#",4.01,5.0999999999999996,8.11,11.1,1.47,5.54,6.88,18.100000000000001,8.01,0.151,37.799999999999997]
[1,2,"40 x 40 x 4",null,4,null,4.3899999999999997,5.59,7,11.8,1.45,5.91,7.44,19.5,8.5399999999999991,0.15,34.200000000000003]
[1,2,"40 x 40 x 5",null,5,null,5.28,6.73,5,13.4,1.41,6.68,8.66,22.5,9.6,0.14699999999999999,27.8]
[1,2,"50 x 50 x 3",null,3,"#",4.3499999999999996,5.54,13.7,20.2,1.91,8.08,9.6999999999999993,32.1,11.8,0.192,44.2]
[1,2,"50 x 50 x 3.2",null,3.2,null,4.62,5.88,12.6,21.2,1.9,8.49,10.199999999999999,33.799999999999997,12.4,0.192,41.7]
[1,2,"50 x 50 x 3.6",null,3.6,"#",5.14,6.54,10.9,23.2,1.88,9.27,11.3,37.200000000000003,13.5,0.191,37.200000000000003]
[1,2,"50 x 50 x 4",null,4,null,5.64,7.19,9.5,25,1.86,9.99,12.3,40.4,14.5,0.19,33.6]
[1,2,"50 x 50 x 5",null,5,null,6.85,8.73,7,28.9,1.82,11.6,14.5,47.6,16.7,0.187,27.3]
[1,2,"50 x 50 x 6.3",null,6.3,null,8.31,10.6,4.9400000000000004,32.799999999999997,1.76,13.1,17,55.2,18.8,0.184,22.1]
[1,2,"50 x 50 x 7.1",null,7.1,"#",9.14,11.6,4.04,34.5,1.72,13.8,18.3,58.9,19.8,0.182,19.8]
[1,2,"50 x 50 x 8",null,8,"#",10,12.8,3.25,36,1.68,14.4,19.5,62.3,20.6,0.17899999999999999,17.899999999999999]
[1,2,"60 x 60 x 3",null,3,"#",5.29,6.74,17,36.200000000000003,2.3199999999999998,12.1,14.3,56.9,17.7,0.23200000000000001,43.8]
[1,2,"60 x 60 x 3.2",null,3.2,null,5.62,7.16,15.8,38.200000000000003,2.31,12.7,15.2,60.2,18.600000000000001,0.23200000000000001,41.3]
[1,2,"60 x 60 x 3.6",null,3.6,"#",6.27,7.98,13.7,41.9,2.29,14,16.8,66.5,20.399999999999999,0.23100000000000001,37]
[1,2,"60 x 60 x 4",null,4,null,6.9,8.7899999999999991,12,45.4,2.27,15.1,18.3,72.5,22,0.23,33.4]
[1,2,"60 x 60 x 5",null,5,null,8.42,10.7,9,53.3,2.23,17.8,21.9,86.4,25.7,0.22700000000000001,27]
[1,2,"60 x 60 x 6.3",null,6.3,null,10.3,13.1,6.52,61.6,2.17,20.5,26,102,29.6,0.224,21.8]
[1,2,"60 x 60 x 7.1",null,7.1,"#",11.4,14.5,5.45,65.8,2.13,21.9,28.2,110,31.6,0.222,19.5]
[1,2,"60 x 60 x 8",null,8,null,12.5,16,4.5,69.7,2.09,23.2,30.4,118,33.4,0.219,17.5]
[1,2,"70 x 70 x 3",null,3,"#",6.24,7.94,20.3,59,2.73,16.899999999999999,19.899999999999999,92.2,24.8,0.27200000000000002,43.5]
[1,2,"70 x 70 x 3.2",null,3.2,null,6.63,8.44,18.899999999999999,62.3,2.72,17.8,21,97.6,26.1,0.27200000000000002,41.1]
[1,2,"70 x 70 x 3.6",null,3.6,"#",7.4,9.42,16.399999999999999,68.599999999999994,2.7,19.600000000000001,23.3,108,28.7,0.27100000000000002,36.6]
[1,2,"70 x 70 x 4",null,4,null,8.15,10.4,14.5,74.7,2.68,21.3,25.5,118,31.2,0.27,33.200000000000003]
[1,2,"70 x 70 x 5",null,5,null,9.99,12.7,11,88.5,2.64,25.3,30.8,142,36.799999999999997,0.26700000000000002,26.7]
[1,2,"70 x 70 x 6.3",null,6.3,null,12.3,15.6,8.11,104,2.58,29.7,36.9,169,42.9,0.26400000000000001,21.5]
[1,2,"70 x 70 x 7.1",null,7.1,"#",13.6,17.3,6.86,112,2.54,32,40.299999999999997,185,46.1,0.26200000000000001,19.3]
[1,2,"70 x 70 x 8",null,8,null,15,19.2,5.75,120,2.5,34.200000000000003,43.8,200,49.2,0.25900000000000001,17.2]
[1,2,"70 x 70 x 8.8",null,8.8000000000000007,"#",16.3,20.7,4.95,126,2.46,35.9,46.6,212,51.6,0.25700000000000001,15.8]
[1,2,"80 x 80 x 3",null,3,"#",7.18,9.14,23.7,89.8,3.13,22.5,26.3,140,33,0.312,43.4]
[1,2,"80 x 80 x 3.2",null,3.2,null,7.63,9.7200000000000006,22,95,3.13,23.7,27.9,148,34.9,0.312,40.9]
[1,2,"80 x 80 x 3.6",null,3.6,"#",8.5299999999999994,10.9,19.2,105,3.11,26.2,31,164,38.5,0.311,36.4]
[1,2,"80 x 80 x 4",null,4,null,9.41,12,17,114,3.09,28.6,34,180,41.9,0.31,32.9]
[1,2,"80 x 80 x 5",null,5,null,11.6,14.7,13,137,3.05,34.200000000000003,41.1,217,49.8,0.307,26.6]
[1,2,"80 x 80 x 6.3",null,6.3,null,14.2,18.100000000000001,9.6999999999999993,162,2.99,40.5,49.7,262,58.7,0.30399999999999999,21.3]
[1,2,"80 x 80 x 7.1",null,7.1,"#",15.8,20.2,8.27,176,2.95,43.9,54.5,286,63.5,0.30199999999999999,19.100000000000001]
[1,2,"80 x 80 x 8",null,8,null,17.5,22.4,7,189,2.91,47.3,59.5,312,68.3,0.29899999999999999,17]
[1,2,"80 x 80 x 8.8",null,8.8000000000000007,"#",19,24.2,6.09,200,2.87,50,63.7,332,72,0.29699999999999999,15.6]
[1,2,"80 x 80 x 10",null,10,"#",21.1,26.9,5,214,2.82,53.5,69.3,360,76.8,0.29399999999999998,13.9]
[1,2,"80 x 80 x 12.5",null,12.5,"#",25.2,32.1,3.4,234,2.7,58.6,78.900000000000006,404,83.8,0.28799999999999998,11.4]
[1,2,"90 x 90 x 3.6",null,3.6,"#",9.66,12.3,22,152,3.52,33.799999999999997,39.700000000000003,237,49.7,0.35099999999999998,36.5]
[1,2,"90 x 90 x 4",null,4,null,10.7,13.6,19.5,166,3.5,37,43.6,260,54.2,0.35,32.799999999999997]
[1,2,"90 x 90 x 5",null,5,null,13.1,16.7,15,200,3.45,44.4,53,316,64.8,0.34699999999999998,26.4]
[1,2,"90 x 90 x 6.3",null,6.3,null,16.2,20.7,11.3,238,3.4,53,64.3,382,77,0.34399999999999997,21.2]
[1,2,"90 x 90 x 7.1",null,7.1,"#",18.100000000000001,23,9.68,260,3.36,57.7,70.8,419,83.7,0.34200000000000003,18.899999999999999]
[1,2,"90 x 90 x 8",null,8,null,20.100000000000001,25.6,8.25,281,3.32,62.6,77.599999999999994,459,90.5,0.33900000000000002,16.899999999999999]
[1,2,"90 x 90 x 8.8",null,8.8000000000000007,"#",21.8,27.8,7.23,299,3.28,66.5,83.4,492,96,0.33700000000000002,15.5]
[1,2,"90 x 90 x 10",null,10,"#",24.3,30.9,6,322,3.23,71.599999999999994,91.3,536,103,0.33400000000000002,13.8]
[1,2,"90 x 90 x 12.5",null,12.5,"#",29.1,37.1,4.2,359,3.11,79.8,105,612,114,0.32800000000000001,11.3]
[1,2,"100 x 100 x 3.6",null,3.6,null,10.8,13.7,24.8,212,3.92,42.3,49.5,328,62.3,0.39100000000000001,36.200000000000003]
[1,2,"100 x 100 x 4",null,4,null,11.9,15.2,22,232,3.91,46.4,54.4,361,68.2,0.39,32.700000000000003]
[1,2,"100 x 100 x 5",null,5,null,14.7,18.7,17,279,3.86,55.9,66.400000000000006,439,81.8,0.38700000000000001,26.3]
[1,2,"100 x 100 x 6.3",null,6.3,null,18.2,23.2,12.9,336,3.8,67.099999999999994,80.900000000000006,534,97.8,0.38400000000000001,21.1]
[1,2,"100 x 100 x 7.1",null,7.1,"#",20.3,25.8,11.1,367,3.77,73.400000000000006,89.2,589,107,0.38200000000000001,18.8]
[1,2,"100 x 100 x 8",null,8,null,22.6,28.8,9.5,400,3.73,79.900000000000006,98.2,646,116,0.379,16.8]
[1,2,"100 x 100 x 8.8",null,8.8000000000000007,"#",24.5,31.3,8.36,426,3.69,85.2,106,694,123,0.377,15.3]
[1,2,"100 x 100 x 10",null,10,null,27.4,34.9,7,462,3.64,92.4,116,761,133,0.374,13.7]
[1,2,"100 x 100 x 12.5",null,12.5,"#",33,42.1,5,522,3.52,104,135,879,150,0.36799999999999999,11.2]
[1,2,"120 x 120 x 4",null,4,"#",14.4,18.399999999999999,27,410,4.72,68.400000000000006,79.7,635,101,0.47,32.6]
[1,2,"120 x 120 x 5",null,5,null,17.8,22.7,21,498,4.68,83,97.6,777,122,0.46700000000000003,26.2]
[1,2,"120 x 120 x 6.3",null,6.3,null,22.2,28.2,16,603,4.62,100,120,950,147,0.46400000000000002,20.9]
[1,2,"120 x 120 x 7.1",null,7.1,"#",24.7,31.5,13.9,663,4.59,110,133,1050,161,0.46200000000000002,18.7]
[1,2,"120 x 120 x 8",null,8,null,27.6,35.200000000000003,12,726,4.55,121,146,1160,176,0.45900000000000002,16.600000000000001]
[1,2,"120 x 120 x 8.8",null,8.8000000000000007,"#",30.1,38.299999999999997,10.6,779,4.51,130,158,1250,189,0.45700000000000002,15.2]
[1,2,"120 x 120 x 10",null,10,null,33.700000000000003,42.9,9,852,4.46,142,175,1380,206,0.45400000000000001,13.5]
[1,2,"120 x 120 x 12.5",null,12.5,null,40.9,52.1,6.6,982,4.34,164,207,1620,236,0.44800000000000001,11]
[1,2,"140 x 140 x 5",null,5,null,21,26.7,25,807,5.5,115,135,1250,170,0.54700000000000004,26.1]
[1,2,"140 x 140 x 6.3",null,6.3,null,26.1,33.299999999999997,19.2,984,5.44,141,166,1540,206,0.54400000000000004,20.8]
[1,2,"140 x 140 x 7.1",null,7.1,"#",29.2,37.200000000000003,16.7,1090,5.4,155,184,1710,227,0.54200000000000004,18.5]
[1,2,"140 x 140 x 8",null,8,null,32.6,41.6,14.5,1200,5.36,171,204,1890,249,0.53900000000000003,16.5]
[1,2,"140 x 140 x 8.8",null,8.8000000000000007,"#",35.6,45.4,12.9,1290,5.33,184,221,2050,268,0.53700000000000003,15.1]
[1,2,"140 x 140 x 10",null,10,null,40,50.9,11,1420,5.27,202,246,2270,294,0.53400000000000003,13.4]
[1,2,"140 x 140 x 12.5",null,12.5,null,48.7,62.1,8.1999999999999993,1650,5.16,236,293,2700,342,0.52800000000000002,10.8]
[1,2,"150 x 150 x 5",null,5,null,22.6,28.7,27,1000,5.9,134,156,1550,197,0.58699999999999997,26]
[1,2,"150 x 150 x 6.3",null,6.3,null,28.1,35.799999999999997,20.8,1220,5.85,163,192,1910,240,0.58399999999999996,20.8]
[1,2,"150 x 150 x 7.1",null,7.1,"#",31.4,40,18.100000000000001,1350,5.81,180,213,2120,264,0.58199999999999996,18.5]
[1,2,"150 x 150 x 8",null,8,null,35.1,44.8,15.8,1490,5.77,199,237,2350,291,0.57899999999999996,16.5]
[1,2,"150 x 150 x 8.8",null,8.8000000000000007,"#",38.4,48.9,14,1610,5.74,214,257,2550,313,0.57699999999999996,15.1]
[1,2,"150 x 150 x 10",null,10,null,43.1,54.9,12,1770,5.68,236,286,2830,344,0.57399999999999995,13.3]
[1,2,"150 x 150 x 12.5",null,12.5,null,52.7,67.099999999999994,9,2080,5.57,277,342,3380,402,0.56799999999999995,10.8]
[1,2,"150 x 150 x 14.2",null,14.2,"#",58.9,75,7.56,2260,5.49,302,377,3710,436,0.56299999999999994,9.57]
[1,2,"150 x 150 x 16",null,16,"# r",65.2,83,6.38,2430,5.41,324,411,4030,467,0.55900000000000005,8.5500000000000007]
[1,2,"160 x 160 x 5",null,5,"#",24.1,30.7,29,1230,6.31,153,178,1890,226,0.627,26]
[1,2,"160 x 160 x 6.3",null,6.3,null,30.1,38.299999999999997,22.4,1500,6.26,187,220,2330,275,0.624,20.8]
[1,2,"160 x 160 x 7.1",null,7.1,"#",33.700000000000003,42.9,19.5,1660,6.22,207,245,2600,304,0.622,18.5]
[1,2,"160 x 160 x 8",null,8,null,37.6,48,17,1830,6.18,229,272,2880,335,0.61899999999999999,16.5]
[1,2,"160 x 160 x 8.8",null,8.8000000000000007,"#",41.1,52.4,15.2,1980,6.14,247,295,3130,361,0.61699999999999999,15]
[1,2,"160 x 160 x 10",null,10,null,46.3,58.9,13,2190,6.09,273,329,3480,398,0.61399999999999999,13.3]
[1,2,"160 x 160 x 12.5",null,12.5,null,56.6,72.099999999999994,9.8000000000000007,2580,5.98,322,395,4160,467,0.60799999999999998,10.8]
[1,2,"160 x 160 x 14.2",null,14.2,"#",63.3,80.7,8.27,2810,5.9,351,436,4580,508,0.60299999999999998,9.5299999999999994]
[1,2,"160 x 160 x 16",null,16,"#",70.2,89.4,7,3030,5.82,379,476,4990,546,0.59899999999999998,8.51]
[1,2,"180 x 180 x 5",null,5,"#",27.3,34.700000000000003,33,1770,7.13,196,227,2720,290,0.70699999999999996,25.9]
[1,2,"180 x 180 x 6.3",null,6.3,null,34,43.3,25.6,2170,7.07,241,281,3360,355,0.70399999999999996,20.7]
[1,2,"180 x 180 x 7.1",null,7.1,"#",38.1,48.6,22.4,2400,7.04,267,314,3740,393,0.70199999999999996,18.399999999999999]
[1,2,"180 x 180 x 8",null,8,null,42.7,54.4,19.5,2660,7,296,349,4160,434,0.69899999999999995,16.399999999999999]
[1,2,"180 x 180 x 8.8",null,8.8000000000000007,"#",46.7,59.4,17.5,2880,6.96,320,379,4520,469,0.69699999999999995,14.9]
[1,2,"180 x 180 x 10",null,10,null,52.5,66.900000000000006,15,3190,6.91,355,424,5050,518,0.69399999999999995,13.2]
[1,2,"180 x 180 x 12.5",null,12.5,null,64.400000000000006,82.1,11.4,3790,6.8,421,511,6070,613,0.68799999999999994,10.7]
[1,2,"180 x 180 x 14.2",null,14.2,"#",72.2,92,9.68,4150,6.72,462,566,6710,670,0.68300000000000005,9.43]
[1,2,"180 x 180 x 16",null,16,null,80.2,102,8.25,4500,6.64,500,621,7340,724,0.67900000000000005,8.49]
[1,2,"200 x 200 x 5",null,5,null,30.4,38.700000000000003,37,2450,7.95,245,283,3760,362,0.78700000000000003,25.9]
[1,2,"200 x 200 x 6.3",null,6.3,null,38,48.4,28.7,3010,7.89,301,350,4650,444,0.78400000000000003,20.6]
[1,2,"200 x 200 x 7.1",null,7.1,"#",42.6,54.2,25.2,3350,7.85,335,391,5190,493,0.78200000000000003,18.399999999999999]
[1,2,"200 x 200 x 8",null,8,null,47.7,60.8,22,3710,7.81,371,436,5780,545,0.77900000000000003,16.399999999999999]
[1,2,"200 x 200 x 8.8",null,8.8000000000000007,"#",52.2,66.5,19.7,4020,7.78,402,474,6290,590,0.77700000000000002,14.9]
[1,2,"200 x 200 x 10",null,10,null,58.8,74.900000000000006,17,4470,7.72,447,531,7030,655,0.77400000000000002,13.2]
[1,2,"200 x 200 x 12.5",null,12.5,null,72.3,92.1,13,5340,7.61,534,643,8490,778,0.76800000000000002,10.6]
[1,2,"200 x 200 x 14.2",null,14.2,"#",81.099999999999994,103,11.1,5870,7.54,587,714,9420,854,0.76300000000000001,9.3800000000000008]
[1,2,"200 x 200 x 16",null,16,null,90.3,115,9.5,6390,7.46,639,785,10300,927,0.75900000000000001,8.42]
[1,2,"250 x 250 x 5",null,5,"#",38.299999999999997,48.7,47,4860,9.99,389,447,7430,577,0.98699999999999999,25.8]
[1,2,"250 x 250 x 6.3",null,6.3,null,47.9,61,36.700000000000003,6010,9.93,481,556,9240,712,0.98399999999999999,20.6]
[1,2,"250 x 250 x 7.1",null,7.1,"#",53.7,68.400000000000006,32.200000000000003,6700,9.9,536,622,10300,792,0.98199999999999998,18.3]
[1,2,"250 x 250 x 8",null,8,null,60.3,76.8,28.3,7460,9.86,596,694,11500,880,0.97899999999999998,16.3]
[1,2,"250 x 250 x 8.8",null,8.8000000000000007,"#",66,84.1,25.4,8110,9.82,649,758,12600,955,0.97699999999999998,14.9]
[1,2,"250 x 250 x 10",null,10,null,74.5,94.9,22,9060,9.77,724,851,14100,1070,0.97399999999999998,13.1]
[1,2,"250 x 250 x 12.5",null,12.5,null,91.9,117,17,10900,9.66,873,1040,17200,1280,0.96799999999999997,10.6]
[1,2,"250 x 250 x 14.2",null,14.2,"#",103,132,14.6,12100,9.58,967,1160,19100,1410,0.96299999999999997,9.31]
[1,2,"250 x 250 x 16",null,16,null,115,147,12.6,13300,9.5,1060,1280,21100,1550,0.95899999999999996,8.31]
[1,2,"260 x 260 x 6.3",null,6.3,"#",49.9,63.5,38.299999999999997,6790,10.3,522,603,10400,773,1.02,20.5]
[1,2,"260 x 260 x 7.1",null,7.1,"#",56,71.3,33.6,7570,10.3,582,674,11600,861,1.02,18.3]
[1,2,"260 x 260 x 8",null,8,"#",62.8,80,29.5,8420,10.3,648,753,13000,956,1.02,16.2]
[1,2,"260 x 260 x 8.8",null,8.8000000000000007,"#",68.8,87.6,26.5,9160,10.199999999999999,705,822,14200,1040,1.02,14.8]
[1,2,"260 x 260 x 10",null,10,"#",77.7,98.9,23,10200,10.199999999999999,788,924,15900,1160,1.01,13]
[1,2,"260 x 260 x 12.5",null,12.5,"#",95.8,122,17.8,12400,10.1,951,1130,19400,1390,1.01,10.5]
[1,2,"260 x 260 x 14.2",null,14.2,"#",108,137,15.3,13700,9.99,1060,1260,21700,1540,1,9.27]
[1,2,"260 x 260 x 16",null,16,"#",120,153,13.3,15100,9.91,1160,1390,23900,1690,0.999,8.2899999999999991]
[1,2,"300 x 300 x 6.3",null,6.3,"#",57.8,73.599999999999994,44.6,10500,12,703,809,16100,1040,1.18,20.399999999999999]
[1,2,"300 x 300 x 7.1",null,7.1,"#",64.900000000000006,82.6,39.299999999999997,11800,11.9,785,906,18100,1160,1.18,18.2]
[1,2,"300 x 300 x 8",null,8,null,72.8,92.8,34.5,13100,11.9,875,1010,20200,1290,1.18,16.2]
[1,2,"300 x 300 x 8.8",null,8.8000000000000007,"#",79.8,102,31.1,14300,11.9,954,1110,22100,1410,1.18,14.8]
[1,2,"300 x 300 x 10",null,10,null,90.2,115,27,16000,11.8,1070,1250,24800,1580,1.17,13]
[1,2,"300 x 300 x 12.5",null,12.5,null,112,142,21,19400,11.7,1300,1530,30300,1900,1.17,10.5]
[1,2,"300 x 300 x 14.2",null,14.2,"#",126,160,18.100000000000001,21600,11.6,1440,1710,33900,2110,1.1599999999999999,9.2200000000000006]
[1,2,"300 x 300 x 16",null,16,null,141,179,15.8,23900,11.5,1590,1900,37600,2330,1.1599999999999999,8.26]
[1,2,"350 x 350 x 8",null,8,null,85.4,109,40.799999999999997,21100,13.9,1210,1390,32400,1790,1.38,16.100000000000001]
[1,2,"350 x 350 x 8.8",null,8.8000000000000007,"#",93.6,119,36.799999999999997,23100,13.9,1320,1520,35400,1950,1.38,14.8]
[1,2,"350 x 350 x 10",null,10,null,106,135,32,25900,13.9,1480,1720,39900,2190,1.37,12.9]
[1,2,"350 x 350 x 12.5",null,12.5,null,131,167,25,31500,13.7,1800,2110,48900,2650,1.37,10.4]
[1,2,"350 x 350 x 14.2",null,14.2,"#",148,189,21.6,35200,13.7,2010,2360,54900,2960,1.36,9.19]
[1,2,"350 x 350 x 16",null,16,null,166,211,18.899999999999999,38900,13.6,2230,2630,61000,3260,1.36,8.2100000000000009]
[1,2,"400 x 400 x 8",null,8,"#",97.9,125,47,31900,16,1590,1830,48700,2360,1.58,16.100000000000001]
[1,2,"400 x 400 x 8.8",null,8.8000000000000007,"#",107,137,42.5,34800,15.9,1740,2000,53300,2580,1.58,14.7]
[1,2,"400 x 400 x 10",null,10,null,122,155,37,39100,15.9,1960,2260,60100,2900,1.57,12.9]
[1,2,"400 x 400 x 12.5",null,12.5,null,151,192,29,47800,15.8,2390,2780,73900,3530,1.57,10.4]
[1,2,"400 x 400 x 14.2",null,14.2,"#",170,217,25.2,53500,15.7,2680,3130,83000,3940,1.56,9.16]
[1,2,"400 x 400 x 16",null,16,null,191,243,22,59300,15.6,2970,3480,92400,4360,1.56,8.17]
[2,2,"400 x 400 x 20",null,20,"^",235,300,17,71500,15.4,3580,4250,112000,5240,1.55,6.59]
[]
[null,null,"Flat Bars"]
[null,null,null,"w","t","A","Iyy","Rmin"]
[1,2,{"$f":"D509&\" x \"&E509","v":"40 x 6"},40,6,{"$f":"D509*E509/100","v":2.4},{"$f":"(D509*E509^3/12)/10000","v":7.1999999999999995E-2},{"$f":"(G509/F509)^0.5","v":0.17320508075688773}]
[1,2,"50 x 6",50,6,3,0.09,0.17320508075688773]
[1,2,"60 x 6",60,6,3.6,0.108,0.17320508075688773]
[1,2,"70 x 6",70,6,4.2,0.126,0.17320508075688773]
[1,2,"80 x 6",80,6,4.8,0.14399999999999999,0.17320508075688773]
[1,2,"90 x 6",90,6,5.4,0.16200000000000001,0.17320508075688773]
[1,2,"100 x 6",100,6,6,0.18,0.17320508075688773]
[1,2,"120 x 6",120,6,7.2,0.216,0.17320508075688773]
[1,2,"150 x 6",150,6,9,0.27,0.17320508075688773]
[1,2,"180 x 6",180,6,10.8,0.32400000000000001,0.17320508075688773]
[1,2,"200 x 6",200,6,12,0.36,0.17320508075688773]
[1,2,"250 x 6",250,6,15,0.45,0.17320508075688773]
[1,2,"300 x 6",300,6,18,0.54,0.17320508075688773]
[1,2,"40 x 8",40,8,3.2,0.17066666666666666,0.2309401076758503]
[1,2,"50 x 8",50,8,4,0.21333333333333335,0.23094010767585033]
[1,2,"60 x 8",60,8,4.8,0.25600000000000001,0.23094010767585033]
[1,2,"70 x 8",70,8,5.6,0.29866666666666664,0.2309401076758503]
[1,2,"80 x 8",80,8,6.4,0.34133333333333332,0.2309401076758503]
[1,2,"90 x 8",90,8,7.2,0.38400000000000001,0.2309401076758503]
[1,2,"100 x 8",100,8,8,0.42666666666666669,0.23094010767585033]
[1,2,"120 x 8",120,8,9.6,0.51200000000000001,0.23094010767585033]
[1,2,"150 x 8",150,8,12,0.64,0.23094010767585033]
[1,2,"180 x 8",180,8,14.4,0.76800000000000002,0.2309401076758503]
[1,2,"200 x 8",200,8,16,0.85333333333333339,0.23094010767585033]
[1,2,"250 x 8",250,8,20,1.0666666666666667,0.2309401076758503]
[1,2,"300 x 8",300,8,24,1.28,0.23094010767585033]
[1,2,"40 x 10",40,10,4,0.33333333333333337,0.28867513459481292]
[1,2,"50 x 10",50,10,5,0.41666666666666669,0.28867513459481292]
[1,2,"60 x 10",60,10,6,0.5,0.28867513459481287]
[1,2,"70 x 10",70,10,7,0.58333333333333326,0.28867513459481287]
[1,2,"80 x 10",80,10,8,0.66666666666666674,0.28867513459481292]
[1,2,"90 x 10",90,10,9,0.75,0.28867513459481287]
[1,2,{"$f":"D541&\" x \"&E541","v":"100 x 10"},100,10,{"$f":"D541*E541/100","v":10},{"$f":"(D541*E541^3/12)/10000","v":0.83333333333333337},{"$f":"(G541/F541)^0.5","v":0.28867513459481292}]
[1,2,"120 x 10",120,10,12,1,0.28867513459481287]
[1,2,"150 x 10",150,10,15,1.25,0.28867513459481287]
[1,2,"180 x 10",180,10,18,1.5,0.28867513459481287]
[1,2,"200 x 10",200,10,20,1.6666666666666667,0.28867513459481292]
[1,2,"250 x 10",250,10,25,2.083333333333333,0.28867513459481287]
[1,2,"300 x 10",300,10,30,2.5,0.28867513459481287]
[1,2,"350 x 10",350,10,35,2.916666666666667,0.28867513459481292]
[1,2,"400 x 10",400,10,40,3.3333333333333335,0.28867513459481292]
[1,2,"40 x 12",40,12,4.8,0.57599999999999996,0.34641016151377546]
[1,2,"50 x 12",50,12,6,0.72,0.34641016151377546]
[1,2,"60 x 12",60,12,7.2,0.86399999999999999,0.34641016151377546]
[1,2,"70 x 12",70,12,8.4,1.008,0.34641016151377546]
[1,2,"80 x 12",80,12,9.6,1.1519999999999999,0.34641016151377546]
[1,2,"90 x 12",90,12,10.8,1.296,0.34641016151377546]
[1,2,"100 x 12",100,12,12,1.44,0.34641016151377546]
[1,2,"120 x 12",120,12,14.4,1.728,0.34641016151377546]
[1,2,"150 x 12",150,12,18,2.16,0.34641016151377546]
[1,2,"180 x 12",180,12,21.6,2.5920000000000001,0.34641016151377546]
[1,2,"200 x 12",200,12,24,2.88,0.34641016151377546]
[1,2,"250 x 12",250,12,30,3.6,0.34641016151377546]
[1,2,"300 x 12",300,12,36,4.32,0.34641016151377546]
[1,2,"350 x 12",350,12,42,5.04,0.34641016151377546]
[1,2,"400 x 12",400,12,48,5.76,0.34641016151377546]
[1,2,"40 x 15",40,15,6,1.125,0.4330127018922193]
[1,2,"50 x 15",50,15,7.5,1.40625,0.4330127018922193]
[1,2,"60 x 15",60,15,9,1.6875,0.4330127018922193]
[1,2,"70 x 15",70,15,10.5,1.96875,0.4330127018922193]
[1,2,"80 x 15",80,15,12,2.25,0.4330127018922193]
[1,2,"90 x 15",90,15,13.5,2.53125,0.4330127018922193]
[1,2,"100 x 15",100,15,15,2.8125,0.4330127018922193]
[1,2,"120 x 15",120,15,18,3.375,0.4330127018922193]
[1,2,{"$f":"D573&\" x \"&E573","v":"150 x 15"},150,15,{"$f":"D573*E573/100","v":22.5},{"$f":"(D573*E573^3/12)/10000","v":4.21875},{"$f":"(G573/F573)^0.5","v":0.4330127018922193}]
[1,2,"180 x 15",180,15,27,5.0625,0.4330127018922193]
[1,2,"200 x 15",200,15,30,5.625,0.4330127018922193]
[1,2,"250 x 15",250,15,37.5,7.03125,0.4330127018922193]
[1,2,"300 x 15",300,15,45,8.4375,0.4330127018922193]
[1,2,"350 x 15",350,15,52.5,9.84375,0.4330127018922193]
[1,2,"400 x 15",400,15,60,11.25,0.4330127018922193]
[2,2,"40 x 20",40,20,8,2.666666666666667,0.57735026918962584]
[2,2,"50 x 20",50,20,10,3.3333333333333335,0.57735026918962584]
[2,2,"60 x 20",60,20,12,4,0.57735026918962573]
[2,2,"70 x 20",70,20,14,4.6666666666666661,0.57735026918962573]
[2,2,"80 x 20",80,20,16,5.3333333333333339,0.57735026918962584]
[2,2,"90 x 20",90,20,18,6,0.57735026918962573]
[2,2,"100 x 20",100,20,20,6.666666666666667,0.57735026918962584]
[2,2,"120 x 20",120,20,24,8,0.57735026918962573]
[2,2,"150 x 20",150,20,30,10,0.57735026918962573]
[2,2,"180 x 20",180,20,36,12,0.57735026918962573]
[2,2,"200 x 20",200,20,40,13.333333333333334,0.57735026918962584]
[2,2,"250 x 20",250,20,50,16.666666666666664,0.57735026918962573]
[2,2,"300 x 20",300,20,60,20,0.57735026918962573]
[2,2,"350 x 20",350,20,70,23.333333333333336,0.57735026918962584]
[2,2,"400 x 20",400,20,80,26.666666666666668,0.57735026918962584]
[2,2,"450 x 20",450,20,90,30,0.57735026918962573]
[2,2,"500 x 20",500,20,100,33.333333333333329,0.57735026918962573]
[2,2,"40 x 25",40,25,10,5.2083333333333339,0.72168783648703227]
[2,2,"50 x 25",50,25,12.5,6.5104166666666661,0.72168783648703216]
[2,2,"60 x 25",60,25,15,7.8125,0.72168783648703227]
[2,2,"70 x 25",70,25,17.5,9.1145833333333321,0.72168783648703216]
[2,2,"80 x 25",80,25,20,10.416666666666668,0.72168783648703227]
[2,2,"90 x 25",90,25,22.5,11.71875,0.72168783648703227]
[2,2,"100 x 25",100,25,25,13.020833333333332,0.72168783648703216]
[2,2,"120 x 25",120,25,30,15.625,0.72168783648703227]
[2,2,{"$f":"D605&\" x \"&E605","v":"150 x 25"},150,25,{"$f":"D605*E605/100","v":37.5},{"$f":"(D605*E605^3/12)/10000","v":19.53125},{"$f":"(G605/F605)^0.5","v":0.72168783648703227}]
[2,2,"180 x 25",180,25,45,23.4375,0.72168783648703227]
[2,2,"200 x 25",200,25,50,26.041666666666664,0.72168783648703216]
[2,2,"250 x 25",250,25,62.5,32.552083333333329,0.72168783648703216]
[2,2,"300 x 25",300,25,75,39.0625,0.72168783648703227]
[2,2,"350 x 25",350,25,87.5,45.572916666666671,0.72168783648703227]
[2,2,"400 x 25",400,25,100,52.083333333333329,0.72168783648703216]
[2,2,"450 x 25",450,25,112.5,58.59375,0.72168783648703227]
[2,2,"500 x 25",500,25,125,65.104166666666657,0.72168783648703216]
[2,2,"550 x 25",550,25,137.5,71.614583333333343,0.72168783648703227]
[2,2,"600 x 25",600,25,150,78.125,0.72168783648703227]
[2,2,"650 x 25",650,25,162.5,84.635416666666657,0.72168783648703216]
[2,2,"50 x 40",50,40,20,26.666666666666668,1.1547005383792517]
[2,2,"60 x 40",60,40,24,32,1.1547005383792515]
[2,2,"70 x 40",70,40,28,37.333333333333329,1.1547005383792515]
[2,2,"80 x 40",80,40,32,42.666666666666671,1.1547005383792517]
[2,2,"90 x 40",90,40,36,48,1.1547005383792515]
[2,2,"100 x 40",100,40,40,53.333333333333336,1.1547005383792517]
[2,2,"120 x 40",120,40,48,64,1.1547005383792515]
[2,2,"150 x 40",150,40,60,80,1.1547005383792515]
[2,2,"180 x 40",180,40,72,96,1.1547005383792515]
[2,2,"200 x 40",200,40,80,106.66666666666667,1.1547005383792517]
[2,2,"250 x 40",250,40,100,133.33333333333331,1.1547005383792515]
[2,2,"300 x 40",300,40,120,160,1.1547005383792515]
[2,2,"350 x 40",350,40,140,186.66666666666669,1.1547005383792517]
[2,2,"400 x 40",400,40,160,213.33333333333334,1.1547005383792517]
[2,2,"450 x 40",450,40,180,240,1.1547005383792515]
[2,2,"500 x 40",500,40,200,266.66666666666663,1.1547005383792515]
[2,2,"550 x 40",550,40,220,293.33333333333337,1.1547005383792517]
[2,2,"600 x 40",600,40,240,320,1.1547005383792515]
[2,2,"650 x 40",650,40,260,346.66666666666663,1.1547005383792515]
[1,1,"70 x 50",70,50,35,72.916666666666657,1.4433756729740643]
[1,1,{"$f":"D637&\" x \"&E637","v":"80 x 50"},80,50,{"$f":"D637*E637/100","v":40},{"$f":"(D637*E637^3/12)/10000","v":83.333333333333343},{"$f":"(G637/F637)^0.5","v":1.4433756729740645}]
[1,1,"90 x 50",90,50,45,93.75,1.4433756729740645]
[1,1,"100 x 50",100,50,50,104.16666666666666,1.4433756729740643]
[1,1,"120 x 50",120,50,60,125,1.4433756729740645]
[1,1,"150 x 50",150,50,75,156.25,1.4433756729740645]
[1,1,"180 x 50",180,50,90,187.5,1.4433756729740645]
[1,1,"200 x 50",200,50,100,208.33333333333331,1.4433756729740643]
[1,1,"250 x 50",250,50,125,260.41666666666663,1.4433756729740643]
[1,1,"300 x 50",300,50,150,312.5,1.4433756729740645]
[1,1,"350 x 50",350,50,175,364.58333333333337,1.4433756729740645]
[1,1,"400 x 50",400,50,200,416.66666666666663,1.4433756729740643]
[1,1,"450 x 50",450,50,225,468.75,1.4433756729740645]
[1,1,"500 x 50",500,50,250,520.83333333333326,1.4433756729740643]
[1,1,"550 x 50",550,50,275,572.91666666666674,1.4433756729740645]
[1,1,"600 x 50",600,50,300,625,1.4433756729740645]
[1,1,"650 x 50",650,50,325,677.08333333333326,1.4433756729740643]
[]
[]
[]
[]
[]
[]
[null,null,null,"Table 1.8.5.1"]
[null,null,null,"COLD FORMED"]
[null,null,null,"CIRCULAR HOLLOW SECTIONS"]
[null,null,null,"Hybox® CHS"]
[null,null,null,"Dimensions and properties"]
[null,null,null,null,"Cold Formed"]
[null,null,"Section",null,null,null,"Mass","Area","Ratio","Second","Radius","Elastic","Plastic","Torsional",null,"Surface"]
[null,null,"Designation",null,null,null,"per","of","for","Moment","of","Modulus","Modulus","Constants",null,"Area"]
[null,null,"Outside","Thickness",null,null,"Metre","Section","Local","of Area","Gyration",null,null,null,null,"Per","Per"]
[null,null,"Diameter",null,null,null,null,null,"Buckling",null,null,null,null,null,null,"Metre","Tonne"]
[null,null,"D","t",null,null,null,"A","D/t","I","r","Z","S","J","C"]
[null,null,"mm","mm",null,null,"kg/m","cm2",null,"cm4","cm","cm3","cm3","cm4","cm3","m2","m2"]
[1,2,"33.7 x 3",null,null,null,2.27,2.89,11.2,3.44,1.0900000000000001,2.04,2.84,6.88,4.08,0.106,46.6]
[1,2,"42.4 x 3",null,null,null,2.91,3.71,14.1,7.25,1.4,3.42,4.67,14.5,6.84,0.13300000000000001,45.6]
[1,2,"48.3 x 3",null,3,null,3.35,4.2699999999999996,16.100000000000001,11,1.61,4.55,6.17,22,9.11,0.152,45.3]
[1,2,"48.3 x 4",null,4,"#",4.37,5.57,12.1,13.8,1.57,5.7,7.87,27.5,11.4,0.152,34.799999999999997]
[1,2,"60.3 x 3",null,3,"#",4.24,5.4,20.100000000000001,22.2,2.0299999999999998,7.37,9.86,44.4,14.7,0.189,44.6]
[1,2,"60.3 x 4",null,4,null,5.55,7.07,15.1,28.2,2,9.34,12.7,56.3,18.7,0.189,34]
[1,2,"76.1 x 3",null,3,null,5.41,6.89,25.4,46.1,2.59,12.1,16,92.2,24.2,0.23899999999999999,44.2]
[1,2,"76.1 x 4",null,4,null,7.11,9.06,19,59.1,2.5499999999999998,15.5,20.8,118,31,0.23899999999999999,33.700000000000003]
[1,2,"88.9 x 3",null,3,null,6.36,8.1,29.6,74.8,3.04,16.8,22.1,150,33.6,0.27900000000000003,43.8]
[1,2,"88.9 x 3.5",null,3.5,"#",7.37,9.39,25.4,85.7,3.02,19.3,25.5,171,38.6,0.27900000000000003,37.9]
[1,2,"88.9 x 4",null,4,null,8.3800000000000008,10.7,22.2,96.3,3,21.7,28.9,193,43.3,0.27900000000000003,33.200000000000003]
[1,2,"88.9 x 5",null,5,null,10.3,13.2,17.8,116,2.97,26.2,35.200000000000003,233,52.4,0.27900000000000003,27]
[1,2,"88.9 x 6.3",null,6.3,null,12.8,16.3,14.1,140,2.93,31.5,43.1,280,63.1,0.27900000000000003,21.7]
[1,2,"114.3 x 3",null,3,"#",8.23,10.5,38.1,163,3.94,28.4,37.200000000000003,325,56.9,0.35899999999999999,43.4]
[1,2,"114.3 x 3.5",null,3.5,null,9.56,12.2,32.700000000000003,187,3.92,32.700000000000003,43,374,65.5,0.35899999999999999,37.700000000000003]
[1,2,"114.3 x 4",null,4,"#",10.9,13.9,28.6,211,3.9,36.9,48.7,422,73.900000000000006,0.35899999999999999,33]
[1,2,"114.3 x 5",null,5,null,13.5,17.2,22.9,257,3.87,45,59.8,514,89.9,0.35899999999999999,26.6]
[1,2,"114.3 x 6",null,6,null,16,20.399999999999999,19.100000000000001,300,3.83,52.5,70.400000000000006,600,105,0.35899999999999999,22.4]
[1,2,"114.3 x 6.3",null,6.3,null,16.8,21.4,18.100000000000001,313,3.82,54.7,73.599999999999994,625,109,0.35899999999999999,21.4]
[1,2,"139.7 x 3",null,3,"#",10.1,12.9,46.6,301,4.83,43.1,56.1,602,86.2,0.439,43.4]
[1,2,"139.7 x 4",null,4,"#",13.4,17.100000000000001,34.9,393,4.8,56.2,73.7,786,112,0.439,32.799999999999997]
[1,2,"139.7 x 5",null,5,null,16.600000000000001,21.2,27.9,481,4.7699999999999996,68.8,90.8,961,138,0.439,26.4]
[1,2,"139.7 x 6",null,6,null,19.8,25.2,23.3,564,4.7300000000000004,80.8,107,1130,162,0.439,22.2]
[1,2,"139.7 x 6.3",null,6.3,null,20.7,26.4,22.2,589,4.72,84.3,112,1180,169,0.439,21.2]
[1,2,"139.7 x 8",null,8,null,26,33.1,17.5,720,4.66,103,139,1440,206,0.439,16.899999999999999]
[1,2,"139.7 x 10",null,10,null,32,40.700000000000003,14,862,4.5999999999999996,123,169,1720,247,0.439,13.7]
[1,2,"168.3 x 4",null,4,null,16.2,20.6,42.1,697,5.81,82.8,108,1390,166,0.52900000000000003,32.6]
[1,2,"168.3 x 4.5",null,4.5,"#",18.2,23.2,37.4,777,5.79,92.4,121,1550,185,0.52900000000000003,29.1]
[1,2,"168.3 x 5",null,5,null,20.100000000000001,25.7,33.700000000000003,856,5.78,102,133,1710,203,0.52900000000000003,26.3]
[1,2,"168.3 x 6",null,6,null,24,30.6,28.1,1010,5.74,120,158,2020,240,0.52900000000000003,22]
[1,2,"168.3 x 6.3",null,6.3,null,25.2,32.1,26.7,1050,5.73,125,165,2110,250,0.52900000000000003,21]
[1,2,"168.3 x 8",null,8,null,31.6,40.299999999999997,21,1300,5.67,154,206,2600,308,0.52900000000000003,16.7]
[1,2,"168.3 x 10",null,10,null,39,49.7,16.8,1560,5.61,186,251,3130,372,0.52900000000000003,13.5]
[1,2,"168.3 x 12.5",null,12.5,null,48,61.2,13.5,1870,5.53,222,304,3740,444,0.52900000000000003,11]
[1,2,"193.7 x 4",null,4,"#",18.7,23.8,48.4,1070,6.71,111,144,2150,222,0.60899999999999999,32.5]
[1,2,"193.7 x 4.5",null,4.5,"#",21,26.7,43,1200,6.69,124,161,2400,247,0.60899999999999999,29]
[1,2,"193.7 x 5",null,5,null,23.3,29.6,38.700000000000003,1320,6.67,136,178,2640,273,0.60899999999999999,26.2]
[1,2,"193.7 x 6",null,6,null,27.8,35.4,32.299999999999997,1560,6.64,161,211,3120,322,0.60899999999999999,21.9]
[1,2,"193.7 x 6.3",null,6.3,null,29.1,37.1,30.7,1630,6.63,168,221,3260,337,0.60899999999999999,20.9]
[1,2,"193.7 x 8",null,8,null,36.6,46.7,24.2,2020,6.57,208,276,4030,416,0.60899999999999999,16.600000000000001]
[1,2,"193.7 x 10",null,10,null,45.3,57.7,19.399999999999999,2440,6.5,252,338,4880,504,0.60899999999999999,13.5]
[1,2,"193.7 x 12.5",null,12.5,null,55.9,71.2,15.5,2930,6.42,303,411,5870,606,0.60899999999999999,10.9]
[1,2,"219.1 x 4.5",null,4.5,"#",23.8,30.3,48.7,1750,7.59,159,207,3490,319,0.68799999999999994,28.9]
[1,2,"219.1 x 5",null,5,null,26.4,33.6,43.8,1930,7.57,176,229,3860,352,0.68799999999999994,26.1]
[1,2,"219.1 x 6",null,6,null,31.5,40.200000000000003,36.5,2280,7.54,208,273,4560,417,0.68799999999999994,21.8]
[1,2,"219.1 x 6.3",null,6.3,null,33.1,42.1,34.799999999999997,2390,7.53,218,285,4770,436,0.68799999999999994,20.8]
[1,2,"219.1 x 8",null,8,null,41.6,53.1,27.4,2960,7.47,270,357,5920,540,0.68799999999999994,16.5]
[1,2,"219.1 x 10",null,10,null,51.6,65.7,21.9,3600,7.4,328,438,7200,657,0.68799999999999994,13.3]
[1,2,"219.1 x 4.12",null,12,"#",61.3,78.099999999999994,18.3,4200,7.33,383,515,8400,767,0.68799999999999994,11.2]
[1,2,"219.1 x 4.12.5",null,12.5,null,63.7,81.099999999999994,17.5,4350,7.32,397,534,8690,793,0.68799999999999994,10.8]
[1,2,"219.1 x 16",null,16,null,80.099999999999994,102,13.7,5300,7.2,483,661,10600,967,0.68799999999999994,8.6]
[1,2,"244.5 x 5",null,5,"#",29.5,37.6,48.9,2700,8.4700000000000006,221,287,5400,441,0.76800000000000002,26]
[1,2,"244.5 x 6",null,6,null,35.299999999999997,45,40.799999999999997,3200,8.43,262,341,6400,523,0.76800000000000002,21.7]
[1,2,"244.5 x 6.3",null,6.3,null,37,47.1,38.799999999999997,3350,8.42,274,358,6690,547,0.76800000000000002,20.7]
[1,2,"244.5 x 8",null,8,null,46.7,59.4,30.6,4160,8.3699999999999992,340,448,8320,681,0.76800000000000002,16.399999999999999]
[1,2,"244.5 x 10",null,10,null,57.8,73.7,24.5,5070,8.3000000000000007,415,550,10100,830,0.76800000000000002,13.3]
[1,2,"244.5 x 12",null,12,"#",68.8,87.7,20.399999999999999,5940,8.23,486,649,11900,972,0.76800000000000002,11.1]
[1,2,"244.5 x 12.5",null,12.5,null,71.5,91.1,19.600000000000001,6150,8.2100000000000009,503,673,12300,1010,0.76800000000000002,10.8]
[1,2,"244.5 x 16",null,16,null,90.2,115,15.3,7530,8.1,616,837,15100,1230,0.76800000000000002,8.52]
[1,2,"273 x 4",null,4,"#",26.5,33.799999999999997,68.3,3060,9.51,224,289,6120,448,0.85799999999999998,32.299999999999997]
[1,2,"273 x 4.5",null,4.5,"#",29.8,38,60.7,3420,9.49,251,324,6840,501,0.85799999999999998,28.8]
[1,2,"273 x 5",null,5,"#",33,42.1,54.6,3780,9.48,277,359,7560,554,0.85799999999999998,26]
[1,2,"273 x 6",null,6,null,39.5,50.3,45.5,4490,9.44,329,428,8970,657,0.85799999999999998,21.7]
[1,2,"273 x 6.3",null,6.3,null,41.4,52.8,43.3,4700,9.43,344,448,9390,688,0.85799999999999998,20.7]
[1,2,"273 x 8",null,8,null,52.3,66.599999999999994,34.1,5850,9.3699999999999992,429,562,11700,857,0.85799999999999998,16.399999999999999]
[1,2,"273 x 10",null,10,null,64.900000000000006,82.6,27.3,7150,9.31,524,692,14300,1050,0.85799999999999998,13.2]
[1,2,"273 x 12",null,12,"#",77.2,98.4,22.8,8400,9.24,615,818,16800,1230,0.85799999999999998,11.1]
[1,2,"273 x 12.5",null,12.5,null,80.3,102,21.8,8700,9.2200000000000006,637,849,17400,1270,0.85799999999999998,10.7]
[1,2,"273 x 16",null,16,null,101,129,17.100000000000001,10700,9.1,784,1060,21400,1570,0.85799999999999998,8.4600000000000009]
[1,2,"323.9 x 5",null,5,"#",39.299999999999997,50.1,64.8,6370,11.3,393,509,12700,787,1.02,25.9]
[1,2,"323.9 x 6",null,6,null,47,59.9,54,7570,11.2,468,606,15100,935,1.02,21.7]
[1,2,"323.9 x 6.3",null,6.3,"#",49.3,62.9,51.4,7930,11.2,490,636,15900,979,1.02,20.7]
[1,2,"323.9 x 8",null,8,null,62.3,79.400000000000006,40.5,9910,11.2,612,799,19800,1220,1.02,16.3]
[1,2,"323.9 x 10",null,10,null,77.400000000000006,98.6,32.4,12200,11.1,751,986,24300,1500,1.02,13.2]
[1,2,"323.9 x 12",null,12,"#",92.3,118,27,14300,11,884,1170,28600,1770,1.02,11]
[1,2,"323.9 x 12.5",null,12.5,null,96,122,25.9,14800,11,917,1210,29700,1830,1.02,10.6]
[1,2,"323.9 x 16",null,16,null,121,155,20.2,18400,10.9,1140,1520,36800,2270,1.02,8.39]
[1,2,"355.6 x 5",null,5,"#",43.2,55.1,71.099999999999994,8460,12.4,476,615,16900,952,1.1200000000000001,25.9]
[1,2,"355.6 x 6",null,6,null,51.7,65.900000000000006,59.3,10100,12.4,566,733,20100,1130,1.1200000000000001,21.6]
[1,2,"355.6 x 6.3",null,6.3,"#",54.3,69.099999999999994,56.4,10500,12.4,593,769,21100,1190,1.1200000000000001,20.6]
[1,2,"355.6 x 8",null,8,null,68.599999999999994,87.4,44.5,13200,12.3,742,967,26400,1490,1.1200000000000001,16.399999999999999]
[1,2,"355.6 x 10",null,10,null,85.2,109,35.6,16200,12.2,912,1200,32400,1830,1.1200000000000001,13.1]
[1,2,"355.6 x 12",null,12,"#",102,130,29.6,19100,12.2,1080,1420,38300,2150,1.1200000000000001,11]
[1,2,"355.6 x 12.5",null,12.5,null,106,135,28.4,19900,12.1,1120,1470,39700,2230,1.1200000000000001,10.6]
[1,2,"355.6 x 16",null,16,null,134,171,22.2,24700,12,1390,1850,49300,2770,1.1200000000000001,8.36]
[1,2,"406.4 x 6",null,6,"#",59.2,75.5,67.7,15100,14.2,745,962,30300,1490,1.28,21.6]
[1,2,"406.4 x 6.3",null,6.3,"#",62.2,79.2,64.5,15800,14.1,780,1010,31700,1560,1.28,20.6]
[1,2,"406.4 x 8",null,8,null,78.599999999999994,100,50.8,19900,14.1,978,1270,39700,1960,1.28,16.3]
[1,2,"406.4 x 10",null,10,null,97.8,125,40.6,24500,14,1210,1570,49000,2410,1.28,13.1]
[1,2,"406.4 x 12",null,12,"#",117,149,33.9,28900,14,1420,1870,57900,2850,1.28,11]
[1,2,"406.4 x 12.5",null,12.5,null,121,155,32.5,30000,13.9,1480,1940,60100,2960,1.28,10.5]
[1,2,"406.4 x 16",null,16,null,154,196,25.4,37400,13.8,1840,2440,74900,3690,1.28,8.31]
[1,2,"457 x 6",null,6,"#",66.7,85,76.2,21600,15.9,946,1220,43200,1890,1.44,21.6]
[1,2,"457 x 6.3",null,6.3,"#",70,89.2,72.5,22700,15.9,991,1280,45300,1980,1.44,20.6]
[1,2,"457 x 8",null,8,null,88.6,113,57.1,28400,15.9,1250,1610,56900,2490,1.44,16.3]
[1,2,"457 x 10",null,10,null,110,140,45.7,35100,15.8,1540,2000,70200,3070,1.44,13.1]
[1,2,"457 x 12",null,12,"#",132,168,38.1,41600,15.7,1820,2380,83100,3640,1.44,10.9]
[1,2,"457 x 12.5",null,12.5,null,137,175,36.6,43100,15.7,1890,2470,86300,3780,1.44,10.5]
[1,2,"457 x 16",null,16,null,174,222,28.6,54000,15.6,2360,3110,108000,4720,1.44,8.2799999999999994]
[1,2,"508 x 6",null,6,"#",74.3,94.6,84.7,29800,17.7,1170,1510,59600,2350,1.6,21.6]
[1,2,"508 x 6.3",null,6.3,"#",77.900000000000006,99.3,80.599999999999994,31200,17.7,1230,1590,62500,2460,1.6,20.5]
[1,2,"508 x 8",null,8,"#",98.6,126,63.5,39300,17.7,1550,2000,78600,3090,1.6,16.2]
[1,2,"508 x 10",null,10,null,123,156,50.8,48500,17.600000000000001,1910,2480,97000,3820,1.6,13]
[1,2,"508 x 12",null,12,"#",147,187,42.3,57500,17.5,2270,2950,115000,4530,1.6,10.9]
[1,2,"508 x 12.5",null,12.5,null,153,195,40.6,59800,17.5,2350,3070,120000,4710,1.6,10.5]
[1,2,"508 x 16",null,16,"#",194,247,31.8,74900,17.399999999999999,2950,3870,150000,5900,1.6,8.24]
[]
[]
[]
[]
[]
[]
[]
[]
[null,null,null,"Table 1.8.1.1"]
[null,null,null,"HOT FINISHED"]
[null,null,null,"CIRCULAR HOLLOW SECTIONS"]
[null,null,null,"Celsius® CHS"]
[null,null,null,"Dimensions and properties"]
[null,null,null,null,"Hot Finished"]
[null,null,"Section",null,null,null,"Mass","Area","Ratio","Second","Radius","Elastic","Plastic","Torsional",null,"Surface"]
[null,null,"Designation",null,null,null,"per","of","for","Moment","of","Modulus","Modulus","Constants",null,"Area"]
[null,null,"Outside","Thickness",null,null,"Metre","Section","Local","of Area","Gyration",null,null,null,null,"Per","Per"]
[null,null,"Diameter",null,null,null,null,null,"Buckling",null,null,null,null,null,null,"Metre","Tonne"]
[null,null,"D","t",null,null,null,"A","D/t","I","r","Z","S","J","C"]
[null,null,"mm","mm",null,null,"kg/m","cm2",null,"cm4","cm","cm3","cm3","cm4","cm3","m2","m2"]
[1,1,"21.3 x 2.6",null,2.6,"#",1.2,1.53,8.19,0.68100000000000005,0.66800000000000004,0.63900000000000001,0.91500000000000004,1.36,1.28,6.7000000000000004E-2,55.9]
[1,1,"21.3 x 2.9",null,2.9,"#",1.32,1.68,7.34,0.72699999999999998,0.65900000000000003,0.68300000000000005,0.99,1.45,1.37,6.7000000000000004E-2,50.9]
[1,2,"21.3 x 3.2",null,3.2,null,1.43,1.82,6.66,0.76800000000000002,0.65,0.72199999999999998,1.06,1.54,1.44,6.7000000000000004E-2,46.9]
[1,1,"26.9 x 2.6",null,2.6,"#",1.56,1.98,10.3,1.48,0.86399999999999999,1.1000000000000001,1.54,2.96,2.2000000000000002,8.5000000000000006E-2,54.6]
[1,1,"26.9 x 2.9",null,2.9,"#",1.72,2.19,9.2799999999999994,1.6,0.85499999999999998,1.19,1.68,3.19,2.38,8.5000000000000006E-2,49.6]
[1,2,"26.9 x 3.2",null,3.2,null,1.87,2.38,8.41,1.7,0.84599999999999997,1.27,1.81,3.41,2.5299999999999998,8.5000000000000006E-2,45.5]
[1,2,"26.9 x 3.6",null,3.6,"#",2.0699999999999998,2.64,7.47,1.83,0.83399999999999996,1.36,1.97,3.66,2.72,8.5000000000000006E-2,41.1]
[1,1,"33.7 x 2.6",null,2.6,"#",1.99,2.54,13,3.09,1.1000000000000001,1.84,2.52,6.19,3.67,0.106,53.1]
[1,1,"33.7 x 2.9",null,2.9,"#",2.2000000000000002,2.81,11.6,3.36,1.0900000000000001,1.99,2.76,6.71,3.98,0.106,48.1]
[1,2,"33.7 x 3.2",null,3.2,null,2.41,3.07,10.5,3.6,1.08,2.14,2.99,7.21,4.28,0.106,44]
[1,2,"33.7 x 3.6",null,3.6,"#",2.67,3.4,9.36,3.91,1.07,2.3199999999999998,3.28,7.82,4.6399999999999997,0.106,39.6]
[1,2,"33.7 x 4",null,4,null,2.93,3.73,8.43,4.1900000000000004,1.06,2.4900000000000002,3.55,8.3800000000000008,4.97,0.106,36.1]
[1,2,"33.7 x 4.5",null,4.5,"#",3.24,4.13,7.49,4.5,1.04,2.67,3.87,9.01,5.35,0.106,32.799999999999997]
[1,2,"33.7 x 5",null,5,"#",3.54,4.51,6.74,4.78,1.03,2.84,4.16,9.57,5.68,0.106,30]
[1,1,"42.4 x 2.6",null,2.6,"#",2.5499999999999998,3.25,16.3,6.46,1.41,3.05,4.12,12.9,6.1,0.13300000000000001,52.1]
[1,1,"42.4 x 2.9",null,2.9,"#",2.82,3.6,14.6,7.06,1.4,3.33,4.53,14.1,6.66,0.13300000000000001,47.1]
[1,2,"42.4 x 3.2",null,3.2,null,3.09,3.94,13.3,7.62,1.39,3.59,4.93,15.2,7.19,0.13300000000000001,43]
[1,2,"42.4 x 3.6",null,3.6,"#",3.44,4.3899999999999997,11.8,8.33,1.38,3.93,5.44,16.7,7.86,0.13300000000000001,38.6]
[1,2,"42.4 x 4",null,4,null,3.79,4.83,10.6,8.99,1.36,4.24,5.92,18,8.48,0.13300000000000001,35.1]
[1,2,"42.4 x 4.5",null,4.5,"#",4.21,5.36,9.42,9.76,1.35,4.5999999999999996,6.49,19.5,9.1999999999999993,0.13300000000000001,31.7]
[1,2,"42.4 x 5",null,5,"#",4.6100000000000003,5.87,8.48,10.5,1.33,4.93,7.04,20.9,9.86,0.13300000000000001,28.9]
[1,1,"48.3 x 2.6",null,2.6,"#",2.93,3.73,18.600000000000001,9.7799999999999994,1.62,4.05,5.44,19.600000000000001,8.1,0.152,51.8]
[1,1,"48.3 x 2.9",null,2.9,"#",3.25,4.1399999999999997,16.7,10.7,1.61,4.43,5.99,21.4,8.86,0.152,46.8]
[1,2,"48.3 x 3.2",null,3.2,null,3.56,4.53,15.1,11.6,1.6,4.8,6.52,23.2,9.59,0.152,42.7]
[1,2,"48.3 x 3.6",null,3.6,"#",3.97,5.0599999999999996,13.4,12.7,1.59,5.26,7.21,25.4,10.5,0.152,38.299999999999997]
[1,2,"48.3 x 4",null,4,null,4.37,5.57,12.1,13.8,1.57,5.7,7.87,27.5,11.4,0.152,34.799999999999997]
[1,2,"48.3 x 4.5",null,4.5,"#",4.8600000000000003,6.19,10.7,15,1.56,6.21,8.66,30,12.4,0.152,31.3]
[1,2,"48.3 x 5",null,5,null,5.34,6.8,9.66,16.2,1.54,6.69,9.42,32.299999999999997,13.4,0.152,28.4]
[1,2,"48.3 x 5.6",null,5.6,"#",5.9,7.51,8.6300000000000008,17.399999999999999,1.52,7.21,10.3,34.799999999999997,14.4,0.152,25.8]
[1,2,"48.3 x 6.3",null,6.3,null,6.53,8.31,7.67,18.7,1.5,7.76,11.2,37.5,15.5,0.152,23.3]
[1,1,"60.3 x 2.6",null,2.6,"#",3.7,4.71,23.2,19.7,2.04,6.52,8.66,39.299999999999997,13,0.189,51]
[1,1,"60.3 x 2.9",null,2.9,"#",4.1100000000000003,5.23,20.8,21.6,2.0299999999999998,7.16,9.56,43.2,14.3,0.189,46.1]
[1,2,"60.3 x 3.2",null,3.2,null,4.51,5.74,18.8,23.5,2.02,7.78,10.4,46.9,15.6,0.189,42]
[1,2,"60.3 x 3.6",null,3.6,"#",5.03,6.41,16.8,25.9,2.0099999999999998,8.58,11.6,51.7,17.2,0.189,37.6]
[1,2,"60.3 x 4",null,4,null,5.55,7.07,15.1,28.2,2,9.34,12.7,56.3,18.7,0.189,34]
[1,2,"60.3 x 4.5",null,4.5,"#",6.19,7.89,13.4,30.9,1.98,10.199999999999999,14,61.8,20.5,0.189,30.4]
[1,2,"60.3 x 5",null,5,null,6.82,8.69,12.1,33.5,1.96,11.1,15.3,67,22.2,0.189,27.8]
[1,2,"60.3 x 5.6",null,5.6,"#",7.55,9.6199999999999992,10.8,36.4,1.94,12.1,16.8,72.7,24.1,0.189,24.9]
[1,2,"60.3 x 6.3",null,6.3,null,8.39,10.7,9.57,39.5,1.92,13.1,18.5,79,26.2,0.189,22.5]
[1,2,"60.3 x 8",null,8,"#",10.3,13.1,7.54,46,1.87,15.3,22.1,92,30.5,0.189,18.3]
[1,1,"76.1 x 2.9",null,2.9,null,5.24,6.67,26.2,44.7,2.59,11.8,15.5,89.5,23.5,0.23899999999999999,45.6]
[1,2,"76.1 x 3.2",null,3.2,null,5.75,7.33,23.8,48.8,2.58,12.8,17,97.6,25.6,0.23899999999999999,41.6]
[1,2,"76.1 x 3.6",null,3.6,"#",6.44,8.1999999999999993,21.1,54,2.57,14.2,18.899999999999999,108,28.4,0.23899999999999999,37]
[1,2,"76.1 x 4",null,4,null,7.11,9.06,19,59.1,2.5499999999999998,15.5,20.8,118,31,0.23899999999999999,33.700000000000003]
[1,2,"76.1 x 4.5",null,4.5,"#",7.95,10.1,16.899999999999999,65.099999999999994,2.54,17.100000000000001,23.1,130,34.200000000000003,0.23899999999999999,30.1]
[1,2,"76.1 x 5",null,5,null,8.77,11.2,15.2,70.900000000000006,2.52,18.600000000000001,25.3,142,37.299999999999997,0.23899999999999999,27.2]
[1,2,"76.1 x 5.6",null,5.6,"#",9.74,12.4,13.6,77.5,2.5,20.399999999999999,27.9,155,40.799999999999997,0.23899999999999999,24.6]
[1,2,"76.1 x 6.3",null,6.3,null,10.8,13.8,12.1,84.8,2.48,22.3,30.8,170,44.6,0.23899999999999999,22]
[1,2,"76.1 x 8",null,8,null,13.4,17.100000000000001,9.51,101,2.42,26.4,37.299999999999997,201,52.9,0.23899999999999999,17.8]
[1,1,"88.9 x 2.9",null,2.9,"#",6.15,7.84,30.7,72.5,3.04,16.3,21.5,145,32.6,0.27900000000000003,45.5]
[1,2,"88.9 x 3.2",null,3.2,"#",6.76,8.6199999999999992,27.8,79.2,3.03,17.8,23.5,158,35.6,0.27900000000000003,41.3]
[1,2,"88.9 x 3.6",null,3.6,"#",7.57,9.65,24.7,87.9,3.02,19.8,26.2,176,39.5,0.27900000000000003,36.799999999999997]
[1,2,"88.9 x 4",null,4,null,8.3800000000000008,10.7,22.2,96.3,3,21.7,28.9,193,43.3,0.27900000000000003,33.200000000000003]
[1,2,"88.9 x 4.5",null,4.5,"#",9.3699999999999992,11.9,19.8,107,2.99,24,32.1,213,47.9,0.27900000000000003,29.9]
[1,2,"88.9 x 5",null,5,null,10.3,13.2,17.8,116,2.97,26.2,35.200000000000003,233,52.4,0.27900000000000003,27]
[1,2,"88.9 x 5.6",null,5.6,"#",11.5,14.7,15.9,128,2.95,28.7,38.9,255,57.5,0.27900000000000003,24.2]
[1,2,"88.9 x 6.3",null,6.3,null,12.8,16.3,14.1,140,2.93,31.5,43.1,280,63.1,0.27900000000000003,21.7]
[1,2,"88.9 x 8",null,8,null,16,20.3,11.1,168,2.87,37.799999999999997,52.5,336,75.599999999999994,0.27900000000000003,17.5]
[1,2,"88.9 x 10",null,10,"#",19.5,24.8,8.89,196,2.81,44.1,62.6,392,88.2,0.27900000000000003,14.3]
[1,2,"101.6 x 3.2",null,3.2,"#",7.77,9.89,31.8,120,3.48,23.6,31,240,47.2,0.31900000000000001,41.2]
[1,2,"101.6 x 3.6",null,3.6,"#",8.6999999999999993,11.1,28.2,133,3.47,26.2,34.6,266,52.5,0.31900000000000001,36.700000000000003]
[1,2,"101.6 x 4",null,4,"#",9.6300000000000008,12.3,25.4,146,3.45,28.8,38.1,293,57.6,0.31900000000000001,33.200000000000003]
[1,2,"101.6 x 4.5",null,4.5,"#",10.8,13.7,22.6,162,3.44,31.9,42.5,324,63.8,0.31900000000000001,29.6]
[1,2,"101.6 x 5",null,5,"#",11.9,15.2,20.3,177,3.42,34.9,46.7,355,69.900000000000006,0.31900000000000001,26.8]
[1,2,"101.6 x 5.6",null,5.6,"#",13.3,16.899999999999999,18.100000000000001,195,3.4,38.4,51.7,390,76.900000000000006,0.31900000000000001,24.1]
[1,2,"101.6 x 6.3",null,6.3,"#",14.8,18.899999999999999,16.100000000000001,215,3.38,42.3,57.3,430,84.7,0.31900000000000001,21.5]
[1,2,"101.6 x 8",null,8,"#",18.5,23.5,12.7,260,3.32,51.1,70.3,519,102,0.31900000000000001,17.3]
[1,2,"101.6 x 10",null,10,"#",22.6,28.8,10.199999999999999,305,3.26,60.1,84.2,611,120,0.31900000000000001,14.1]
[1,2,"114.3 x 3.2",null,3.2,"#",8.77,11.2,35.700000000000003,172,3.93,30.2,39.5,345,60.4,0.35899999999999999,40.9]
[1,2,"114.3 x 3.6",null,3.6,null,9.83,12.5,31.8,192,3.92,33.6,44.1,384,67.2,0.35899999999999999,36.6]
[1,2,"114.3 x 4",null,4,null,10.9,13.9,28.6,211,3.9,36.9,48.7,422,73.900000000000006,0.35899999999999999,33]
[1,2,"114.3 x 4.5",null,4.5,"#",12.2,15.5,25.4,234,3.89,41,54.3,469,82,0.35899999999999999,29.5]
[1,2,"114.3 x 5",null,5,null,13.5,17.2,22.9,257,3.87,45,59.8,514,89.9,0.35899999999999999,26.6]
[1,2,"114.3 x 5.6",null,5.6,"#",15,19.100000000000001,20.399999999999999,283,3.85,49.6,66.2,566,99.1,0.35899999999999999,23.9]
[1,2,"114.3 x 6.3",null,6.3,null,16.8,21.4,18.100000000000001,313,3.82,54.7,73.599999999999994,625,109,0.35899999999999999,21.4]
[1,2,"114.3 x 8",null,8,null,21,26.7,14.3,379,3.77,66.400000000000006,90.6,759,133,0.35899999999999999,17.100000000000001]
[1,2,"114.3 x 10",null,10,"#",25.7,32.799999999999997,11.4,450,3.7,78.7,109,899,157,0.35899999999999999,14]
[1,2,"139.7 x 3.2",null,3.2,"#",10.8,13.7,43.7,320,4.83,45.8,59.6,640,91.6,0.439,40.700000000000003]
[1,2,"139.7 x 3.6",null,3.6,"#",12.1,15.4,38.799999999999997,357,4.8099999999999996,51.1,66.7,713,102,0.439,36.299999999999997]
[1,2,"139.7 x 4",null,4,"#",13.4,17.100000000000001,34.9,393,4.8,56.2,73.7,786,112,0.439,32.799999999999997]
[1,2,"139.7 x 4.5",null,4.5,"#",15,19.100000000000001,31,437,4.78,62.6,82.3,874,125,0.439,29.2]
[1,2,"139.7 x 5",null,5,null,16.600000000000001,21.2,27.9,481,4.7699999999999996,68.8,90.8,961,138,0.439,26.4]
[1,2,"139.7 x 5.6",null,5.6,"#",18.5,23.6,24.9,531,4.75,76.099999999999994,101,1060,152,0.439,23.7]
[1,2,"139.7 x 6.3",null,6.3,null,20.7,26.4,22.2,589,4.72,84.3,112,1180,169,0.439,21.2]
[1,2,"139.7 x 8",null,8,null,26,33.1,17.5,720,4.66,103,139,1440,206,0.439,16.899999999999999]
[1,2,"139.7 x 10",null,10,null,32,40.700000000000003,14,862,4.5999999999999996,123,169,1720,247,0.439,13.7]
[1,2,"139.7 x 12.5",null,12.5,"#",39.200000000000003,50,11.2,1020,4.5199999999999996,146,203,2040,292,0.439,11.2]
[1,2,"168.3 x 5",null,5,null,20.100000000000001,25.7,33.700000000000003,856,5.78,102,133,1710,203,0.52900000000000003,26.3]
[1,2,"168.3 x 5.6",null,5.6,"#",22.5,28.6,30.1,948,5.76,113,148,1900,225,0.52900000000000003,23.5]
[1,2,"168.3 x 6.3",null,6.3,null,25.2,32.1,26.7,1050,5.73,125,165,2110,250,0.52900000000000003,21]
[1,2,"168.3 x 8",null,8,null,31.6,40.299999999999997,21,1300,5.67,154,206,2600,308,0.52900000000000003,16.7]
[1,2,"168.3 x 10",null,10,null,39,49.7,16.8,1560,5.61,186,251,3130,372,0.52900000000000003,13.5]
[1,2,"168.3 x 12.5",null,12.5,null,48,61.2,13.5,1870,5.53,222,304,3740,444,0.52900000000000003,11]
[1,2,"193.7 x 5",null,5,null,23.3,29.6,38.700000000000003,1320,6.67,136,178,2640,273,0.60899999999999999,26.2]
[1,2,"193.7 x 5.6",null,5.6,"#",26,33.1,34.6,1470,6.65,151,198,2930,303,0.60899999999999999,23.4]
[1,2,"193.7 x 6.3",null,6.3,null,29.1,37.1,30.7,1630,6.63,168,221,3260,337,0.60899999999999999,20.9]
[1,2,"193.7 x 8",null,8,null,36.6,46.7,24.2,2020,6.57,208,276,4030,416,0.60899999999999999,16.600000000000001]
[1,2,"193.7 x 10",null,10,null,45.3,57.7,19.399999999999999,2440,6.5,252,338,4880,504,0.60899999999999999,13.5]
[1,2,"193.7 x 12.5",null,12.5,null,55.9,71.2,15.5,2930,6.42,303,411,5870,606,0.60899999999999999,10.9]
[1,2,"193.7 x 16",null,16,"#",70.099999999999994,89.3,12.1,3550,6.31,367,507,7110,734,0.60899999999999999,8.7100000000000009]
[1,2,"219.1 x 4.5",null,4.5,"#",23.8,30.3,48.7,1750,7.59,159,207,3490,319,0.68799999999999994,28.9]
[1,2,"219.1 x 5",null,5,"#",26.4,33.6,43.8,1930,7.57,176,229,3860,352,0.68799999999999994,26.1]
[1,2,"219.1 x 5.6",null,5.6,"#",29.5,37.6,39.1,2140,7.55,195,255,4280,391,0.68799999999999994,23.3]
[1,2,"219.1 x 6.3",null,6.3,null,33.1,42.1,34.799999999999997,2390,7.53,218,285,4770,436,0.68799999999999994,20.8]
[1,2,"219.1 x 8",null,8,null,41.6,53.1,27.4,2960,7.47,270,357,5920,540,0.68799999999999994,16.5]
[1,2,"219.1 x 10",null,10,null,51.6,65.7,21.9,3600,7.4,328,438,7200,657,0.68799999999999994,13.3]
[1,2,"219.1 x 12.5",null,12.5,null,63.7,81.099999999999994,17.5,4350,7.32,397,534,8690,793,0.68799999999999994,10.8]
[1,2,"219.1 x 14.2",null,14.2,"#",71.8,91.4,15.4,4820,7.26,440,597,9640,880,0.68799999999999994,9.56]
[1,2,"219.1 x 16",null,16,null,80.099999999999994,102,13.7,5300,7.2,483,661,10600,967,0.68799999999999994,8.6]
[1,2,"244.5 x 5",null,5,"#",29.5,37.6,48.9,2700,8.4700000000000006,221,287,5400,441,0.76800000000000002,26]
[1,2,"244.5 x 5.6",null,5.6,"#",33,42,43.7,3000,8.4499999999999993,245,320,6000,491,0.76800000000000002,23.3]
[1,2,"244.5 x 6.3",null,6.3,"#",37,47.1,38.799999999999997,3350,8.42,274,358,6690,547,0.76800000000000002,20.7]
[1,2,"244.5 x 8",null,8,"#",46.7,59.4,30.6,4160,8.3699999999999992,340,448,8320,681,0.76800000000000002,16.399999999999999]
[1,2,"244.5 x 10",null,10,"#",57.8,73.7,24.5,5070,8.3000000000000007,415,550,10100,830,0.76800000000000002,13.3]
[1,2,"244.5 x 12.5",null,12.5,null,71.5,91.1,19.600000000000001,6150,8.2100000000000009,503,673,12300,1010,0.76800000000000002,10.8]
[1,2,"244.5 x 14.2",null,14.2,"#",80.599999999999994,103,17.2,6840,8.16,559,754,13700,1120,0.76800000000000002,9.52]
[1,2,"244.5 x 16",null,16,null,90.2,115,15.3,7530,8.1,616,837,15100,1230,0.76800000000000002,8.52]
[1,2,"273 x 5",null,5,"#",33,42.1,54.6,3780,9.48,277,359,7560,554,0.85799999999999998,26]
[1,2,"273 x 5.6",null,5.6,"#",36.9,47,48.8,4210,9.4600000000000009,308,400,8410,616,0.85799999999999998,23.3]
[1,2,"273 x 6.3",null,6.3,"#",41.4,52.8,43.3,4700,9.43,344,448,9390,688,0.85799999999999998,20.7]
[1,2,"273 x 8",null,8,"#",52.3,66.599999999999994,34.1,5850,9.3699999999999992,429,562,11700,857,0.85799999999999998,16.399999999999999]
[1,2,"273 x 10",null,10,null,64.900000000000006,82.6,27.3,7150,9.31,524,692,14300,1050,0.85799999999999998,13.2]
[1,2,"273 x 12.5",null,12.5,null,80.3,102,21.8,8700,9.2200000000000006,637,849,17400,1270,0.85799999999999998,10.7]
[1,2,"273 x 14.2",null,14.2,"#",90.6,115,19.2,9700,9.16,710,952,19400,1420,0.85799999999999998,9.44]
[1,2,"273 x 16",null,16,null,101,129,17.100000000000001,10700,9.1,784,1060,21400,1570,0.85799999999999998,8.4600000000000009]
[1,2,"323.9 x 5",null,5,"#",39.299999999999997,50.1,64.8,6370,11.3,393,509,12700,787,1.02,25.9]
[1,2,"323.9 x 5.6",null,5.6,"#",44,56,57.8,7090,11.3,438,567,14200,876,1.02,23.2]
[1,2,"323.9 x 6.3",null,6.3,"#",49.3,62.9,51.4,7930,11.2,490,636,15900,979,1.02,20.7]
[1,2,"323.9 x 8",null,8,"#",62.3,79.400000000000006,40.5,9910,11.2,612,799,19800,1220,1.02,16.3]
[1,2,"323.9 x 10",null,10,null,77.400000000000006,98.6,32.4,12200,11.1,751,986,24300,1500,1.02,13.2]
[1,2,"323.9 x 12.5",null,12.5,null,96,122,25.9,14800,11,917,1210,29700,1830,1.02,10.6]
[1,2,"323.9 x 14.2",null,14.2,"#",108,138,22.8,16600,11,1030,1360,33200,2050,1.02,9.4]
[1,2,"323.9 x 16",null,16,null,121,155,20.2,18400,10.9,1140,1520,36800,2270,1.02,8.39]
[1,2,"355.6 x 6.3",null,6.3,"#",54.3,69.099999999999994,56.4,10500,12.4,593,769,21100,1190,1.1200000000000001,20.6]
[1,2,"355.6 x 8",null,8,"#",68.599999999999994,87.4,44.5,13200,12.3,742,967,26400,1490,1.1200000000000001,16.399999999999999]
[1,2,"355.6 x 10",null,10,"#",85.2,109,35.6,16200,12.2,912,1200,32400,1830,1.1200000000000001,13.1]
[1,2,"355.6 x 12.5",null,12.5,"#",106,135,28.4,19900,12.1,1120,1470,39700,2230,1.1200000000000001,10.6]
[1,2,"355.6 x 14.2",null,14.2,"#",120,152,25,22200,12.1,1250,1660,44500,2500,1.1200000000000001,9.36]
[1,2,"355.6 x 16",null,16,null,134,171,22.2,24700,12,1390,1850,49300,2770,1.1200000000000001,8.36]
[1,2,"406.4 x 6.3",null,6.3,"#",62.2,79.2,64.5,15800,14.1,780,1010,31700,1560,1.28,20.6]
[1,2,"406.4 x 8",null,8,"#",78.599999999999994,100,50.8,19900,14.1,978,1270,39700,1960,1.28,16.3]
[1,2,"406.4 x 10",null,10,null,97.8,125,40.6,24500,14,1210,1570,49000,2410,1.28,13.1]
[1,2,"406.4 x 12.5",null,12.5,"#",121,155,32.5,30000,13.9,1480,1940,60100,2960,1.28,10.5]
[1,2,"406.4 x 14.2",null,14.2,"#",137,175,28.6,33700,13.9,1660,2190,67400,3320,1.28,9.32]
[1,2,"406.4 x 16",null,16,null,154,196,25.4,37400,13.8,1840,2440,74900,3690,1.28,8.31]
[1,2,"457 x 6.3",null,6.3,"#",70,89.2,72.5,22700,15.9,991,1280,45300,1980,1.44,20.6]
[1,2,"457 x 8",null,8,"#",88.6,113,57.1,28400,15.9,1250,1610,56900,2490,1.44,16.3]
[1,2,"457 x 10",null,10,null,110,140,45.7,35100,15.8,1540,2000,70200,3070,1.44,13.1]
[1,2,"457 x 12.5",null,12.5,"#",137,175,36.6,43100,15.7,1890,2470,86300,3780,1.44,10.5]
[1,2,"457 x 14.2",null,14.2,"#",155,198,32.200000000000003,48500,15.7,2120,2790,96900,4240,1.44,9.2899999999999991]
[1,2,"457 x 16",null,16,null,174,222,28.6,54000,15.6,2360,3110,108000,4720,1.44,8.2799999999999994]
[1,2,"508 x 6.3",null,6.3,"#",77.900000000000006,99.3,80.599999999999994,31200,17.7,1230,1590,62500,2460,1.6,20.5]
[1,2,"508 x 8",null,8,"#",98.6,126,63.5,39300,17.7,1550,2000,78600,3090,1.6,16.2]
[1,2,"508 x 10",null,10,"#",123,156,50.8,48500,17.600000000000001,1910,2480,97000,3820,1.6,13]
[1,2,"508 x 12.5",null,12.5,null,153,195,40.6,59800,17.5,2350,3070,120000,4710,1.6,10.5]
[1,2,"508 x 14.2",null,14.2,"#",173,220,35.799999999999997,67200,17.5,2650,3460,134000,5290,1.6,9.25]
[1,2,"508 x 16",null,16,null,194,247,31.8,74900,17.399999999999999,2950,3870,150000,5900,1.6,8.24]
[]
[]
[]
[]
[]
[]
[]
[null,null,null,"Table 1.8.6.1"]
[null,null,null,"COLD FORMED"]
[null,null,null,"SQUARE HOLLOW SECTIONS"]
[null,null,null,"Hybox® SHS"]
[null,null,null,"Dimensions and properties"]
[null,null,null,null,"Cold Formed"]
[null,null,"Section",null,null,null,"Mass","Area","Ratio","Second","Radius","Elastic","Plastic","Torsional",null,"Surface"]
[null,null,"Designation",null,null,null,"per","of","for","Moment","of","Modulus","Modulus","Constants",null,"Area"]
[null,null,"Size","Thickness",null,null,"Metre","Section","Local","of Area","Gyration",null,null,null,null,"Per","Per"]
[null,null,null,null,null,null,null,null,"Buckling",null,null,null,null,null,null,"Metre","Tonne"]
[null,null,"D x D","t",null,null,null,"A","d/t (1)","I","r","Z","S","J","C"]
[null,null,"mm","mm",null,null,"kg/m","cm2",null,"cm4","cm","cm3","cm3","cm4","cm3","m2","m2"]
[1,1,"25 x 25 x 2",null,2,"#",1.36,1.74,9.5,1.48,0.92400000000000004,1.19,1.47,2.5299999999999998,1.8,9.2999999999999999E-2,68.2,null,9.5]
[1,1,"25 x 25 x 2.5",null,2.5,null,1.64,2.09,7,1.69,0.89900000000000002,1.35,1.71,2.97,2.0699999999999998,9.0999999999999998E-2,55.5,null,7]
[1,1,"30 x 30 x 2",null,2,"#",1.68,2.14,12,2.72,1.1299999999999999,1.81,2.21,4.54,2.75,0.113,67.3,null,12]
[1,1,"30 x 30 x 2.5",null,2.5,"#",2.0299999999999998,2.59,9,3.16,1.1000000000000001,2.1,2.61,5.4,3.2,0.111,54.6,null,9]
[1,2,"30 x 30 x 3",null,3,null,2.36,3.01,7,3.5,1.08,2.34,2.96,6.15,3.58,0.11,46.5,null,7]
[1,1,"40 x 40 x 2",null,2,"#",2.31,2.94,17,6.94,1.54,3.47,4.13,11.3,5.23,0.153,66.400000000000006,null,17]
[1,1,"40 x 40 x 2.5",null,2.5,null,2.82,3.59,13,8.2200000000000006,1.51,4.1100000000000003,4.97,13.6,6.21,0.151,53.6,null,13]
[1,2,"40 x 40 x 3",null,3,null,3.3,4.21,10.3,9.32,1.49,4.66,5.72,15.8,7.07,0.15,45.5,null,10.3]
[1,2,"40 x 40 x 4",null,4,null,4.2,5.35,7,11.1,1.44,5.54,7.01,19.399999999999999,8.48,0.14599999999999999,34.700000000000003,null,7]
[1,1,"50 x 50 x 2.5",null,2.5,null,3.6,4.59,17,16.899999999999999,1.92,6.78,8.07,27.5,10.199999999999999,0.191,53.1,null,17]
[1,2,"50 x 50 x 3",null,3,null,4.25,5.41,13.7,19.5,1.9,7.79,9.39,32.1,11.8,0.19,44.8,null,13.7]
[1,2,"50 x 50 x 4",null,4,null,5.45,6.95,9.5,23.7,1.85,9.49,11.7,40.4,14.4,0.186,34,null,9.5]
[1,2,"50 x 50 x 5",null,5,null,6.56,8.36,7,27,1.8,10.8,13.7,47.5,16.600000000000001,0.183,27.8,null,7]
[1,2,"60 x 60 x 3",null,3,null,5.19,6.61,17,35.1,2.31,11.7,14,57.1,17.7,0.23,44.4,null,17]
[1,2,"60 x 60 x 4",null,4,null,6.71,8.5500000000000007,12,43.6,2.2599999999999998,14.5,17.600000000000001,72.599999999999994,22,0.22600000000000001,33.700000000000003,null,12]
[1,2,"60 x 60 x 5",null,5,null,8.1300000000000008,10.4,9,50.5,2.21,16.8,20.9,86.4,25.6,0.223,27.4,null,9]
[1,2,"60 x 60 x 6",null,6,"#",9.4499999999999993,12,7,56.1,2.16,18.7,23.7,98.4,28.6,0.219,23.2,null,7]
[1,2,"70 x 70 x 3",null,3,null,6.13,7.81,20.3,57.5,2.71,16.399999999999999,19.399999999999999,92.4,24.7,0.27,44,null,20.3]
[1,2,"70 x 70 x 3.5",null,3.5,null,7.06,8.99,17,65.099999999999994,2.69,18.600000000000001,22.2,106,28,0.26800000000000002,38.1,null,17]
[1,2,"70 x 70 x 4",null,4,null,7.97,10.1,14.5,72.099999999999994,2.67,20.6,24.8,119,31.1,0.26600000000000001,33.5,null,14.5]
[1,2,"70 x 70 x 5",null,5,null,9.6999999999999993,12.4,11,84.6,2.62,24.2,29.6,142,36.700000000000003,0.26300000000000001,27.1,null,11]
[1,2,"70 x 70 x 6",null,6,"#",11.3,14.4,8.67,95.2,2.57,27.2,33.799999999999997,163,41.4,0.25900000000000001,22.9,null,8.67]
[1,2,"80 x 80 x 3",null,3,null,7.07,9.01,23.7,87.8,3.12,22,25.8,140,33,0.31,43.7,null,23.7]
[1,2,"80 x 80 x 3.5",null,3.5,null,8.16,10.4,19.899999999999999,99.8,3.1,25,29.5,161,37.6,0.308,37.9,null,19.899999999999999]
[1,2,"80 x 80 x 4",null,4,null,9.2200000000000006,11.7,17,111,3.07,27.8,33.1,180,41.8,0.30599999999999999,33,null,17]
[1,2,"80 x 80 x 5",null,5,null,11.3,14.4,13,131,3.03,32.9,39.700000000000003,218,49.7,0.30299999999999999,26.9,null,13]
[1,2,"80 x 80 x 6",null,6,null,13.2,16.8,10.3,149,2.98,37.299999999999997,45.8,252,56.6,0.29899999999999999,22.6,null,10.3]
[1,2,"90 x 90 x 3",null,3,null,8.01,10.199999999999999,27,127,3.53,28.3,33,201,42.5,0.35,43.8,null,27]
[1,2,"90 x 90 x 3.5",null,3.5,null,9.26,11.8,22.7,145,3.51,32.200000000000003,37.9,232,48.5,0.34799999999999998,37.6,null,22.7]
[1,2,"90 x 90 x 4",null,4,null,10.5,13.3,19.5,162,3.48,36,42.6,261,54.2,0.34599999999999997,33,null,19.5]
[1,2,"90 x 90 x 5",null,5,null,12.8,16.399999999999999,15,193,3.43,42.9,51.4,316,64.7,0.34300000000000003,26.7,null,15]
[1,2,"90 x 90 x 6",null,6,"#",15.1,19.2,12,220,3.39,49,59.5,368,74.2,0.33900000000000002,22.4,null,12]
[1,2,"100 x 100 x 3",null,3,null,8.9600000000000009,11.4,30.3,177,3.94,35.4,41.2,279,53.2,0.39,43.7,null,30.3]
[1,2,"100 x 100 x 4",null,4,null,11.7,14.9,22,226,3.89,45.3,53.3,362,68.099999999999994,0.38600000000000001,32.9,null,22]
[1,2,"100 x 100 x 5",null,5,null,14.4,18.399999999999999,17,271,3.84,54.2,64.599999999999994,441,81.7,0.38300000000000001,26.6,null,17]
[1,2,"100 x 100 x 6",null,6,null,17,21.6,13.7,311,3.79,62.3,75.099999999999994,514,94.1,0.379,22.3,null,13.7]
[1,2,"100 x 100 x 8",null,8,null,21.4,27.2,9.5,366,3.67,73.2,91.1,645,114,0.36599999999999999,17.100000000000001,null,9.5]
[1,2,"120 x 120 x 3",null,3,"#",10.8,13.8,37,312,4.76,52.1,60.2,488,78.2,0.47,43.4,null,37]
[1,2,"120 x 120 x 4",null,4,null,14.2,18.100000000000001,27,402,4.71,67,78.3,637,101,0.46600000000000003,32.700000000000003,null,27]
[1,2,"120 x 120 x 5",null,5,null,17.5,22.4,21,485,4.66,80.900000000000006,95.4,778,122,0.46300000000000002,26.4,null,21]
[1,2,"120 x 120 x 6",null,6,null,20.7,26.4,17,562,4.6100000000000003,93.7,112,913,141,0.45900000000000002,22.1,null,17]
[1,2,"120 x 120 x 8",null,8,null,26.4,33.6,12,677,4.49,113,138,1160,175,0.44600000000000001,16.899999999999999,null,12]
[1,2,"120 x 120 x 10",null,10,null,31.8,40.6,9,777,4.38,129,162,1380,203,0.437,13.7,null,9]
[1,2,"140 x 140 x 4",null,4,null,16.8,21.3,32,652,5.52,93.1,108,1020,140,0.54600000000000004,32.6,null,32]
[1,2,"140 x 140 x 5",null,5,null,20.7,26.4,25,791,5.48,113,132,1260,170,0.54300000000000004,26.2,null,25]
[1,2,"140 x 140 x 6",null,6,null,24.5,31.2,20.3,920,5.43,131,155,1480,198,0.53900000000000003,22,null,20.3]
[1,2,"140 x 140 x 8",null,8,null,31.4,40,14.5,1130,5.3,161,194,1900,248,0.52600000000000002,16.7,null,14.5]
[1,2,"140 x 140 x 10",null,10,null,38.1,48.6,11,1310,5.2,187,230,2270,291,0.51700000000000002,13.5,null,11]
[1,2,"150 x 150 x 4",null,4,"#",18,22.9,34.5,808,5.93,108,125,1270,162,0.58599999999999997,32.5,null,34.5]
[1,2,"150 x 150 x 5",null,5,null,22.3,28.4,27,982,5.89,131,153,1550,197,0.58299999999999996,26.2,null,27]
[1,2,"150 x 150 x 6",null,6,null,26.4,33.6,22,1150,5.84,153,180,1830,230,0.57899999999999996,21.9,null,22]
[1,2,"150 x 150 x 8",null,8,null,33.9,43.2,15.8,1410,5.71,188,226,2360,289,0.56599999999999995,16.7,null,15.8]
[1,2,"150 x 150 x 10",null,10,null,41.3,52.6,12,1650,5.61,220,269,2840,341,0.55700000000000005,13.5,null,12]
[1,2,"160 x 160 x 4",null,4,"#",19.3,24.5,37,987,6.34,123,143,1540,185,0.626,32.5,null,37]
[1,2,"160 x 160 x 5",null,5,null,23.8,30.4,29,1200,6.29,150,175,1900,226,0.623,26.2,null,29]
[1,2,"160 x 160 x 6",null,6,null,28.3,36,23.7,1410,6.25,176,206,2240,264,0.61899999999999999,21.9,null,23.7]
[1,2,"160 x 160 x 8",null,8,null,36.5,46.4,17,1740,6.12,218,260,2900,334,0.60599999999999998,16.600000000000001,null,17]
[1,2,"160 x 160 x 10",null,10,null,44.4,56.6,13,2050,6.02,256,311,3490,395,0.59699999999999998,13.4,null,13]
[1,2,"180 x 180 x 5",null,5,null,27,34.4,33,1740,7.11,193,224,2720,290,0.70299999999999996,26.1,null,33]
[1,2,"180 x 180 x 6",null,6,null,32.1,40.799999999999997,27,2040,7.06,226,264,3220,340,0.69899999999999995,21.8,null,27]
[1,2,"180 x 180 x 6.3",null,6.3,"#",33.299999999999997,42.4,25.6,2100,7.03,233,273,3380,354,0.69299999999999995,20.8,null,25.6]
[1,2,"180 x 180 x 8",null,8,null,41.5,52.8,19.5,2550,6.94,283,336,4190,432,0.68600000000000005,16.5,null,19.5]
[1,2,"180 x 180 x 10",null,10,null,50.7,64.599999999999994,15,3020,6.84,335,404,5070,515,0.67700000000000005,13.3,null,15]
[1,2,"180 x 180 x 12",null,12,"#",58.5,74.5,12,3320,6.68,369,454,5870,584,0.65800000000000003,11.3,null,12]
[1,2,"180 x 180 x 12.5",null,12.5,null,60.5,77,11.4,3410,6.65,378,467,6050,600,0.65600000000000003,10.8,null,11.4]
[1,2,"200 x 200 x 5",null,5,null,30.1,38.4,37,2410,7.93,241,279,3760,362,0.78300000000000003,26,null,37]
[1,2,"200 x 200 x 6",null,6,null,35.799999999999997,45.6,30.3,2830,7.88,283,330,4460,426,0.77900000000000003,21.7,null,30.3]
[1,2,"200 x 200 x 6.3",null,6.3,"#",37.200000000000003,47.4,28.7,2920,7.85,292,341,4680,444,0.77300000000000002,20.7,null,28.7]
[1,2,"200 x 200 x 8",null,8,null,46.5,59.2,22,3570,7.76,357,421,5820,544,0.76600000000000001,16.5,null,22]
[1,2,"200 x 200 x 10",null,10,null,57,72.599999999999994,17,4250,7.65,425,508,7070,651,0.75700000000000001,13.3,null,17]
[1,2,"200 x 200 x 12",null,12,"#",66,84.1,13.7,4730,7.5,473,576,8230,743,0.73799999999999999,11.2,null,13.7]
[1,2,"200 x 200 x 12.5",null,12.5,null,68.3,87,13,4860,7.47,486,594,8500,765,0.73599999999999999,10.7,null,13]
[1,2,"250 x 250 x 6",null,6,null,45.2,57.6,38.700000000000003,5670,9.92,454,524,8840,681,0.97899999999999998,21.6,null,38.700000000000003]
[1,2,"250 x 250 x 6.3",null,6.3,"#",47.1,60,36.700000000000003,5870,9.89,470,544,9290,711,0.97299999999999998,20.6,null,36.700000000000003]
[1,2,"250 x 250 x 8",null,8,null,59.1,75.2,28.3,7230,9.8000000000000007,578,676,11600,878,0.96599999999999997,16.3,null,28.3]
[1,2,"250 x 250 x 10",null,10,null,72.7,92.6,22,8710,9.6999999999999993,697,822,14200,1060,0.95699999999999996,13.2,null,22]
[1,2,"250 x 250 x 12",null,12,"#",84.8,108,17.8,9860,9.5500000000000007,789,944,16700,1230,0.93799999999999994,11.1,null,17.8]
[1,2,"250 x 250 x 12.5",null,12.5,null,88,112,17,10200,9.52,813,975,17300,1270,0.93600000000000005,10.7,null,17]
[1,2,"300 x 300 x 6",null,6,null,54.7,69.599999999999994,47,9960,12,664,764,15400,997,1.18,21.6,null,47]
[1,2,"300 x 300 x 6.3",null,6.3,"#",57,72.599999999999994,44.6,10300,11.9,689,795,16200,1040,1.17,20.5,null,44.6]
[1,2,"300 x 300 x 8",null,8,null,71.599999999999994,91.2,34.5,12800,11.8,853,991,20300,1290,1.17,16.399999999999999,null,34.5]
[1,2,"300 x 300 x 10",null,10,null,88.4,113,27,15500,11.7,1040,1210,25000,1570,1.1599999999999999,13.1,null,27]
[1,2,"300 x 300 x 12",null,12,"#",104,132,22,17800,11.6,1180,1400,29500,1830,1.1399999999999999,11,null,22]
[1,2,"300 x 300 x 12.5",null,12.5,null,108,137,21,18300,11.6,1220,1450,30600,1890,1.1399999999999999,10.6,null,21]
[1,2,"350 x 350 x 6",null,6,"#",64.099999999999994,81.599999999999994,55.3,16000,14,915,1050,24700,1370,1.38,21.5,null,55.3]
[1,2,"350 x 350 x 6.3",null,6.3,"#",66.900000000000006,85.2,52.6,16600,14,951,1090,25900,1440,1.37,20.399999999999999,null,52.6]
[1,2,"350 x 350 x 8",null,8,null,84.2,107,40.799999999999997,20700,13.9,1180,1370,32600,1790,1.37,16.3,null,40.799999999999997]
[1,2,"350 x 350 x 10",null,10,null,104,133,32,25200,13.8,1440,1680,40100,2180,1.36,13.1,null,32]
[1,2,"350 x 350 x 12",null,12,"#",123,156,26.2,29100,13.6,1660,1950,47600,2550,1.34,10.9,null,26.2]
[1,2,"350 x 350 x 12.5",null,12.5,null,127,162,25,30000,13.6,1720,2020,49400,2640,1.34,10.5,null,25]
[1,2,"400 x 400 x 6",null,6,"#",73.5,93.6,63.7,24100,16,1210,1380,37000,1810,1.58,21.5,null,63.7]
[1,2,"400 x 400 x 6.3",null,6.3,"#",76.8,97.8,60.5,25100,16,1260,1440,38900,1890,1.57,20.399999999999999,null,60.5]
[1,2,"400 x 400 x 8",null,8,null,96.7,123,47,31300,15.9,1560,1800,48900,2360,1.57,16.2,null,47]
[1,2,"400 x 400 x 10",null,10,null,120,153,37,38200,15.8,1910,2210,60400,2890,1.56,13,null,37]
[1,2,"400 x 400 x 12",null,12,"#",141,180,30.3,44300,15.7,2220,2590,71800,3400,1.54,10.9,null,30.3]
[1,2,"400 x 400 x 12.5",null,12.5,null,147,187,29,45900,15.7,2290,2680,74600,3520,1.54,10.5,null,29]
[]
[]
[]
[]
[]
[]
[]
[]
[null,null,null,"Table 1.8.7.1"]
[null,null,null,"COLD FORMED"]
[null,null,null,"RECTANGULAR HOLLOW SECTIONS"]
[null,null,null,"Hybox® RHS"]
[null,null,null,"Dimensions and properties"]
[null,null,null,null,"Cold Formed"]
[null,null,"Section",null,null,null,"Mass","Area","Ratios for",null,"Second Moment",null,"Radius of",null,"Elastic",null,"Plastic",null,"Torsional",null,"Surface"]
[null,null,"Designation",null,null,null,"per","of","Local Buckling",null,"of Area",null,"Gyration",null,"Modulus",null,"Modulus",null,"Constants",null,"Area"]
[null,null,"Size","Thickness",null,null,"Metre","Section",null,null,"Axis","Axis","Axis","Axis","Axis","Axis","Axis","Axis",null,null,"Per","Per"]
[null,null,null,null,null,null,null,null,null,null,"x-x","y-y","x-x","y-y","x-x","y-y","x-x","y-y",null,null,"Metre","Tonne"]
[null,null,"D x B","t",null,null,null,"A","d/t (1)","b/t (1)",null,null,null,null,null,null,null,null,"J","C"]
[null,null,"mm","mm",null,null,"kg/m","cm2",null,null,"cm4","cm4","cm","cm","cm3","cm3","cm3","cm3","cm4","cm3","m2","m2"]
[1,1,"50 x 25 x 2",null,2,"#",2.15,2.74,22,9.5,8.3800000000000008,2.81,1.75,1.01,3.35,2.25,4.26,2.62,7.06,3.92,0.14299999999999999,66.5,null,22,9.5]
[1,1,"50 x 25 x 2.5",null,2.5,null,2.62,3.34,17,7,9.89,3.28,1.72,0.99099999999999999,3.95,2.62,5.1100000000000003,3.12,8.43,4.5999999999999996,0.14099999999999999,53.9,null,17,7]
[1,2,"50 x 25 x 3",null,3,null,3.07,3.91,13.7,5.33,11.2,3.67,1.69,0.96899999999999997,4.47,2.93,5.86,3.56,9.64,5.18,0.14000000000000001,45.6,null,13.7,5.33]
[1,1,"50 x 30 x 2",null,2,"#",2.31,2.94,22,12,9.5399999999999991,4.29,1.8,1.21,3.81,2.86,4.74,3.33,9.77,4.84,0.153,66.400000000000006,null,22,12]
[1,1,"50 x 30 x 2.5",null,2.5,null,2.82,3.59,17,9,11.3,5.05,1.77,1.19,4.5199999999999996,3.37,5.7,3.98,11.7,5.72,0.151,53.6,null,17,9]
[1,2,"50 x 30 x 3",null,3,null,3.3,4.21,13.7,7,12.8,5.7,1.75,1.1599999999999999,5.13,3.8,6.57,4.58,13.5,6.49,0.15,45.5,null,13.7,7]
[1,2,"50 x 30 x 4",null,4,null,4.2,5.35,9.5,4.5,15.3,6.69,1.69,1.1200000000000001,6.1,4.46,8.0500000000000007,5.58,16.5,7.71,0.14599999999999999,34.700000000000003,null,9.5,4.5]
[1,1,"60 x 40 x 2.5",null,2.5,"#",3.6,4.59,21,13,22.1,11.7,2.19,1.6,7.36,5.87,9.06,6.84,25.1,9.7200000000000006,0.191,53.1,null,21,13]
[1,2,"60 x 40 x 3",null,3,null,4.25,5.41,17,10.3,25.4,13.4,2.17,1.58,8.4600000000000009,6.72,10.5,7.94,29.3,11.2,0.19,44.8,null,17,10.3]
[1,2,"60 x 40 x 4",null,4,null,5.45,6.95,12,7,31,16.3,2.11,1.53,10.3,8.14,13.2,9.89,36.700000000000003,13.7,0.186,34,null,12,7]
[1,2,"60 x 40 x 5",null,5,null,6.56,8.36,9,5,35.299999999999997,18.399999999999999,2.06,1.48,11.8,9.2100000000000009,15.4,11.5,42.8,15.6,0.183,27.8,null,9,5]
[1,2,"70 x 40 x 3",null,3,null,4.72,6.01,20.3,10.3,37.299999999999997,15.5,2.4900000000000002,1.61,10.7,7.75,13.4,9.0500000000000007,36.5,13.2,0.21,44.5,null,20.3,10.3]
[1,2,"70 x 40 x 4",null,4,null,6.08,7.75,14.5,7,46,18.899999999999999,2.44,1.56,13.1,9.44,16.8,11.3,45.8,16.2,0.20599999999999999,33.799999999999997,null,14.5,7]
[1,2,"70 x 40 x 5",null,5,null,7.34,9.36,11,5,52.9,21.5,2.38,1.52,15.1,10.8,19.8,13.3,53.8,18.7,0.20300000000000001,27.6,null,11,5]
[1,2,"70 x 50 x 3",null,3,"#",5.19,6.61,20.3,13.7,44.1,26.1,2.58,1.99,12.6,10.4,15.4,12.2,53.6,17.100000000000001,0.23,44.4,null,20.3,13.7]
[1,2,"70 x 50 x 4",null,4,null,6.71,8.5500000000000007,14.5,9.5,54.7,32.200000000000003,2.5299999999999998,1.94,15.6,12.9,19.5,15.4,68.099999999999994,21.2,0.22600000000000001,33.700000000000003,null,14.5,9.5]
[1,2,"70 x 50 x 5",null,5,null,8.1300000000000008,10.4,11,7,63.5,37.200000000000003,2.48,1.9,18.100000000000001,14.9,23.1,18.2,80.8,24.6,0.223,27.4,null,11,7]
[1,2,"80 x 40 x 3",null,3,null,5.19,6.61,23.7,10.3,52.3,17.600000000000001,2.81,1.63,13.1,8.7799999999999994,16.5,10.199999999999999,43.9,15.3,0.23,44.4,null,23.7,10.3]
[1,2,"80 x 40 x 4",null,4,null,6.71,8.5500000000000007,17,7,64.8,21.5,2.75,1.59,16.2,10.7,20.9,12.8,55.2,18.8,0.22600000000000001,33.700000000000003,null,17,7]
[1,2,"80 x 40 x 5",null,5,null,8.1300000000000008,10.4,13,5,75.099999999999994,24.6,2.69,1.54,18.8,12.3,24.7,15,65,21.7,0.223,27.4,null,13,5]
[1,2,"80 x 50 x 3",null,3,null,5.66,7.21,23.7,13.7,61.1,29.4,2.91,2.02,15.3,11.8,18.8,13.6,65,19.7,0.25,44.3,null,23.7,13.7]
[1,2,"80 x 50 x 4",null,4,null,7.34,9.35,17,9.5,76.400000000000006,36.5,2.86,1.98,19.100000000000001,14.6,24,17.2,82.7,24.6,0.246,33.5,null,17,9.5]
[1,2,"80 x 50 x 5",null,5,null,8.91,11.4,13,7,89.2,42.3,2.8,1.93,22.3,16.899999999999999,28.5,20.5,98.4,28.7,0.24299999999999999,27.2,null,13,7]
[1,2,"80 x 60 x 3",null,3,null,6.13,7.81,23.7,17,70,44.9,3,2.4,17.5,15,21.2,17.399999999999999,88.3,24.1,0.27,44,null,23.7,17]
[1,2,"80 x 60 x 3.5",null,3.5,null,7.06,8.99,19.899999999999999,14.1,79.3,50.7,2.97,2.37,19.8,16.899999999999999,24.1,19.8,101,27.3,0.26800000000000002,38.1,null,19.899999999999999,14.1]
[1,2,"80 x 60 x 4",null,4,null,7.97,10.1,17,12,87.9,56.1,2.94,2.35,22,18.7,27,22.1,113,30.3,0.26600000000000001,33.5,null,17,12]
[1,2,"80 x 60 x 5",null,5,null,9.6999999999999993,12.4,13,9,103,65.7,2.89,2.31,25.8,21.9,32.200000000000003,26.4,136,35.700000000000003,0.26300000000000001,27.1,null,13,9]
[1,2,"90 x 50 x 3",null,3,"#",6.13,7.81,27,13.7,81.900000000000006,32.700000000000003,3.24,2.0499999999999998,18.2,13.1,22.6,15,76.7,22.4,0.27,44,null,27,13.7]
[1,2,"90 x 50 x 4",null,4,"#",7.97,10.1,19.5,9.5,103,40.700000000000003,3.18,2,22.8,16.3,28.8,19.100000000000001,97.7,28,0.26600000000000001,33.5,null,19.5,9.5]
[1,2,"90 x 50 x 5",null,5,null,9.6999999999999993,12.4,15,7,121,47.4,3.12,1.96,26.8,18.899999999999999,34.4,22.7,116,32.700000000000003,0.26300000000000001,27.1,null,15,7]
[1,2,"100 x 40 x 3",null,3,null,6.13,7.81,30.3,10.3,92.3,21.7,3.44,1.67,18.5,10.8,23.7,12.4,59,19.399999999999999,0.27,44,null,30.3,10.3]
[1,2,"100 x 40 x 4",null,4,null,7.97,10.1,22,7,116,26.7,3.38,1.62,23.1,13.3,30.3,15.7,74.5,24,0.26600000000000001,33.5,null,22,7]
[1,2,"100 x 40 x 5",null,5,"#",9.6999999999999993,12.4,17,5,136,30.8,3.31,1.58,27.1,15.4,36.1,18.5,87.9,27.9,0.26300000000000001,27.1,null,17,5]
[1,2,"100 x 50 x 3",null,3,null,6.6,8.41,30.3,13.7,106,36.1,3.56,2.0699999999999998,21.3,14.4,26.7,16.399999999999999,88.6,25,0.28999999999999998,44.1,null,30.3,13.7]
[1,2,"100 x 50 x 4",null,4,null,8.59,10.9,22,9.5,134,44.9,3.5,2.0299999999999998,26.8,18,34.1,20.9,113,31.3,0.28599999999999998,33.200000000000003,null,22,9.5]
[1,2,"100 x 50 x 5",null,5,null,10.5,13.4,17,7,158,52.5,3.44,1.98,31.6,21,40.799999999999997,25,135,36.799999999999997,0.28299999999999997,27,null,17,7]
[1,2,"100 x 50 x 6",null,6,null,12.3,15.6,13.7,5.33,179,58.7,3.38,1.94,35.799999999999997,23.5,46.9,28.5,154,41.4,0.27900000000000003,22.7,null,13.7,5.33]
[1,2,"100 x 60 x 3",null,3,null,7.07,9.01,30.3,17,121,54.6,3.66,2.46,24.1,18.2,29.6,20.8,122,30.6,0.31,43.7,null,30.3,17]
[1,2,"100 x 60 x 3.5",null,3.5,null,8.16,10.4,25.6,14.1,137,61.9,3.63,2.44,27.4,20.6,33.799999999999997,23.8,139,34.799999999999997,0.308,37.9,null,25.6,14.1]
[1,2,"100 x 60 x 4",null,4,null,9.2200000000000006,11.7,22,12,153,68.7,3.6,2.42,30.5,22.9,37.9,26.6,156,38.700000000000003,0.30599999999999999,33,null,22,12]
[1,2,"100 x 60 x 5",null,5,null,11.3,14.4,17,9,181,80.8,3.55,2.37,36.200000000000003,26.9,45.6,31.9,188,45.8,0.30299999999999999,26.9,null,17,9]
[1,2,"100 x 60 x 6",null,6,null,13.2,16.8,13.7,7,205,91.2,3.49,2.33,41.1,30.4,52.5,36.6,216,51.9,0.29899999999999999,22.6,null,13.7,7]
[1,2,"100 x 80 x 3",null,3,"#",8.01,10.199999999999999,30.3,23.7,149,106,3.82,3.22,29.8,26.4,35.4,30.4,196,41.9,0.35,43.8,null,30.3,23.7]
[1,2,"100 x 80 x 4",null,4,null,10.5,13.3,22,17,189,134,3.77,3.17,37.9,33.5,45.6,39.200000000000003,254,53.4,0.34599999999999997,33,null,22,17]
[1,2,"100 x 80 x 5",null,5,null,12.8,16.399999999999999,17,13,226,160,3.72,3.12,45.2,39.9,55.1,47.2,308,63.7,0.34300000000000003,26.7,null,17,13]
[1,2,"100 x 80 x 6",null,6,null,15.1,19.2,13.7,10.3,258,182,3.67,3.08,51.7,45.5,63.8,54.7,357,73,0.33900000000000002,22.4,null,13.7,10.3]
[1,2,"120 x 40 x 3",null,3,"#",7.07,9.01,37,10.3,148,25.8,4.05,1.69,24.7,12.9,32.200000000000003,14.6,74.599999999999994,23.5,0.31,43.7,null,37,10.3]
[1,2,"120 x 40 x 4",null,4,"#",9.2200000000000006,11.7,27,7,187,31.9,3.99,1.65,31.1,15.9,41.2,18.5,94.2,29.2,0.30599999999999999,33,null,27,7]
[1,2,"120 x 40 x 5",null,5,"#",11.3,14.4,21,5,221,36.9,3.92,1.6,36.799999999999997,18.5,49.4,22,111,34.1,0.30299999999999999,26.9,null,21,5]
[1,2,"120 x 60 x 3",null,3,null,8.01,10.199999999999999,37,17,189,64.400000000000006,4.3,2.5099999999999998,31.5,21.5,39.200000000000003,24.2,156,37.1,0.35,43.8,null,37,17]
[1,2,"120 x 60 x 3.5",null,3.5,null,9.26,11.8,31.3,14.1,216,73.099999999999994,4.28,2.4900000000000002,35.9,24.4,44.9,27.7,179,42.2,0.34799999999999998,37.6,null,31.3,14.1]
[1,2,"120 x 60 x 4",null,4,null,10.5,13.3,27,12,241,81.2,4.25,2.4700000000000002,40.1,27.1,50.5,31.1,201,47,0.34599999999999997,33,null,27,12]
[1,2,"120 x 60 x 5",null,5,null,12.8,16.399999999999999,21,9,287,96,4.1900000000000004,2.42,47.8,32,60.9,37.4,242,55.8,0.34300000000000003,26.7,null,21,9]
[1,2,"120 x 60 x 6",null,6,null,15.1,19.2,17,7,328,109,4.13,2.38,54.7,36.299999999999997,70.599999999999994,43.1,280,63.6,0.33900000000000002,22.4,null,17,7]
[1,2,"120 x 80 x 3",null,3,null,8.9600000000000009,11.4,37,23.7,230,123,4.49,3.29,38.4,30.9,46.2,35,255,50.8,0.39,43.7,null,37,23.7]
[1,2,"120 x 80 x 4",null,4,null,11.7,14.9,27,17,295,157,4.4400000000000004,3.24,49.1,39.299999999999997,59.8,45.2,331,64.900000000000006,0.38600000000000001,32.9,null,27,17]
[1,2,"120 x 80 x 5",null,5,null,14.4,18.399999999999999,21,13,353,188,4.3899999999999997,3.2,58.9,46.9,72.400000000000006,54.7,402,77.8,0.38300000000000001,26.6,null,21,13]
[1,2,"120 x 80 x 6",null,6,null,17,21.6,17,10.3,406,215,4.33,3.15,67.7,53.8,84.3,63.5,469,89.4,0.379,22.3,null,17,10.3]
[1,2,"120 x 80 x 8",null,8,null,21.4,27.2,12,7,476,252,4.18,3.04,79.3,62.9,102,76.900000000000006,584,108,0.36599999999999999,17.100000000000001,null,12,7]
[1,2,"140 x 80 x 3",null,3,"#",9.9,12.6,43.7,23.7,334,141,5.15,3.35,47.8,35.299999999999997,58.2,39.6,317,59.7,0.43,43.4,null,43.7,23.7]
[1,2,"140 x 80 x 4",null,4,null,13,16.5,32,17,430,180,5.0999999999999996,3.3,61.4,45.1,75.5,51.3,412,76.5,0.42599999999999999,32.799999999999997,null,32,17]
[1,2,"140 x 80 x 5",null,5,"#",16,20.399999999999999,25,13,517,216,5.04,3.26,73.900000000000006,54,91.8,62.2,501,91.8,0.42299999999999999,26.5,null,25,13]
[1,2,"140 x 80 x 6",null,6,null,18.899999999999999,24,20.3,10.3,597,248,4.9800000000000004,3.21,85.3,62,107,72.400000000000006,584,106,0.41899999999999998,22.2,null,20.3,10.3]
[1,2,"140 x 80 x 8",null,8,null,23.9,30.4,14.5,7,708,293,4.82,3.1,101,73.3,131,88.4,731,129,0.40600000000000003,17,null,14.5,7]
[1,2,"140 x 80 x 10",null,10,null,28.7,36.6,11,5,804,330,4.6900000000000004,3.01,115,82.6,152,103,851,147,0.39700000000000002,13.8,null,11,5]
[1,2,"150 x 100 x 3",null,3,"#",11.3,14.4,47,30.3,461,248,5.65,4.1500000000000004,61.4,49.5,73.5,55.8,507,81.400000000000006,0.49,43.3,null,47,30.3]
[1,2,"150 x 100 x 4",null,4,null,14.9,18.899999999999999,34.5,22,595,319,5.6,4.0999999999999996,79.3,63.7,95.7,72.5,662,105,0.48599999999999999,32.700000000000003,null,34.5,22]
[1,2,"150 x 100 x 5",null,5,null,18.3,23.4,27,17,719,384,5.55,4.05,95.9,76.8,117,88.3,809,127,0.48299999999999998,26.3,null,27,17]
[1,2,"150 x 100 x 6",null,6,null,21.7,27.6,22,13.7,835,444,5.5,4.01,111,88.8,137,103,948,147,0.47899999999999998,22.1,null,22,13.7]
[1,2,"150 x 100 x 8",null,8,null,27.7,35.200000000000003,15.8,9.5,1010,536,5.35,3.9,134,107,169,128,1210,182,0.46600000000000003,16.8,null,15.8,9.5]
[1,2,"150 x 100 x 10",null,10,null,33.4,42.6,12,7,1160,614,5.22,3.8,155,123,199,150,1430,211,0.45700000000000002,13.7,null,12,7]
[1,2,"160 x 80 x 3",null,3,"#",10.8,13.8,50.3,23.7,464,159,5.8,3.39,58,39.799999999999997,71.400000000000006,44.3,380,68.599999999999994,0.47,43.4,null,50.3,23.7]
[1,2,"160 x 80 x 4",null,4,null,14.2,18.100000000000001,37,17,598,204,5.74,3.35,74.7,50.9,92.9,57.4,494,88,0.46600000000000003,32.700000000000003,null,37,17]
[1,2,"160 x 80 x 5",null,5,null,17.5,22.4,29,13,722,244,5.68,3.3,90.2,61,113,69.7,601,106,0.46300000000000002,26.4,null,29,13]
[1,2,"160 x 80 x 6",null,6,null,20.7,26.4,23.7,10.3,836,281,5.62,3.26,105,70.2,132,81.3,702,122,0.45900000000000002,22.1,null,23.7,10.3]
[1,2,"160 x 80 x 8",null,8,null,26.4,33.6,17,7,1000,335,5.46,3.16,125,83.7,163,100,882,150,0.44600000000000001,16.899999999999999,null,17,7]
[1,2,"160 x 80 x 10",null,10,"#",31.8,40.6,13,5,1150,380,5.32,3.06,143,95,191,117,1030,172,0.437,13.7,null,13,5]
[1,2,"180 x 80 x 3",null,3,null,11.8,15,57,23.7,621,177,6.43,3.43,69,44.2,85.8,48.9,445,77.5,0.51,43.3,null,57,23.7]
[1,2,"180 x 80 x 4",null,4,null,15.5,19.7,42,17,802,227,6.37,3.39,89.1,56.7,112,63.5,578,99.6,0.50600000000000001,32.6,null,42,17]
[1,2,"180 x 80 x 5",null,5,null,19.100000000000001,24.4,33,13,971,272,6.31,3.34,108,68.099999999999994,137,77.2,704,120,0.503,26.3,null,33,13]
[1,2,"180 x 80 x 6",null,6,"#",22.6,28.8,27,10.3,1130,314,6.25,3.3,125,78.5,160,90.2,823,139,0.499,22.1,null,27,10.3]
[1,2,"180 x 80 x 8",null,8,null,28.9,36.799999999999997,19.5,7,1360,377,6.08,3.2,151,94.1,198,111,1040,170,0.48599999999999999,16.8,null,19.5,7]
[1,2,"180 x 80 x 10",null,10,"#",35,44.6,15,5,1570,429,5.94,3.1,174,107,234,131,1210,196,0.47699999999999998,13.6,null,15,5]
[1,2,"180 x 100 x 4",null,4,"#",16.8,21.3,42,22,926,374,6.59,4.18,103,74.8,126,84,854,127,0.54600000000000004,32.6,null,42,22]
[1,2,"180 x 100 x 5",null,5,null,20.7,26.4,33,17,1120,452,6.53,4.1399999999999997,125,90.4,154,103,1050,154,0.54300000000000004,26.2,null,33,17]
[1,2,"180 x 100 x 6",null,6,null,24.5,31.2,27,13.7,1310,524,6.48,4.0999999999999996,146,105,181,120,1230,179,0.53900000000000003,22,null,27,13.7]
[1,2,"180 x 100 x 8",null,8,null,31.4,40,19.5,9.5,1600,637,6.32,3.99,178,127,226,150,1570,222,0.52600000000000002,16.7,null,19.5,9.5]
[1,2,"180 x 100 x 10",null,10,null,38.1,48.6,15,7,1860,736,6.19,3.89,207,147,268,177,1860,260,0.51700000000000002,13.5,null,15,7]
[1,2,"200 x 100 x 4",null,4,null,18,22.9,47,22,1200,411,7.23,4.2300000000000004,120,82.2,148,91.7,985,142,0.58599999999999997,32.5,null,47,22]
[1,2,"200 x 100 x 5",null,5,null,22.3,28.4,37,17,1460,497,7.17,4.1900000000000004,146,99.4,181,112,1210,172,0.58299999999999996,26.2,null,37,17]
[1,2,"200 x 100 x 6",null,6,null,26.4,33.6,30.3,13.7,1700,577,7.12,4.1399999999999997,170,115,213,132,1420,200,0.57899999999999996,21.9,null,30.3,13.7]
[1,2,"200 x 100 x 8",null,8,null,33.9,43.2,22,9.5,2090,705,6.95,4.04,209,141,267,165,1810,250,0.56599999999999995,16.7,null,22,9.5]
[1,2,"200 x 100 x 10",null,10,null,41.3,52.6,17,7,2440,818,6.82,3.94,244,164,318,195,2150,292,0.55700000000000005,13.5,null,17,7]
[1,2,"200 x 120 x 4",null,4,null,19.3,24.5,47,27,1350,618,7.43,5.0199999999999996,135,103,164,115,1350,172,0.626,32.5,null,47,27]
[1,2,"200 x 120 x 5",null,5,null,23.8,30.4,37,21,1650,750,7.37,4.97,165,125,201,141,1650,210,0.623,26.2,null,37,21]
[1,2,"200 x 120 x 6",null,6,null,28.3,36,30.3,17,1930,874,7.32,4.93,193,146,237,166,1950,245,0.61899999999999999,21.9,null,30.3,17]
[1,2,"200 x 120 x 8",null,8,null,36.5,46.4,22,12,2390,1080,7.17,4.82,239,180,298,209,2510,308,0.60599999999999998,16.600000000000001,null,22,12]
[1,2,"200 x 120 x 10",null,10,null,44.4,56.6,17,9,2810,1260,7.04,4.72,281,210,356,250,3010,364,0.59699999999999998,13.4,null,17,9]
[1,2,"200 x 150 x 4",null,4,"#",21.2,26.9,47,34.5,1580,1020,7.67,6.16,158,136,187,154,1940,219,0.68600000000000005,32.4,null,47,34.5]
[1,2,"200 x 150 x 5",null,5,"#",26.2,33.4,37,27,1940,1250,7.62,6.11,193,166,230,189,2390,267,0.68300000000000005,26.1,null,37,27]
[1,2,"200 x 150 x 6",null,6,null,31.1,39.6,30.3,22,2270,1460,7.56,6.06,227,194,271,223,2830,313,0.67900000000000005,21.8,null,30.3,22]
[1,2,"200 x 150 x 8",null,8,null,40.200000000000003,51.2,22,15.8,2830,1820,7.43,5.95,283,242,344,283,3670,396,0.66600000000000004,16.600000000000001,null,22,15.8]
[1,2,"200 x 150 x 10",null,10,null,49.1,62.6,17,12,3350,2140,7.31,5.85,335,286,413,339,4430,471,0.65700000000000003,13.4,null,17,12]
[1,2,"250 x 150 x 5",null,5,null,30.1,38.4,47,27,3300,1510,9.2799999999999994,6.27,264,201,320,225,3290,337,0.78300000000000003,26,null,47,27]
[1,2,"250 x 150 x 6",null,6,null,35.799999999999997,45.6,38.700000000000003,22,3890,1770,9.23,6.23,311,236,378,266,3890,396,0.77900000000000003,21.7,null,38.700000000000003,22]
[1,2,"250 x 150 x 6.3",null,6.3,"#",37.200000000000003,47.4,36.700000000000003,20.8,4000,1830,9.18,6.2,320,243,391,276,4080,412,0.77300000000000002,20.7,null,36.700000000000003,20.8]
[1,2,"250 x 150 x 8",null,8,null,46.5,59.2,28.3,15.8,4890,2220,9.08,6.12,391,296,482,340,5050,504,0.76600000000000001,16.5,null,28.3,15.8]
[1,2,"250 x 150 x 10",null,10,null,57,72.599999999999994,22,12,5830,2630,8.9600000000000009,6.02,466,351,582,409,6120,602,0.75700000000000001,13.3,null,22,12]
[1,2,"250 x 150 x 12",null,12,null,66,84.1,17.8,9.5,6460,2930,8.77,5.9,517,390,658,463,7090,684,0.73799999999999999,11.2,null,17.8,9.5]
[1,2,"250 x 150 x 12.5",null,12.5,null,68.3,87,17,9,6630,3000,8.73,5.87,531,400,678,477,7320,704,0.73599999999999999,10.7,null,17,9]
[1,2,"300 x 100 x 8",null,8,null,46.5,59.2,34.5,9.5,5980,1050,10,4.2,399,209,523,238,3080,385,0.76600000000000001,16.5,null,34.5,9.5]
[1,2,"300 x 100 x 10",null,10,null,57,72.599999999999994,27,7,7110,1220,9.9,4.1100000000000003,474,245,631,285,3680,455,0.75700000000000001,13.3,null,27,7]
[1,2,"300 x 200 x 6",null,6,null,45.2,57.6,47,30.3,7370,3960,11.3,8.2899999999999991,491,396,588,446,8120,651,0.97899999999999998,21.6,null,47,30.3]
[1,2,"300 x 200 x 6.3",null,6.3,"#",47.1,60,44.6,28.7,7620,4100,11.3,8.27,508,410,610,463,8520,680,0.97299999999999998,20.6,null,44.6,28.7]
[1,2,"300 x 200 x 8",null,8,null,59.1,75.2,34.5,22,9390,5040,11.2,8.19,626,504,757,574,10600,838,0.96599999999999997,16.3,null,34.5,22]
[1,2,"300 x 200 x 10",null,10,null,72.7,92.6,27,17,11300,6060,11.1,8.09,754,606,921,698,13000,1010,0.95699999999999996,13.2,null,27,17]
[1,2,"300 x 200 x 12",null,12,"#",84.8,108,22,13.7,12800,6850,10.9,7.96,853,685,1060,801,15200,1170,0.93799999999999994,11.1,null,22,13.7]
[1,2,"300 x 200 x 12.5",null,12.5,null,88,112,21,13,13200,7060,10.8,7.94,879,706,1090,828,15800,1200,0.93600000000000005,10.7,null,21,13]
[1,2,"400 x 200 x 6",null,6,"#",54.7,69.599999999999994,63.7,30.3,14800,5090,14.6,8.5500000000000007,739,509,906,562,12100,877,1.18,21.6,null,63.7,30.3]
[1,2,"400 x 200 x 6.3",null,6.3,"#",57,72.599999999999994,60.5,28.7,15300,5290,14.5,8.5299999999999994,766,529,942,585,12700,916,1.17,20.5,null,60.5,28.7]
[1,2,"400 x 200 x 8",null,8,null,71.599999999999994,91.2,47,22,19000,6520,14.4,8.4499999999999993,949,652,1170,728,15800,1130,1.17,16.399999999999999,null,47,22]
[1,2,"400 x 200 x 10",null,10,null,88.4,113,37,17,23000,7860,14.3,8.36,1150,786,1430,888,19400,1370,1.1599999999999999,13.1,null,37,17]
[1,2,"400 x 200 x 12",null,12,"#",104,132,30.3,13.7,26200,8980,14.1,8.24,1310,898,1660,1030,22800,1590,1.1399999999999999,11,null,30.3,13.7]
[1,2,"400 x 200 x 12.5",null,12.5,null,108,137,29,13,27100,9260,14.1,8.2200000000000006,1360,926,1710,1060,23600,1640,1.1399999999999999,10.6,null,29,13]
[1,2,"450 x 250 x 6",null,6,"#",64.099999999999994,81.599999999999994,72,38.700000000000003,22700,9250,16.7,10.6,1010,740,1220,817,20700,1250,1.38,21.5,null,72,38.700000000000003]
[1,2,"450 x 250 x 6.3",null,6.3,"#",66.900000000000006,85.2,68.400000000000006,36.700000000000003,23600,9620,16.600000000000001,10.6,1050,769,1270,851,21700,1310,1.37,20.399999999999999,null,68.400000000000006,36.700000000000003]
[1,2,"450 x 250 x 8",null,8,"#",84.2,107,53.3,28.3,29300,11900,16.5,10.5,1300,953,1590,1060,27200,1630,1.37,16.3,null,53.3,28.3]
[1,2,"450 x 250 x 10",null,10,"#",104,133,42,22,35700,14500,16.399999999999999,10.4,1590,1160,1950,1300,33500,1980,1.36,13.1,null,42,22]
[1,2,"450 x 250 x 12",null,12,"#",123,156,34.5,17.8,41100,16700,16.2,10.3,1830,1330,2260,1520,39600,2310,1.34,10.9,null,34.5,17.8]
[1,2,"450 x 250 x 12.5",null,12.5,"#",127,162,33,17,42500,17200,16.2,10.3,1890,1380,2350,1570,41100,2390,1.34,10.5,null,33,17]
[1,2,"500 x 300 x 6",null,6,"#",73.5,93.6,80.3,47,33000,15200,18.8,12.7,1320,1010,1580,1120,32400,1690,1.58,21.5,null,80.3,47]
[1,2,"500 x 300 x 6.3",null,6.3,"#",76.8,97.8,76.400000000000006,44.6,34300,15800,18.7,12.7,1370,1050,1650,1170,34100,1770,1.57,20.399999999999999,null,76.400000000000006,44.6]
[1,2,"500 x 300 x 8",null,8,"#",96.7,123,59.5,34.5,42800,19600,18.600000000000001,12.6,1710,1310,2060,1460,42800,2200,1.57,16.2,null,59.5,34.5]
[1,2,"500 x 300 x 10",null,10,"#",120,153,47,27,52300,23900,18.5,12.5,2090,1600,2540,1790,52700,2690,1.56,13,null,47,27]
[1,2,"500 x 300 x 12",null,12,"#",141,180,38.700000000000003,22,60600,27700,18.3,12.4,2420,1850,2960,2090,62600,3160,1.54,10.9,null,38.700000000000003,22]
[1,2,"500 x 300 x 12.5",null,12.5,"#",147,187,37,21,62700,28700,18.3,12.4,2510,1910,3070,2170,65000,3270,1.54,10.5,null,37,21]

{"sheet":"from author","index":2,"n_rows":41,"n_cols":7,"rows_kept":41,"cut":false,"hidden":false,"merged":[[4,12,4,13],[6,2,9,9],[12,2,29,9],[33,2,36,9],[40,2,43,9],[0,1,0,5],[0,6,0,10],[2,2,2,5],[2,6,2,9],[3,2,3,5],[3,6,3,9]]}
[null,"Version: 1.0. - FREE LITE VERSION",null,null,null,null,"© 2016 Damian Janicki"]
[]
[null,null,"For latest updates and news visit:",null,null,null,"Contact me at:"]
[null,null,"www.YourSpreadsheets.co.uk",null,null,null,"info@yourspreadsheets.co.uk"]
[]
[]
[null,null,"General information:\nNote: This spreadsheet contains macros."]
[]
[]
[]
[]
[]
[null,null,"The Author takes no liability for use of this spreadsheet and gives no guarantee that it is error free. \n\nIn no event shall the Author be responsible for any special, incidental or consequential damages whatsoever arising from the use of this spreadsheet, even if the Author has been advised of the possibility of such damage.\n\nThis spreadsheet is a freeware and can be distributed freely but only in its original form.\n\nReverse-engineering, decompiling or disassembling of this spreadsheet is not allowable.\n\nBy using this spreadsheet you understand and agree with the above terms and conditions. You also acknowledge that you do not become the owner of this spreadsheet.\n\nDamian Janicki"]
[]
[]
[]
[]
[]
[]
[]
[]
[]
[]
[]
[]
[]
[]
[]
[]
[]
[]
[]
[]
[null,null,"This is a Free Lite Version. The full version of the spreadsheet allows to:\n- Input your company information, change logo and change header information\n- Change applied horizontal loads for two bottom storey\n- Change height of two bottom storey"]
[]
[]
[]
[]
[]
[]
[null,null,"This spreadsheet is based on Eurocode 1993-1-1 (2005) + UK N.A.\n\nChangelog:\n2016.08.31 - v.1.0. - official release of the spreadsheet."]