{"text_format":"1","workbook":"xlsx","n_sheets":3,"sheets":["bracing","datasheet","from author"],"not_rendered":{"charts":1,"images":8,"macros":1,"external_links":0,"defined_names":35,"comments":1,"pivot_tables":0},"unopened":[],"bounds":{"document_bytes":16777216,"sheet_cells":100000,"rows_first":2000,"rows_last":500,"rows_between":2000,"halvings":0,"cell_chars":16384,"cell_head_chars":4096},"cells_cut":0,"cells_raw":0,"read":"whole","date_system":"1900"}

{"sheet":"bracing","index":0,"n_rows":65,"n_cols":55,"rows_kept":65,"cut":false,"hidden":false,"merged":[[52,20,52,21],[53,32,53,34],[53,35,53,37],[55,2,59,27],[44,10,44,11],[45,8,45,9],[45,10,45,11],[46,8,46,9],[46,10,46,11],[47,8,47,9],[47,20,47,21],[48,20,48,21],[49,20,49,21],[53,2,53,27],[51,20,51,21],[51,8,51,9],[44,3,44,5],[45,3,45,5],[51,3,51,5],[47,3,47,5],[48,3,48,5],[49,3,49,5],[48,13,48,14],[52,8,52,9],[38,46,42,46],[38,54,42,54],[38,53,42,53],[38,48,42,48],[38,47,42,47],[39,20,42,21],[39,22,42,22],[39,23,42,23],[50,20,50,21],[38,22,38,26],[38,12,38,21],[39,25,42,25],[43,20,43,21],[44,20,44,21],[45,20,45,21],[43,13,43,14],[44,13,44,14],[45,13,45,14],[46,13,46,14],[47,13,47,14],[46,20,46,21],[39,17,42,17],[39,18,42,18],[39,15,42,15],[48,8,48,9],[48,10,48,11],[49,8,49,9],[50,8,50,9],[43,3,43,5],[46,3,46,5],[50,3,50,5],[43,8,43,9],[43,10,43,11],[44,8,44,9],[49,10,49,11],[50,10,50,11],[50,13,50,14],[51,13,51,14],[52,13,52,14],[5,25,5,28],[60,15,60,27],[5,4,5,14],[5,18,5,21],[5,15,5,17],[37,2,37,27],[7,2,7,14],[18,2,18,14],[7,16,7,27],[13,2,13,12],[12,2,12,12],[8,9,8,14],[8,2,8,8],[12,13,12,14],[27,2,27,12],[27,13,27,14],[60,2,60,14],[5,2,5,3],[38,7,42,7],[39,12,42,12],[47,10,47,11],[52,3,52,5],[39,13,42,14],[38,6,42,6],[5,22,5,24],[13,13,13,14],[11,2,11,12],[11,13,11,14],[24,2,24,4],[9,2,9,8],[9,9,9,14],[38,8,38,11],[39,8,42,9],[39,10,42,11],[38,2,42,2],[26,2,26,14],[20,2,20,4],[21,2,21,4],[22,2,22,4],[23,2,23,4],[14,13,14,14],[15,13,15,14],[51,10,51,11],[52,10,52,11],[49,13,49,14],[19,2,19,4],[29,13,29,14],[25,5,25,14],[32,5,32,14],[38,3,42,5],[0,1,0,15],[0,16,0,28],[4,22,4,24],[4,25,4,28],[1,4,4,14],[1,15,3,21],[4,18,4,21],[4,15,4,17],[1,22,1,27],[2,22,2,24],[2,25,2,28],[3,22,3,24],[3,25,3,28],[14,2,14,12],[15,2,15,12],[16,2,16,12],[38,51,42,51],[38,52,42,52],[39,19,42,19],[39,16,42,16],[38,49,42,49],[38,50,42,50],[8,42,8,43],[8,40,8,41],[10,2,10,8],[10,9,10,14],[17,2,17,14],[17,38,24,38],[10,38,16,38],[39,26,42,26],[39,24,42,24],[38,27,42,27],[31,2,31,12],[31,13,31,14],[30,2,30,12],[30,13,30,14],[28,13,28,14],[28,2,28,12],[29,2,29,12],[16,13,16,14]]}
[null,"Version: 1.0.",null,null,null,null,null,null,null,null,null,null,null,null,null,null,"© 2016 Damian Janicki"]
[null,null,null,null,"  YourSpreadsheets™\n   Top Floor, Made up 52 Marcus Hill, London\n   www.YourSpreadsheets.co.uk\n   Tel: 020 7542 8734",null,null,null,null,null,null,null,null,null,null,"TEST PROJECT"]
[null,null,null,null,null,null,null,null,null,null,null,null,null,null,null,null,null,null,null,null,null,null,"Revision",null,null,"A"]
[null,null,null,null,null,null,null,null,null,null,null,null,null,null,null,null,null,null,null,null,null,null,"Page:",null,null,12]
[null,null,null,null,null,null,null,null,null,null,null,null,null,null,null,"Job No:",null,null,22813,null,null,null,"Date:",null,null,{"$f":"TODAY()","v":"2016-08-31"}]
[null,null,"Member: ",null,"BRACING EXAMPLE",null,null,null,null,null,null,null,null,null,null,"Prepared By:",null,null,"DJ",null,null,null,"Checked By:",null,null,"DJ"]
[]
[null,null,"BASIC DATA:",null,null,null,null,null,null,null,null,null,null,null,null,null,"DIAGRAM:",null,null,null,null,null,null,null,null,null,null,null,null,null,"Bracing type:",null,"Factor for effective length:",0.7,null,"Steel section type:",null,null,null,"Steel design strength per limiting thickness:"]
[null,null,"Bracing type:",null,null,null,null,null,null,"Single diagonal",null,null,null,null,null,null,null,null,null,null,null,null,null,null,null,null,null,null,null,null,"Single diagonal","(SD)",null,0.85,null,"Flat bars","fb",null,null,null,"fy",null,"fu"]
[null,null,"Steel section type:",null,null,null,null,null,null,"CHS (hot rolled)",null,null,null,null,null,null,null,null,null,null,null,null,null,null,null,null,null,null,null,null,"Cross bracing (tension only)","(X)",null,1,null,"Equal Angles (UKA)","EA",null,null,null,"t<16","16<t<40","t<=3","3<t<=100"]
[null,null,"Steel grade:",null,null,null,null,null,null,"S355 H",null,null,null,null,null,null,null,null,null,null,null,null,null,null,null,null,null,null,null,null,"Horizontal K-bracing","(HK)",null,1.2,null,"Unequal Angles (UKA)","UA",null,"Grade (hollow sections)\nhot rolled and cold formed","S235 H",235,225,360,360]
[null,null,"Elastic modulus of steel 'E' [GPa] =",null,null,null,null,null,null,null,null,null,null,205,null,null,null,null,null,null,null,null,null,null,null,null,null,null,null,null,"Inverted V-bracing","(VK)",null,1.5,null,"CHS (hot rolled)","CHS",null,null,"S275 H",275,265,430,410]
[null,null,"Number of stories =",null,null,null,null,null,null,null,null,null,null,"six",null,null,null,null,null,null,null,null,null,null,null,null,null,null,null,null,"Selected:",{"$f":"INDEX(AF9:AF12,MATCH($J$9,AE9:AE12,0))","v":"(SD)"},null,2,null,"RHS (hot rolled)","RHS",null,null,"S355 H",355,345,510,470]
[null,null,"Bay length 'wbay' [m] =",null,null,null,null,null,null,null,null,null,null,3,null,null,null,null,null,null,null,null,null,null,null,null,null,null,null,null,null,null,null,null,null,"SHS (hot rolled)","SHS",null,null,"S275 NH/NLH",275,265,370,370]
[null,null,"Amplification factor for sway-sensitive structures 'kamp' =",null,null,null,null,null,null,null,null,null,null,1,null,null,null,null,null,null,null,null,null,null,null,null,null,null,null,null,null,null,null,null,null,"CHS (cold formed)","CHS",null,null,"S355 NH/NLH",355,345,470,470]
[null,null,"Effective length parameter 'k' [m] =",null,null,null,null,null,null,null,null,null,null,1,null,null,null,null,null,null,null,null,null,null,null,null,null,null,null,null,null,null,null,null,null,"RHS (cold formed)","RHS",null,null,"S420 NH/NLH",420,400,520,520,"row number"]
[null,null,"Area of holes in tension members 'Aholes' [mm2] =",null,null,null,null,null,null,null,null,null,null,452.2,null,null,null,null,null,null,null,null,null,null,null,null,null,null,null,null,null,null,null,null,null,"SHS (cold formed)","SHS",null,null,"S460 NH/NLH",460,440,540,540,7]
[null,null,{"$f":"IF(OR(AND(OR(AK18=AK9,AK18=AK10,AK18=AK11),MATCH(J11,AN11:AN25,0)<=$AS$17),AND(AK18<>AK9,AK18<>AK10,AK18<>AK11,MATCH(J11,AN11:AN25,0)>$AS$17)),\"Incorrect steel grade selected\",\"\")","v":""},null,null,null,null,null,null,null,null,null,null,null,null,null,null,null,null,null,null,null,null,null,null,null,null,null,null,null,null,null,null,null,null,"selected:",{"$f":"INDEX(AK9:AK17,MATCH($J$10,AJ9:AJ17,0))","v":"CHS"},null,"Grade (hot roller sections)","S235",235,225,360,360]
[null,null,"STOREY DATA:",null,null,null,null,null,null,null,null,null,null,null,null,null,null,null,null,null,null,null,null,null,null,null,null,null,null,null,null,null,null,null,null,null,null,null,null,"S275",275,265,430,410]
[null,null,"Storey:",null,null,1,2,3,4,5,6,7,8,9,10,null,null,null,null,null,null,null,null,null,null,null,null,null,null,null,null,null,null,null,null,null,null,null,null,"S355",355,345,510,470]
{"$rows_left_out":46}
{"sheet":"datasheet","index":1,"n_rows":1224,"n_cols":54,"rows_kept":1224,"cut":false,"hidden":true,"merged":[[81,12,81,13],[81,14,81,15],[80,8,80,9],[80,12,80,13],[80,14,80,15],[80,16,80,17],[81,16,81,17],[81,18,81,19],[11,5,11,6],[44,22,44,24],[7,3,7,4],[10,5,10,6],[10,9,10,11],[10,12,10,14],[11,9,11,11],[11,12,11,14],[80,20,80,21],[41,3,41,4],[41,18,41,20],[44,5,44,6],[44,8,44,9],[44,10,44,13],[44,14,44,17],[44,18,44,19],[74,3,74,4],[45,18,45,19],[45,8,45,9],[45,10,45,13],[45,14,45,17],[80,18,80,19],[81,20,81,21],[80,10,80,11],[45,22,45,24],[45,5,45,6],[662,2,663,2],[664,2,664,5],[664,13,664,14],[664,15,664,16],[351,13,351,14],[351,15,351,16],[352,13,352,14],[352,15,352,16],[345,3,345,4],[353,3,353,5],[354,3,354,5],[82,3,82,5],[83,3,83,5],[84,3,84,5],[85,3,85,5],[355,3,355,5],[356,3,356,5],[658,3,658,4],[81,8,81,9],[81,10,81,11],[665,2,665,5],[665,13,665,14],[665,15,665,16],[795,3,795,5],[960,3,960,4],[964,2,965,2],[784,3,784,4],[790,2,790,5],[790,13,790,14],[790,15,790,16],[791,2,791,5],[791,13,791,14],[791,15,791,16],[792,3,792,5],[793,3,793,5],[794,3,794,5],[666,3,666,5],[667,3,667,5],[668,3,668,5],[669,3,669,5],[1082,18,1082,19],[1082,20,1082,21],[1083,2,1083,5],[1083,8,1083,9],[1083,10,1083,11],[1087,3,1087,5],[1083,14,1083,15],[1083,16,1083,17],[1083,18,1083,19],[1083,20,1083,21],[1082,2,1082,5],[1082,8,1082,9],[1082,10,1082,11],[1082,12,1082,13],[1082,14,1082,15],[1082,16,1082,17],[966,2,966,5],[966,13,966,14],[966,15,966,16],[967,2,967,5],[967,13,967,14],[967,15,967,16],[1084,3,1084,5],[1085,3,1085,5],[1086,3,1086,5],[971,3,971,5],[1076,3,1076,4],[1080,2,1081,2],[1083,12,1083,13],[968,3,968,5],[969,3,969,5],[970,3,970,5]]}
[]
[]
[]
[]
[]
[null,null,null,null,null,null,null,null,null,null,null,null,null,null,null,null,null,null,null,null,null,null,null,null,null,null,"CHART DATA"]
[null,null,"Advance® UKA - Equal"]
[null,null,null,"Table 1.1.5.1",null,null,null,null,null,null,null,null,null,null,null,null,null,null,null,null,null,null,null,null,null,null,null,null,null,null,null,null,null,null,null,null,null,null,null,null,null,null,"Constants"]
[null,null,null,null,null,null,null,null,null,null,null,null,null,null,null,null,null,null,null,null,null,null,null,null,null,null,null,null,null,null,null,null,null,null,null,null,null,null,"Constants",null,null,null,"extension",{"$f":"0.25+(bracing!AF32/bracing!AF32^2)*(0.2*bracing!AF32-0.2)","v":0.41666666666666669}]
[null,null,null,"DIMENSIONS AND PROPERTIES",null,null,null,null,null,null,null,null,null,null,null,null,null,null,null,null,null,null,null,null,null,null,null,null,null,null,null,null,null,null,null,null,null,null,"load X coordinates",{"$f":"-bracing!N14/2","v":-1.5},null,null,"text offset",{"$f":"0.4+(bracing!AF32/bracing!AF32^2)*(0.5*bracing!AF32-0.5)","v":0.81666666666666665}]
[null,null,"Section",null,"Mass","Radius",null,"Area","Distance","Second Moment",null,null,"Radius",null,null,"Elastic","Torsional","Equivalent",null,null,null,null,null,null,null,null,null,null,null,null,null,null,null,null,null,null,null,null,"load arrow length",{"$f":"bracing!N14/3","v":1},null,null,"dim offset",{"$f":"2+(bracing!AF32/bracing!AF32^2)*(1.5*bracing!AF32-1.5)","v":3.25}]
[null,null,"Designation",null,"per",null,null,"of","to","of Area",null,null,"of Gyration",null,null,"Modulus","Constant","Slenderness",null,null,null,null,null,null,null,null,null,null,null,null,null,null,null,null,null,null,null,null,"load text offset",{"$f":"AN10+(1/bracing!AF32)","v":-1.3333333333333333},null,null,"bracing label offset",{"$f":"AR11+(bracing!N14*bracing!AF32/bracing!AF32^2)*(2-1/bracing!AF32*1.5)","v":4.125}]
[null,null,"Size","Thickness","Metre","Root","Toe","Section","Centre of","Axis","Axis","Axis","Axis","Axis","Axis","Axis",null,"Coefficient",null,null,null,null,null,null,null,null,null,null,null,null,null,null,null,null,null,null,null,null,null,null,null,null,null,{"$f":"AR11+(bracing!N14*1/bracing!AF32)*(2.5-1/bracing!AF32*1.5)","v":4.375}]
[null,null,null,null,null,null,null,null,"Gravity","x-x, y-y","u-u","v-v","x-x, y-y","u-u","v-v","x-x, y-y",null,null,null,null,null,null,null,null,null,null,null,"X","Y",null,null,"X","Y",null,null,"X","Y",null,null,"X","Y",null,null,"X","Y",null,null,"X","Y",null,null,null,"X","Y"]
[null,null,"A x A","t",null,"r1","r2",null,"c",null,null,null,null,null,null,null,"J","Φa",null,null,null,null,null,null,null,null,"Columns",null,null,null,"Bracing No 1",null,null,null,"Bracing No 2",null,null,null,"Loads",null,null,null,"Dimension line 1",null,null,null,"Dimension line 2",null,null,null,null,"Dimension labels"]
["fy","fu","mm","mm","kg/m","mm","mm","cm2","cm","cm4","cm4","cm4","cm","cm","cm","cm3","cm4",null,null,null,null,null,null,null,null,null,"Left",0,0,null,1,0,{"$f":"IF(bracing!$AF$13=bracing!$AF$9,4,IF(bracing!$AF$13=bracing!$AF$10,4,IF(bracing!$AF$13=bracing!$AF$11,4,0)))","v":4},null,1,{"$f":"IF(bracing!$AF$13=bracing!$AF$9,0,IF(bracing!$AF$13=bracing!$AF$10,0,IF(bracing!$AF$13=bracing!$AF$11,0,bracing!F23)))","v":0},{"$f":"IF(bracing!$AF$13=bracing!$AF$9,0,IF(bracing!$AF$13=bracing!$AF$10,0,IF(bracing!$AF$13=bracing!$AF$11,0,bracing!F21)))","v":0},null,1,{"$f":"$AN$10","v":-1.5},{"$f":"IF(AM16<=bracing!$AF$32,INDEX(bracing!$F$25:$O$25,1,AM16),4)","v":4},null,null,{"$f":"bracing!N14+AR11","v":6.25},{"$f":"-AR9","v":-0.41666666666666669},null,null,{"$f":"AR16+AR11","v":9.5},{"$f":"AS16","v":-0.41666666666666669},null,null,{"$f":"bracing!N14&\"m\"","v":"3m"},{"$f":"bracing!N14/2","v":1.5},{"$f":"AW26+$AR$10","v":-2.4333333333333336}]
[1,2,"90 x 90 x 7",7,9.61,11,5.5,12.2,2.4500000000000002,92.6,147,38.299999999999997,2.75,3.46,1.77,14.1,2.2400000000000002,3.8,null,null,null,null,null,null,null,null,null,0,{"$f":"INDEX(bracing!F25:O25,1,bracing!AF32)","v":20},null,null,{"$f":"IF(bracing!$AF$13=bracing!$AF$9,3,IF(bracing!$AF$13=bracing!$AF$10,3,IF(bracing!$AF$13=bracing!$AF$11,3,INDEX(bracing!$F$23:$O$23,1,AE16))))","v":3},{"$f":"IF(bracing!$AF$13=bracing!$AF$9,0,IF(bracing!$AF$13=bracing!$AF$10,0,IF(bracing!$AF$13=bracing!$AF$11,INDEX(bracing!$F$23:$O$23,1,AE16),4)))","v":0},null,null,{"$f":"IF(bracing!$AF$13=bracing!$AF$9,0,IF(bracing!$AF$13=bracing!$AF$10,bracing!N14,IF(bracing!$AF$13=bracing!$AF$11,bracing!N14,bracing!N14)))","v":0},{"$f":"IF(bracing!$AF$13=bracing!$AF$9,0,IF(bracing!$AF$13=bracing!$AF$10,bracing!F21,IF(bracing!$AF$13=bracing!$AF$11,bracing!F23,0)))","v":0},null,null,{"$f":"$AN$10+$AN$11","v":-0.5},{"$f":"AO16","v":4},null,null,{"$f":"AR16","v":6.25},{"$f":"INDEX(bracing!F25:O25,1,bracing!AF32)+AR9","v":20.416666666666668},null,null,{"$f":"AV16","v":9.5},{"$f":"AS17","v":20.416666666666668}]
[1,2,"90 x 90 x 8",8,10.9,11,5.5,13.9,2.5,104,166,43.1,2.74,3.45,1.76,16.100000000000001,3.28,3.33,null,null,null,null,null,null,null,null,null,null,null,null,null,null,null,null,null,null,null,null,null,null,null,null,null,null,null,null,null,null,null,null,null,{"$f":"INDEX(bracing!F25:O25,1,bracing!AF32)&\"m\"","v":"20m"},{"$f":"AV16-AR10","v":8.6833333333333336},{"$f":"INDEX(bracing!F25:O25,1,bracing!AF32)/2","v":10}]
[1,2,"90 x 90 x 10",10,13.4,11,5.5,17.100000000000001,2.58,127,201,52.6,2.72,3.42,1.75,19.8,6.2,2.64,null,null,null,null,null,null,null,null,"Right",{"$f":"3","v":3},{"$f":"AC16","v":0},null,2,{"$f":"IF($AE19<=bracing!$AF$32,IF(bracing!$AF$13=bracing!$AF$9,0,IF(bracing!$AF$13=bracing!$AF$10,0,IF(bracing!$AF$13=bracing!$AF$11,0,0))),0)","v":0},{"$f":"IF($AE19<=bracing!$AF$32,IF(bracing!$AF$13=bracing!$AF$9,INDEX(bracing!$F$25:$O$25,1,AE19),IF(bracing!$AF$13=bracing!$AF$10,INDEX(bracing!$F$25:$O$25,1,AE19),IF(bracing!$AF$13=bracing!$AF$11,INDEX(bracing!$F$25:$O$25,1,AE19),INDEX(bracing!$F$25:$O$25,1,AE19-1)))),0)","v":8},null,2,{"$f":"IF($AI19<=bracing!$AF$32,IF(bracing!$AF$13=bracing!$AF$9,0,IF(bracing!$AF$13=bracing!$AF$10,0,IF(bracing!$AF$13=bracing!$AF$11,0,INDEX(bracing!$F$23:$O$23,1,AI19)))),0)","v":0},{"$f":"IF($AI19<=bracing!$AF$32,IF(bracing!$AF$13=bracing!$AF$9,0,IF(bracing!$AF$13=bracing!$AF$10,INDEX(bracing!$F$25:$O$25,1,AI19-1),IF(bracing!$AF$13=bracing!$AF$11,INDEX(bracing!$F$25:$O$25,1,AI19-1),INDEX(bracing!$F$25:$O$25,1,AI19)))),0)","v":0},null,2,{"$f":"$AN$10","v":-1.5},{"$f":"IF(AM19<=bracing!$AF$32,INDEX(bracing!$F$25:$O$25,1,AM19),4)","v":8},null,0,{"$f":"$AR$16-$AR$9","v":5.833333333333333},0,null,null,{"$f":"$AV$16-$AR$9","v":9.0833333333333339},0]
[1,2,"90 x 90 x 12",12,15.9,11,5.5,20.3,2.66,148,235,62,2.7,3.4,1.75,23.4,10.46,2.17,null,null,null,null,null,null,null,null,null,{"$f":"AB19","v":3},{"$f":"AC17","v":20},null,null,{"$f":"IF($AE19<=bracing!$AF$32,IF(bracing!$AF$13=bracing!$AF$9,3,IF(bracing!$AF$13=bracing!$AF$10,3,IF(bracing!$AF$13=bracing!$AF$11,3,INDEX(bracing!$F$23:$O$23,1,AE19)))),0)","v":3},{"$f":"IF($AE19<=bracing!$AF$32,IF(bracing!$AF$13=bracing!$AF$9,INDEX(bracing!$F$25:$O$25,1,AE19-1),IF(bracing!$AF$13=bracing!$AF$10,INDEX(bracing!$F$25:$O$25,1,AE19-1),IF(bracing!$AF$13=bracing!$AF$11,INDEX(bracing!$F$25:$O$25,1,AE19-1)+INDEX(bracing!$F$23:$O$23,1,AE19),INDEX(bracing!$F$25:$O$25,1,AE19)))),0)","v":4},null,null,{"$f":"IF($AI19<=bracing!$AF$32,IF(bracing!$AF$13=bracing!$AF$9,0,IF(bracing!$AF$13=bracing!$AF$10,3,IF(bracing!$AF$13=bracing!$AF$11,3,3))),0)","v":0},{"$f":"IF($AI19<=bracing!$AF$32,IF(bracing!$AF$13=bracing!$AF$9,0,IF(bracing!$AF$13=bracing!$AF$10,INDEX(bracing!$F$25:$O$25,1,AI19),IF(bracing!$AF$13=bracing!$AF$11,INDEX(bracing!$F$25:$O$25,1,AI19-1)+INDEX(bracing!$F$23:$O$23,1,AI19),INDEX(bracing!$F$25:$O$25,1,AI19-1)))),0)","v":0},null,null,{"$f":"$AN$10+$AN$11","v":-0.5},{"$f":"AO19","v":8},null,null,{"$f":"$AR$16+$AR$9","v":6.666666666666667},0,null,null,{"$f":"$AV$16+$AR$9","v":9.9166666666666661},0,null,1,{"$f":"IF(AY20<=bracing!$AF$32,INDEX(bracing!$F$21:$O$21,1,AY20)&\"m\",\"\")","v":"4m"},{"$f":"AR16-$AR$10","v":5.4333333333333336},{"$f":"IF(AY20<=bracing!$AF$32,INDEX(bracing!$F$25:$O$25,1,AY20)-INDEX(bracing!$F$21:$O$21,1,AY20)/2,0)","v":2}]
{"$rows_left_out":1205}
{"sheet":"from author","index":2,"n_rows":41,"n_cols":7,"rows_kept":41,"cut":false,"hidden":false,"merged":[[4,12,4,13],[6,2,9,9],[12,2,29,9],[33,2,36,9],[40,2,43,9],[0,1,0,5],[0,6,0,10],[2,2,2,5],[2,6,2,9],[3,2,3,5],[3,6,3,9]]}
[null,"Version: 1.0. - FREE LITE VERSION",null,null,null,null,"© 2016 Damian Janicki"]
[]
[null,null,"For latest updates and news visit:",null,null,null,"Contact me at:"]
[null,null,"www.YourSpreadsheets.co.uk",null,null,null,"info@yourspreadsheets.co.uk"]
[]
[]
[null,null,"General information:\nNote: This spreadsheet contains macros."]
[]
[]
[]
[]
[]
[null,null,"The Author takes no liability for use of this spreadsheet and gives no guarantee that it is error free. \n\nIn no event shall the Author be responsible for any special, incidental or consequential damages whatsoever arising from the use of this spreadsheet, even if the Author has been advised of the possibility of such damage.\n\nThis spreadsheet is a freeware and can be distributed freely but only in its original form.\n\nReverse-engineering, decompiling or disassembling of this spreadsheet is not allowable.\n\nBy using this spreadsheet you understand and agree with the above terms and conditions. You also acknowledge that you do not become the owner of this spreadsheet.\n\nDamian Janicki"]
[]
[]
[]
[]
[]
[]
[]
{"$rows_left_out":21}